harmony-alerts mailing list archives

Site index · List index
Message view « Date » · « Thread »
Top « Date » · « Thread »
From nom...@intel.com
Subject [build-test alert] BUILD FAILED Linux x86: jedit_test
Date Tue, 24 Jul 2007 06:28:05 GMT
BUILD FAILED:
	Ant Error Message:
/export/users/cc/cc-suites/scripts/cc-exec-adaptor.xml:101: The following error occurred while
executing this line: /export/users/cc/cc-suites/adaptors/jedit_test/adaptor.xml:122: Some
of JEdit tests failed.

Date of build:	07/24/2007 13:27:25
Time to build:	35 seconds

***********************************************************
Errors/Warnings:	(16)
            
Java Result: 1
Java Result: 1
[junit] Test org.apache.harmony.guitests.JEditLaunchTest FAILED
BUILD FAILED
/export/users/cc/cc-suites/tests/jedit_test/build.xml:118: if=test.not.passed
Total time: 14 seconds
[junit] Test org.apache.harmony.guitests.JEditFunctionalTest FAILED
BUILD FAILED
/export/users/cc/cc-suites/tests/jedit_test/build.xml:122: if=test.not.passed
Total time: 8 seconds
[junit] Test org.apache.harmony.guitests.JEditStressTest FAILED
BUILD FAILED
/export/users/cc/cc-suites/tests/jedit_test/build.xml:126: if=test.not.passed
Total time: 9 seconds
The execution FAILED with the following exception:
The following error occurred while executing this line:
/export/users/cc/cc-suites/adaptors/jedit_test/adaptor.xml:122: Some of JEdit tests failed.

***********************************************************
Unit Tests: (3)
        
error: /export/users/cc/cc-suites/tests/jedit_test/scripts/jedit_fn_00.xml org.apache.harmony.guitests.JEditFunctionalTest
error: /export/users/cc/cc-suites/tests/jedit_test/scripts/jedit_ln_00.xml org.apache.harmony.guitests.JEditLaunchTest
error: test org.apache.harmony.guitests.JEditStressTest
Unit Test Error Details:	(3)
                
Test: /export/users/cc/cc-suites/tests/jedit_test/scripts/jedit_fn_00.xmlClass: org.apache.harmony.guitests.JEditFunctionalTestjava.lang.NoSuchMethodError:
java/awt/Toolkit.getEventMonitor()Ljava/lang/Object; while resolving constant pool entry at
index 107 in class java/awt/EventQueueCore
	at java.awt.EventQueueCore.postEvent(EventQueueCore.java:91)
	at java.awt.EventQueue.postEvent(EventQueue.java:116)
	at java.awt.EventQueue.invokeAndWait(EventQueue.java:67)
	at abbot.util.AWT.invokeAndWait(AWT.java:96)
	at abbot.script.AppClassLoader$AppEventQueue.install(AppClassLoader.java:235)
	at abbot.script.AppClassLoader.install(AppClassLoader.java:185)
	at abbot.script.Launch.install(Launch.java:112)
	at abbot.script.Launch.runStep(Launch.java:180)
	at abbot.script.Step.run(Step.java:92)
	at abbot.script.StepRunner.runStep(StepRunner.java:277)
	at abbot.script.Sequence.runStep(Sequence.java:110)
	at abbot.script.Script.runStep(Script.java:499)
	at abbot.script.StepRunner.runStep(StepRunner.java:274)
	at abbot.script.StepRunner.run(StepRunner.java:194)
	at junit.extensions.abbot.ScriptFixture.runTest(ScriptFixture.java:60)
Test: /export/users/cc/cc-suites/tests/jedit_test/scripts/jedit_ln_00.xmlClass: org.apache.harmony.guitests.JEditLaunchTestjava.util.NoSuchElementException
	at java.util.LinkedList.getLast(LinkedList.java:476)
	at java.awt.EventQueueCore.pop(EventQueueCore.java:215)
	at java.awt.EventQueue.pop(EventQueue.java:140)
	at abbot.script.AppClassLoader$AppEventQueue.uninstall(AppClassLoader.java:250)
	at abbot.script.AppClassLoader.uninstall(AppClassLoader.java:206)
	at abbot.script.Launch.terminate(Launch.java:153)
	at abbot.script.StepRunner.terminate(StepRunner.java:341)
	at abbot.script.StepRunner.run(StepRunner.java:209)
	at junit.extensions.abbot.ScriptFixture.runTest(ScriptFixture.java:60)
Test: testClass: org.apache.harmony.guitests.JEditStressTestjava.util.NoSuchElementException
	at java.util.LinkedList.getLast(LinkedList.java:476)
	at java.awt.EventQueueCore.pop(EventQueueCore.java:215)
	at java.awt.EventQueue.pop(EventQueue.java:140)
	at abbot.script.AppClassLoader$AppEventQueue.uninstall(AppClassLoader.java:250)
	at abbot.script.AppClassLoader.uninstall(AppClassLoader.java:206)
	at abbot.script.Launch.terminate(Launch.java:153)
	at abbot.script.Fixture.terminate(Fixture.java:61)
	at abbot.script.StepRunner.terminate(StepRunner.java:341)
	at abbot.script.StepRunner.run(StepRunner.java:209)
	at junit.extensions.abbot.ScriptFixture.runTest(ScriptFixture.java:60)
	at org.apache.harmony.guitests.JEditStressTest$RepeatableScript.runTest(Unknown Source)
	at org.apache.harmony.guitests.JEditStressTest.test(Unknown Source)
	at java.lang.reflect.VMReflection.invokeMethod(VMReflection.java)

***********************************************************
Modifications since last successful build:	(0)
            

begin 644 execution_log.zip
M4$L#! H    ( (!K^#819:-7< 0  " =   2    97AE8W5T:6]N7VQO9RYH
M=&UL[5E;;^(X%'[>_HKSLIJ.U"3 T M9IM+LM%U-U=F':?NP&B%DD@-Q<>RL
M[;2POWZ/#;W0)2E%PZ@K@1 8^_@[QSZW3Z&;V5P<=P<JG1YW"XW'70;&3@5^
M?#=4T@:&_X,Q'#5^_>W=\8XN9;P#[O7]AMVR'OQ><I$.N2"1@1N&DUPL""S\
M" S:H-!J,HUKA(9HDRQ(L4"9FCI!+HUE0@0WF'*[LF!0B')$,ZML4)J3*!,!
M&PQ4K8J".:-7ET]47M"US?9A^O*&&Z97%[ZW?V7!%6Y[;G&8,9TK.0V],34;
MR-=E40=HV"W.74*RELO1ZMYV452@MAR?[?'#?)QRW8//&IG%%.A'#)$<FH@P
MHDSE& DV2+7H_\VBT.-5ZTT$,AEJ+)2N#P 281H#9!0'_\F3:K-PXI"CTJ V
M49+0.S EMV@BGU 1.3P9J]*:R!O:IQ4;W2D]IOO:I(K9B6L.3&<,!"OE\R"8
M#4O);0^^E5*2G:#T*&0%W<QC^(R\!=:$YZ>D\\(#7=%$)=95AO#'9SI2"E)9
MH "XY2G"*.FS-.W?(1OWM5*V3['41VGU=/=]-9;3#,Y+T-R#,\9%J2F2H+$'
MIUHK;?S\%<\14+#"8!I#*SPX/*"H3BI1KV7"RE%F 2<)%I8K"5Q"SOBR8)CO
M\1D:GDZX/;W?%,.GHA \81X!:0E2E)S<N=MZ#S1UE9%[T^\.>&]_SWWU*O%_
M87:NXT_EM%QB4FINIU^99"/4H?>]6]A=ONX0XW:C^BJ= C<;"B9'(3G<TJV%
MSNK=^Q\SC/WVJB"74V,QGV',QQZBV7C!CB=A9I42)F32AI:9<8I#$RI_NTR$
M?D=X?DV?+A!<D-))W3WN/I_T>O</F_6A])KXAK-/7RY.3VH2:X2DF=(W6%9T
M9FIG*Z1<,VF&2N?@+CJ&3J>3FVKH9>FZV,ZOOUR<++.PIH;X4SZM' ]$(&XV
MCV+@PX]N.J2DI9YA*)>J]5\I*O'SLS3;+MD4=:4%D7/ZA&]H2F%)9KZ4J&)*
M58\^7;5I@F,D8-7+I4][H 7S6XW&84#O5KO?_- ZW-*=+=WY.71G-L[5+?;@
M*S6WQ4BNI2_A@"7CLE@"ATFF>O"7*C407S*N_L&-JTAP;P1D9!@,$"4X%&HS
M94%]JQ+KZ>OU5KUQ3N=&*0JTY(,3]^V\0+HPL4I/-T6E7N2./]ZFG\ @WPI)
M'5+3FW7^'T!4SQ[ WCA9/6K5<M75:,OB:3=*70Y:[3KJ4N7$C=*75FM]^G*T
M92_5I7[+7I;8__]F+VLV]MK.MGI[]\,M1=A2A/4H@J&V9):QSM?2@TL/]*:I
M03/L-#K;YUC;YUCK$,+'^-XP&:Q]CK4L73=+! _6)X*=MT0$%S5\\!K,NBH$
MHS*WX^H93BC=?)K/[ASNN,W TLI0":'NG+*'8A+[+4\67*4"E5#":BH.=YD[
M]1R1EFW&#0@N,=ZI,9*EK*!>MV#??.Z1RU\2!P U!!_*X!T.0RJ:F(8[W8@=
M=R/_!V@T^S,T\O^,_@M02P$"% ,*    " " :_@V$66C5W $   @'0  $@  
M            I($     97AE8W5T:6]N7VQO9RYH=&UL4$L%!@     !  $ 
*0    * $      $! 
end

Mime
View raw message