harmony-alerts mailing list archives

Site index · List index
Message view « Date » · « Thread »
Top « Date » · « Thread »
From nom...@intel.com
Subject [build-test alert] BUILD FAILED Linux x86_64: classlib-gui-test
Date Mon, 23 Jul 2007 09:11:10 GMT
BUILD FAILED:
	Ant Error Message:
/export/users/cc/cc-common/scripts/cc-exec-adaptor.xml:101: The following error occurred while
executing this line: /export/users/cc/cc-common/adaptors/classlib-gui-test/adaptor.xml:70:
/export/users/cc/cc-common/build/checkouts/hdk/working_classlib/build/test_report not found.

Date of build:	07/23/2007 16:10:29
Time to build:	1 second

***********************************************************
Errors/Warnings:	(3)
            
Build failed
The execution FAILED with the following exception:
The following error occurred while executing this line:
/export/users/cc/cc-common/adaptors/classlib-gui-test/adaptor.xml:70: /export/users/cc/cc-common/build/checkouts/hdk/working_classlib/build/test_report
not found.

***********************************************************
Unit Tests: (0)
        
No Tests Run: This project doesn't have any tests

***********************************************************
Modifications since last successful build:	(0)
            

begin 644 execution_log.zip
M4$L#! H    ( &.!]S;D3'Y:%0$  +X!   2    97AE8W5T:6]N7VQO9RYH
M=&UL?5%-2\0P$+WW5XP'V5,WZTFIM:"HH'@2;R*23::;N&FF)!.[ZZ\WJ2XH
M@B&$,.\CDWFMX<%U[9KTOFO'@%TK(?+>X<6B)\]UM!_8P-GJ^'S152'YIH*R
MGM_DNWR!JV2=[JW+E'6Y+G># TT8P1,#[FSDH[\"Z&66Z%_ ?3[A$6-RW,!)
M53T9S'I4B2UYN+V\>[BYALFR <Y(3\[19/TF<Q2.A=/,DA] "!2 E$HAH(;)
MY"</CAEF8R,XZ[&I!.Y&"BQ2Q!"%4GG7BH:!O)!:CDREZF2,SJ[K3;(U8^0#
M5'[<G*X:^,=E'HU0!M66$D=A]%9,%+:YC]>#\3>I6+\&+$[S"'M*7B^K5LBN
M%7,\XBLJ,>?V"5!+ 0(4 PH    ( &.!]S;D3'Y:%0$  +X!   2        
M      "D@0    !E>&5C=71I;VY?;&]G+FAT;6Q02P4&      $  0!     
&10$      
end

Mime
View raw message