harmony-alerts mailing list archives

Site index · List index
Message view « Date » · « Thread »
Top « Date » · « Thread »
From nom...@intel.com
Subject [build-test alert] BUILD FAILED Linux x86: stress
Date Sat, 21 Jul 2007 03:03:11 GMT
BUILD FAILED:
	Ant Error Message:
/export/users/cc/cc-suites/scripts/cc-exec-adaptor.xml:101: The following error occurred while executing this line: /export/users/cc/cc-suites/adaptors/stress/adaptor.xml:100: The following error occurred while executing this line: /export/users/cc/cc-suites/adaptors/stress/adaptor.xml:116: The following error occurred while executing this line: /export/users/cc/cc-suites/scripts/framework.xml:1069: Java returned: 137

Date of build:	07/21/2007 06:16:31
Time to build:	220 minutes 24 seconds
Last changed:	07/20/2007 15:25:01
Last log entry:	snapshot

***********************************************************
Errors/Warnings:	(1)
            
The execution FAILED with the following exception:
The following error occurred while executing this line:
/export/users/cc/cc-suites/adaptors/stress/adaptor.xml:100: The following error occurred while executing this line:
/export/users/cc/cc-suites/adaptors/stress/adaptor.xml:116: The following error occurred while executing this line:
/export/users/cc/cc-suites/scripts/framework.xml:1069: Java returned: 137

***********************************************************
Unit Tests: (192)
        
error: test stress.org.apache.harmony.test.stress.api.java.io.stress.readers.PipedReader.PipedReaderWriterStressTest
error: test stress.org.apache.harmony.test.stress.classloader.MixThreads.ConstantPool.testCPLmt1
error: test stress.org.apache.harmony.test.stress.classloader.MixThreads.ConstantPool.testCPLmt2
error: test stress.org.apache.harmony.test.stress.classloader.MixThreads.FieldsLmt.testFieldsLmt1
error: test stress.org.apache.harmony.test.stress.classloader.MixThreads.FieldsLmt.testFieldsLmt2
error: test stress.org.apache.harmony.test.stress.classloader.MixThreads.LargeClassName.testLargeClassName_R1
error: test stress.org.apache.harmony.test.stress.classloader.MixThreads.LargeClassName.testLargeClassName_W1
error: test stress.org.apache.harmony.test.stress.classloader.MixThreads.LargeClassName.testLargeClassName_W2
error: test stress.org.apache.harmony.test.stress.classloader.MixThreads.MethodNameLmt.testMethodNameLmt2
error: test stress.org.apache.harmony.test.stress.classloader.MixThreads.WrongClasses.testNECLoad1
error: test stress.org.apache.harmony.test.stress.classloader.MixThreads.WrongClasses.testNECLoad2
error: test stress.org.apache.harmony.test.stress.classloader.MixThreads.WrongClasses.testWCLoad1
error: test stress.org.apache.harmony.test.stress.classloader.MixThreads.WrongClasses.testWCLoad2
error: test stress.org.apache.harmony.test.stress.classloader.NotSynchThreads.ConstantPool.testCPLmt
error: test stress.org.apache.harmony.test.stress.classloader.NotSynchThreads.LargeClassName.testLargeClassName_R1
error: test stress.org.apache.harmony.test.stress.classloader.NotSynchThreads.SupIntf.testManySupIntf1
error: test stress.org.apache.harmony.test.stress.classloader.NotSynchThreads.SupIntf.testManySupIntf2
error: test stress.org.apache.harmony.test.stress.classloader.NotSynchThreads.WrongClasses.testWCLoad
error: test stress.org.apache.harmony.test.stress.classloader.OneThread.MethodArgs.testMethodArgs
error: test stress.org.apache.harmony.test.stress.classloader.OneThread.MethodNameLmt.testMethodNameLmt
error: test stress.org.apache.harmony.test.stress.classloader.OneThread.SubClasses.testManySubClasses
error: test stress.org.apache.harmony.test.stress.classloader.OneThread.SupIntf.testManySupIntf1
error: test stress.org.apache.harmony.test.stress.classloader.OneThread.WrongClasses.testWCLoad
error: test stress.org.apache.harmony.test.stress.classloader.SynchThreads.ConstantPool.testCPLmt1
error: test stress.org.apache.harmony.test.stress.classloader.SynchThreads.ConstantPool.testCPLmt2
error: test stress.org.apache.harmony.test.stress.classloader.SynchThreads.FieldsLmt.testFieldsLmt1
error: test stress.org.apache.harmony.test.stress.classloader.SynchThreads.FieldsLmt.testFieldsLmt2
error: test stress.org.apache.harmony.test.stress.classloader.SynchThreads.LargeClassName.testLargeClassName_R1
error: test stress.org.apache.harmony.test.stress.classloader.SynchThreads.LargeClassName.testLargeClassName_W1
error: test stress.org.apache.harmony.test.stress.classloader.SynchThreads.MethodArgs.testMethodArgs1
error: test stress.org.apache.harmony.test.stress.classloader.SynchThreads.MethodNameLmt.testMethodNameLmt1
error: test stress.org.apache.harmony.test.stress.classloader.SynchThreads.MethodNameLmt.testMethodNameLmt2
error: test stress.org.apache.harmony.test.stress.classloader.SynchThreads.SupIntf.testManySupIntf1
error: test stress.org.apache.harmony.test.stress.classloader.SynchThreads.SupIntf.testManySupIntf2
error: test stress.org.apache.harmony.test.stress.classloader.SynchThreads.SupIntf.testManySupIntf3
error: test stress.org.apache.harmony.test.stress.classloader.SynchThreads.SupIntf.testManySupIntf4
error: test stress.org.apache.harmony.test.stress.classloader.SynchThreads.WrongClasses.testNECLoad1
error: test stress.org.apache.harmony.test.stress.classloader.SynchThreads.WrongClasses.testNECLoad2
error: test stress.org.apache.harmony.test.stress.classloader.SynchThreads.WrongClasses.testWCLoad1
error: test stress.org.apache.harmony.test.stress.classloader.SynchThreads.WrongClasses.testWCLoad2
error: test stress.org.apache.harmony.test.stress.gc.frag.FragmentationGCFinalizeTest3.FragmentationGCFinalizeTest3
error: test stress.org.apache.harmony.test.stress.gc.frag.FragmentationSimpleTest2.FragmentationSimpleTest2
error: test stress.org.apache.harmony.test.stress.gc.frag.FragmentationSimpleTest6.FragmentationSimpleTest6
error: test stress.org.apache.harmony.test.stress.gc.frag.FragmentationSoftRefTest1.FragmentationSoftRefTest1
error: test stress.org.apache.harmony.test.stress.gc.frag.FragmentationTest2.FragmentationTest2
error: test stress.org.apache.harmony.test.stress.jni.stack.StackTest12
error: test stress.org.apache.harmony.test.stress.jni.stack.StackTest14
error: test stress.org.apache.harmony.test.stress.jni.stack.StackTest3
error: test stress.org.apache.harmony.test.stress.jni.stack.StackTest4
error: test stress.org.apache.harmony.test.stress.jni.stack.StackTest6
error: test stress.org.apache.harmony.test.stress.jni.strings.StringsTest1
error: test stress.org.apache.harmony.test.stress.jni.strings.StringsTest2
error: test stress.org.apache.harmony.test.stress.jni.strings.StringsTest3
error: test stress.org.apache.harmony.test.stress.jpda.jdwp.scenario.FRAME002.FrameTest002
error: test stress.org.apache.harmony.test.stress.jpda.jdwp.scenario.MEMORY001.MemoryTest001
error: test stress.org.apache.harmony.test.stress.jpda.jdwp.scenario.MEMORY006.MemoryTest006
error: test stress.org.apache.harmony.test.stress.jpda.jdwp.scenario.MIXED001.MixedTest001
error: test stress.org.apache.harmony.test.stress.jpda.jdwp.scenario.OBJECT008.ObjectTest008
error: test stress.org.apache.harmony.test.stress.jpda.jdwp.scenario.OBJECT009.ObjectTest009
error: test stress.org.apache.harmony.test.stress.jpda.jdwp.scenario.THREAD002.ThreadTest002
error: test stress.org.apache.harmony.test.stress.jpda.jdwp.scenario.THREAD004.ThreadTest004
error: test stress.org.apache.harmony.test.stress.jpda.jdwp.scenario.THREAD008.ThreadTest008
error: test stress.org.apache.harmony.test.stress.jpda.jdwp.scenario.THREAD010.ThreadTest010
error: test stress.org.apache.harmony.test.stress.misc.WaitNotifyTest
error: test stress.org.apache.harmony.test.stress.threads.StressThreads12Test.StressThreads12Test
Unit Test Error Details:	(65)
                
Test: testClass: stress.org.apache.harmony.test.stress.api.java.io.stress.readers.PipedReader.PipedReaderWriterStressTestTestHarness:ExecUnit	runProc(): Timeout!!!. The test hung (not finished in 180 second).

java version "1.5.0" 
pre-alpha : not complete or compatible
svn = r557495, (Jul 20 2007), Linux/ia32/gcc 3.3.3, release build
http://harmony.apache.org
07:20:10| Test: class org.apache.harmony.test.stress.api.java.io.stress.readers.PipedReader.PipedTest
		test case(s) to run 2
The GC did not provide gc_add_weak_root_set_entry()
07:21:33| Testcase: @testBigObj	result is: PASSED(104)

Apache Harmony Launcher : (c) Copyright 1991, 2006 The Apache Software Foundation or its licensors, as applicable.
Test: testClass: stress.org.apache.harmony.test.stress.classloader.MixThreads.ConstantPool.testCPLmt1java version "1.5.0" 
pre-alpha : not complete or compatible
svn = r557495, (Jul 20 2007), Linux/ia32/gcc 3.3.3, release build
http://harmony.apache.org
The GC did not provide gc_add_weak_root_set_entry()

Apache Harmony Launcher : (c) Copyright 1991, 2006 The Apache Software Foundation or its licensors, as applicable.
[debug] started null(org.apache.harmony.test.share.stress.ReliabilityRunner)
[debug] timeToWork = 30, timeToAbort = 30
[debug] started null(org.apache.harmony.test.share.stress.generator.Thread)
[debug] Thread.setContext  { org.apache.harmony.test.stress.classloader.MixThreads.ConstantPool.testCPLmt {} }
[debug] Starting 1 threads
[debug] ThreadToRun.run()
[debug] completed null(org.apache.harmony.test.share.stress.generator.Thread)
[debug] Generator.execute()
[debug] class = org.apache.harmony.test.stress.classloader.MixThreads.ConstantPool.testCPLmt
[debug] org.apache.harmony.test.stress.classloader.MixThreads.ConstantPool.testCPLmt { }
[debug] started test(or...
Test: testClass: stress.org.apache.harmony.test.stress.classloader.MixThreads.ConstantPool.testCPLmt2java version "1.5.0" 
pre-alpha : not complete or compatible
svn = r557495, (Jul 20 2007), Linux/ia32/gcc 3.3.3, release build
http://harmony.apache.org
The GC did not provide gc_add_weak_root_set_entry()

Apache Harmony Launcher : (c) Copyright 1991, 2006 The Apache Software Foundation or its licensors, as applicable.
[debug] started null(org.apache.harmony.test.share.stress.ReliabilityRunner)
[debug] timeToWork = 30, timeToAbort = 30
[debug] started null(org.apache.harmony.test.share.stress.generator.Thread)
[debug] Thread.setContext  { org.apache.harmony.test.stress.classloader.MixThreads.ConstantPool.testCPLmt {} }
[debug] Starting 1 threads
[debug] ThreadToRun.run()
[debug] completed null(org.apache.harmony.test.share.stress.generator.Thread)
[debug] Generator.execute()
[debug] class = org.apache.harmony.test.stress.classloader.MixThreads.ConstantPool.testCPLmt
[debug] org.apache.harmony.test.stress.classloader.MixThreads.ConstantPool.testCPLmt { }
[debug] started test(or...
Test: testClass: stress.org.apache.harmony.test.stress.classloader.MixThreads.FieldsLmt.testFieldsLmt1java version "1.5.0" 
pre-alpha : not complete or compatible
svn = r557495, (Jul 20 2007), Linux/ia32/gcc 3.3.3, release build
http://harmony.apache.org
The GC did not provide gc_add_weak_root_set_entry()

Apache Harmony Launcher : (c) Copyright 1991, 2006 The Apache Software Foundation or its licensors, as applicable.
[debug] started null(org.apache.harmony.test.share.stress.ReliabilityRunner)
[debug] timeToWork = 30, timeToAbort = 30
[debug] started null(org.apache.harmony.test.share.stress.generator.Thread)
[debug] Thread.setContext  { org.apache.harmony.test.stress.classloader.MixThreads.FieldsLmt.testFieldsLmt {} }
[debug] Starting 1 threads
[debug] ThreadToRun.run()
[debug] Generator.execute()
[debug] class = org.apache.harmony.test.stress.classloader.MixThreads.FieldsLmt.testFieldsLmt
[debug] completed null(org.apache.harmony.test.share.stress.generator.Thread)
[debug] org.apache.harmony.test.stress.classloader.MixThreads.FieldsLmt.testFieldsLmt { }
[debug] started test...
Test: testClass: stress.org.apache.harmony.test.stress.classloader.MixThreads.FieldsLmt.testFieldsLmt2java version "1.5.0" 
pre-alpha : not complete or compatible
svn = r557495, (Jul 20 2007), Linux/ia32/gcc 3.3.3, release build
http://harmony.apache.org
The GC did not provide gc_add_weak_root_set_entry()

Apache Harmony Launcher : (c) Copyright 1991, 2006 The Apache Software Foundation or its licensors, as applicable.
[debug] started null(org.apache.harmony.test.share.stress.ReliabilityRunner)
[debug] timeToWork = 30, timeToAbort = 30
[debug] started null(org.apache.harmony.test.share.stress.generator.Thread)
[debug] Thread.setContext  { org.apache.harmony.test.stress.classloader.MixThreads.FieldsLmt.testFieldsLmt {} }
[debug] Starting 1 threads
[debug] ThreadToRun.run()
[debug] completed null(org.apache.harmony.test.share.stress.generator.Thread)
[debug] Generator.execute()
[debug] class = org.apache.harmony.test.stress.classloader.MixThreads.FieldsLmt.testFieldsLmt
[debug] org.apache.harmony.test.stress.classloader.MixThreads.FieldsLmt.testFieldsLmt { }
[debug] started test...
Test: testClass: stress.org.apache.harmony.test.stress.classloader.MixThreads.LargeClassName.testLargeClassName_R1java version "1.5.0" 
pre-alpha : not complete or compatible
svn = r557495, (Jul 20 2007), Linux/ia32/gcc 3.3.3, release build
http://harmony.apache.org
The GC did not provide gc_add_weak_root_set_entry()

Apache Harmony Launcher : (c) Copyright 1991, 2006 The Apache Software Foundation or its licensors, as applicable.
[debug] started null(org.apache.harmony.test.share.stress.ReliabilityRunner)
[debug] timeToWork = 30, timeToAbort = 30
[debug] started null(org.apache.harmony.test.share.stress.generator.Thread)
[debug] Thread.setContext  { org.apache.harmony.test.stress.classloader.MixThreads.LargeClassName.testLCN {} }
[debug] Starting 1 threads
[debug] ThreadToRun.run()
[debug] completed null(org.apache.harmony.test.share.stress.generator.Thread)
[debug] Generator.execute()
[debug] class = org.apache.harmony.test.stress.classloader.MixThreads.LargeClassName.testLCN
[debug] org.apache.harmony.test.stress.classloader.MixThreads.LargeClassName.testLCN { }
[debug] started test(or...
Test: testClass: stress.org.apache.harmony.test.stress.classloader.MixThreads.LargeClassName.testLargeClassName_W1java version "1.5.0" 
pre-alpha : not complete or compatible
svn = r557495, (Jul 20 2007), Linux/ia32/gcc 3.3.3, release build
http://harmony.apache.org
The GC did not provide gc_add_weak_root_set_entry()

Apache Harmony Launcher : (c) Copyright 1991, 2006 The Apache Software Foundation or its licensors, as applicable.
[debug] started null(org.apache.harmony.test.share.stress.ReliabilityRunner)
[debug] timeToWork = 30, timeToAbort = 30
[debug] started null(org.apache.harmony.test.share.stress.generator.Thread)
[debug] Thread.setContext  { org.apache.harmony.test.stress.classloader.MixThreads.LargeClassName.testLCN {} }
[debug] Starting 1 threads
[debug] ThreadToRun.run()
[debug] Generator.execute()
[debug] class = org.apache.harmony.test.stress.classloader.MixThreads.LargeClassName.testLCN
[debug] org.apache.harmony.test.stress.classloader.MixThreads.LargeClassName.testLCN { }
[debug] started test(org.apache.harmony.test.stress.classloader.MixThreads.LargeClassName.testLCN)
[d...
Test: testClass: stress.org.apache.harmony.test.stress.classloader.MixThreads.LargeClassName.testLargeClassName_W2java version "1.5.0" 
pre-alpha : not complete or compatible
svn = r557495, (Jul 20 2007), Linux/ia32/gcc 3.3.3, release build
http://harmony.apache.org
The GC did not provide gc_add_weak_root_set_entry()

Apache Harmony Launcher : (c) Copyright 1991, 2006 The Apache Software Foundation or its licensors, as applicable.
[debug] started null(org.apache.harmony.test.share.stress.ReliabilityRunner)
[debug] timeToWork = 30, timeToAbort = 30
[debug] started null(org.apache.harmony.test.share.stress.generator.Thread)
[debug] Thread.setContext  { org.apache.harmony.test.stress.classloader.MixThreads.LargeClassName.testLCN {} }
[debug] Starting 1 threads
[debug] ThreadToRun.run()
[debug] completed null(org.apache.harmony.test.share.stress.generator.Thread)
[debug] Generator.execute()
[debug] class = org.apache.harmony.test.stress.classloader.MixThreads.LargeClassName.testLCN
[debug] org.apache.harmony.test.stress.classloader.MixThreads.LargeClassName.testLCN { }
[debug] started test(or...
Test: testClass: stress.org.apache.harmony.test.stress.classloader.MixThreads.MethodNameLmt.testMethodNameLmt2java version "1.5.0" 
pre-alpha : not complete or compatible
svn = r557495, (Jul 20 2007), Linux/ia32/gcc 3.3.3, release build
http://harmony.apache.org
The GC did not provide gc_add_weak_root_set_entry()

Apache Harmony Launcher : (c) Copyright 1991, 2006 The Apache Software Foundation or its licensors, as applicable.
[debug] started null(org.apache.harmony.test.share.stress.ReliabilityRunner)
[debug] timeToWork = 30, timeToAbort = 30
[debug] started null(org.apache.harmony.test.share.stress.generator.Thread)
[debug] Thread.setContext  { org.apache.harmony.test.stress.classloader.MixThreads.MethodNameLmt.testMethodNameLmt {} }
[debug] Starting 1 threads
[debug] ThreadToRun.run()
[debug] Generator.execute()
[debug] class = org.apache.harmony.test.stress.classloader.MixThreads.MethodNameLmt.testMethodNameLmt
[debug] completed null(org.apache.harmony.test.share.stress.generator.Thread)
[debug] org.apache.harmony.test.stress.classloader.MixThreads.MethodNameLmt.testMethodNameLmt ...
Test: testClass: stress.org.apache.harmony.test.stress.classloader.MixThreads.WrongClasses.testNECLoad1java version "1.5.0" 
pre-alpha : not complete or compatible
svn = r557495, (Jul 20 2007), Linux/ia32/gcc 3.3.3, release build
http://harmony.apache.org
The GC did not provide gc_add_weak_root_set_entry()

Apache Harmony Launcher : (c) Copyright 1991, 2006 The Apache Software Foundation or its licensors, as applicable.
[debug] started null(org.apache.harmony.test.share.stress.ReliabilityRunner)
[debug] timeToWork = 30, timeToAbort = 30
[debug] started null(org.apache.harmony.test.share.stress.generator.Thread)
[debug] Thread.setContext  { org.apache.harmony.test.stress.classloader.MixThreads.WrongClasses.testNECLoad_MT {} }
[debug] Starting 1 threads
[debug] completed null(org.apache.harmony.test.share.stress.generator.Thread)
[debug] ThreadToRun.run()
[debug] Generator.execute()
[debug] class = org.apache.harmony.test.stress.classloader.MixThreads.WrongClasses.testNECLoad_MT
[debug] org.apache.harmony.test.stress.classloader.MixThreads.WrongClasses.testNECLoad_MT { }
[debug] ...
Test: testClass: stress.org.apache.harmony.test.stress.classloader.MixThreads.WrongClasses.testNECLoad2java version "1.5.0" 
pre-alpha : not complete or compatible
svn = r557495, (Jul 20 2007), Linux/ia32/gcc 3.3.3, release build
http://harmony.apache.org
The GC did not provide gc_add_weak_root_set_entry()

Apache Harmony Launcher : (c) Copyright 1991, 2006 The Apache Software Foundation or its licensors, as applicable.
[debug] started null(org.apache.harmony.test.share.stress.ReliabilityRunner)
[debug] timeToWork = 30, timeToAbort = 30
[debug] started null(org.apache.harmony.test.share.stress.generator.Thread)
[debug] Thread.setContext  { org.apache.harmony.test.stress.classloader.MixThreads.WrongClasses.testNECLoad_MT {} }
[debug] Starting 1 threads
[debug] ThreadToRun.run()
[debug] completed null(org.apache.harmony.test.share.stress.generator.Thread)
[debug] Generator.execute()
[debug] class = org.apache.harmony.test.stress.classloader.MixThreads.WrongClasses.testNECLoad_MT
[debug] org.apache.harmony.test.stress.classloader.MixThreads.WrongClasses.testNECLoad_MT { }
[debug] ...
Test: testClass: stress.org.apache.harmony.test.stress.classloader.MixThreads.WrongClasses.testWCLoad1java version "1.5.0" 
pre-alpha : not complete or compatible
svn = r557495, (Jul 20 2007), Linux/ia32/gcc 3.3.3, release build
http://harmony.apache.org
The GC did not provide gc_add_weak_root_set_entry()

Apache Harmony Launcher : (c) Copyright 1991, 2006 The Apache Software Foundation or its licensors, as applicable.
[debug] started null(org.apache.harmony.test.share.stress.ReliabilityRunner)
[debug] timeToWork = 30, timeToAbort = 30
[debug] started null(org.apache.harmony.test.share.stress.generator.Thread)
[debug] Thread.setContext  { org.apache.harmony.test.stress.classloader.MixThreads.WrongClasses.testWCLoad_MT {} }
[debug] Starting 1 threads
[debug] ThreadToRun.run()
[debug] completed null(org.apache.harmony.test.share.stress.generator.Thread)
[debug] Generator.execute()
[debug] class = org.apache.harmony.test.stress.classloader.MixThreads.WrongClasses.testWCLoad_MT
[debug] org.apache.harmony.test.stress.classloader.MixThreads.WrongClasses.testWCLoad_MT { }
[debug] sta...
Test: testClass: stress.org.apache.harmony.test.stress.classloader.MixThreads.WrongClasses.testWCLoad2java version "1.5.0" 
pre-alpha : not complete or compatible
svn = r557495, (Jul 20 2007), Linux/ia32/gcc 3.3.3, release build
http://harmony.apache.org
The GC did not provide gc_add_weak_root_set_entry()

Apache Harmony Launcher : (c) Copyright 1991, 2006 The Apache Software Foundation or its licensors, as applicable.
[debug] started null(org.apache.harmony.test.share.stress.ReliabilityRunner)
[debug] timeToWork = 30, timeToAbort = 30
[debug] started null(org.apache.harmony.test.share.stress.generator.Thread)
[debug] Thread.setContext  { org.apache.harmony.test.stress.classloader.MixThreads.WrongClasses.testWCLoad_MT {} }
[debug] Starting 1 threads
[debug] completed null(org.apache.harmony.test.share.stress.generator.Thread)
[debug] ThreadToRun.run()
[debug] Generator.execute()
[debug] class = org.apache.harmony.test.stress.classloader.MixThreads.WrongClasses.testWCLoad_MT
[debug] org.apache.harmony.test.stress.classloader.MixThreads.WrongClasses.testWCLoad_MT { }
[debug] sta...
Test: testClass: stress.org.apache.harmony.test.stress.classloader.NotSynchThreads.ConstantPool.testCPLmtjava version "1.5.0" 
pre-alpha : not complete or compatible
svn = r557495, (Jul 20 2007), Linux/ia32/gcc 3.3.3, release build
http://harmony.apache.org
The GC did not provide gc_add_weak_root_set_entry()

Apache Harmony Launcher : (c) Copyright 1991, 2006 The Apache Software Foundation or its licensors, as applicable.
[debug] started null(org.apache.harmony.test.share.stress.ReliabilityRunner)
[debug] timeToWork = 30, timeToAbort = 30
[debug] started null(org.apache.harmony.test.share.stress.generator.Thread)
[debug] Thread.setContext  { org.apache.harmony.test.stress.classloader.NotSynchThreads.ConstantPool.testCPLmt {} }
[debug] Starting 1 threads
[debug] ThreadToRun.run()
[debug] completed null(org.apache.harmony.test.share.stress.generator.Thread)
[debug] Generator.execute()
[debug] class = org.apache.harmony.test.stress.classloader.NotSynchThreads.ConstantPool.testCPLmt
[debug] org.apache.harmony.test.stress.classloader.NotSynchThreads.ConstantPool.testCPLmt { }
[debug] ...
Test: testClass: stress.org.apache.harmony.test.stress.classloader.NotSynchThreads.LargeClassName.testLargeClassName_R1java version "1.5.0" 
pre-alpha : not complete or compatible
svn = r557495, (Jul 20 2007), Linux/ia32/gcc 3.3.3, release build
http://harmony.apache.org
The GC did not provide gc_add_weak_root_set_entry()

Apache Harmony Launcher : (c) Copyright 1991, 2006 The Apache Software Foundation or its licensors, as applicable.
[debug] started null(org.apache.harmony.test.share.stress.ReliabilityRunner)
[debug] timeToWork = 30, timeToAbort = 30
[debug] started null(org.apache.harmony.test.share.stress.generator.Thread)
[debug] Thread.setContext  { org.apache.harmony.test.stress.classloader.NotSynchThreads.LargeClassName.testLCN {} }
[debug] Starting 1 threads
[debug] ThreadToRun.run()
[debug] Generator.execute()
[debug] class = org.apache.harmony.test.stress.classloader.NotSynchThreads.LargeClassName.testLCN
[debug] completed null(org.apache.harmony.test.share.stress.generator.Thread)
[debug] org.apache.harmony.test.stress.classloader.NotSynchThreads.LargeClassName.testLCN { }
[debug] ...
Test: testClass: stress.org.apache.harmony.test.stress.classloader.NotSynchThreads.SupIntf.testManySupIntf1java version "1.5.0" 
pre-alpha : not complete or compatible
svn = r557495, (Jul 20 2007), Linux/ia32/gcc 3.3.3, release build
http://harmony.apache.org
The GC did not provide gc_add_weak_root_set_entry()

Apache Harmony Launcher : (c) Copyright 1991, 2006 The Apache Software Foundation or its licensors, as applicable.
[debug] started null(org.apache.harmony.test.share.stress.ReliabilityRunner)
[debug] timeToWork = 30, timeToAbort = 30
[debug] started null(org.apache.harmony.test.share.stress.generator.Thread)
[debug] Thread.setContext  { org.apache.harmony.test.stress.classloader.NotSynchThreads.SupIntf.testManySupIntf1 {} }
[debug] Starting 1 threads
[debug] ThreadToRun.run()
[debug] Generator.execute()
[debug] class = org.apache.harmony.test.stress.classloader.NotSynchThreads.SupIntf.testManySupIntf1
[debug] org.apache.harmony.test.stress.classloader.NotSynchThreads.SupIntf.testManySupIntf1 { }
[debug] started test(org.apache.harmony.test.stress.classloader.NotSynchThreads....
Test: testClass: stress.org.apache.harmony.test.stress.classloader.NotSynchThreads.SupIntf.testManySupIntf2java version "1.5.0" 
pre-alpha : not complete or compatible
svn = r557495, (Jul 20 2007), Linux/ia32/gcc 3.3.3, release build
http://harmony.apache.org
The GC did not provide gc_add_weak_root_set_entry()

Apache Harmony Launcher : (c) Copyright 1991, 2006 The Apache Software Foundation or its licensors, as applicable.
[debug] started null(org.apache.harmony.test.share.stress.ReliabilityRunner)
[debug] timeToWork = 30, timeToAbort = 30
[debug] started null(org.apache.harmony.test.share.stress.generator.Thread)
[debug] Thread.setContext  { org.apache.harmony.test.stress.classloader.NotSynchThreads.SupIntf.testManySupIntf2 {} }
[debug] Starting 1 threads
[debug] ThreadToRun.run()
[debug] Generator.execute()
[debug] class = org.apache.harmony.test.stress.classloader.NotSynchThreads.SupIntf.testManySupIntf2
[debug] org.apache.harmony.test.stress.classloader.NotSynchThreads.SupIntf.testManySupIntf2 { }
[debug] started test(org.apache.harmony.test.stress.classloader.NotSynchThreads....
Test: testClass: stress.org.apache.harmony.test.stress.classloader.NotSynchThreads.WrongClasses.testWCLoadjava version "1.5.0" 
pre-alpha : not complete or compatible
svn = r557495, (Jul 20 2007), Linux/ia32/gcc 3.3.3, release build
http://harmony.apache.org
The GC did not provide gc_add_weak_root_set_entry()

Apache Harmony Launcher : (c) Copyright 1991, 2006 The Apache Software Foundation or its licensors, as applicable.
[debug] started null(org.apache.harmony.test.share.stress.ReliabilityRunner)
[debug] timeToWork = 30, timeToAbort = 30
[debug] started null(org.apache.harmony.test.share.stress.generator.Thread)
[debug] Thread.setContext  { org.apache.harmony.test.stress.classloader.NotSynchThreads.WrongClasses.testWCLoad_NST {} }
[debug] Starting 1 threads
[debug] ThreadToRun.run()
[debug] Generator.execute()
[debug] class = org.apache.harmony.test.stress.classloader.NotSynchThreads.WrongClasses.testWCLoad_NST
[debug] org.apache.harmony.test.stress.classloader.NotSynchThreads.WrongClasses.testWCLoad_NST { }
[debug] started test(org.apache.harmony.test.stress.classloader.NotSync...
Test: testClass: stress.org.apache.harmony.test.stress.classloader.OneThread.MethodArgs.testMethodArgsjava version "1.5.0" 
pre-alpha : not complete or compatible
svn = r557495, (Jul 20 2007), Linux/ia32/gcc 3.3.3, release build
http://harmony.apache.org
The GC did not provide gc_add_weak_root_set_entry()

Apache Harmony Launcher : (c) Copyright 1991, 2006 The Apache Software Foundation or its licensors, as applicable.
[debug] started null(org.apache.harmony.test.share.stress.ReliabilityRunner)
[debug] timeToWork = 30, timeToAbort = 30
[debug] started null(org.apache.harmony.test.share.stress.generator.Thread)
[debug] Thread.setContext  { org.apache.harmony.test.stress.classloader.share.MethodArgs.testMethodArgs_R {} }
[debug] Starting 1 threads
[debug] ThreadToRun.run()
[debug] Generator.execute()
[debug] class = org.apache.harmony.test.stress.classloader.share.MethodArgs.testMethodArgs_R
[debug] completed null(org.apache.harmony.test.share.stress.generator.Thread)
[debug] org.apache.harmony.test.stress.classloader.share.MethodArgs.testMethodArgs_R { }
[debug] started test(or...
Test: testClass: stress.org.apache.harmony.test.stress.classloader.OneThread.MethodNameLmt.testMethodNameLmtjava version "1.5.0" 
pre-alpha : not complete or compatible
svn = r557495, (Jul 20 2007), Linux/ia32/gcc 3.3.3, release build
http://harmony.apache.org
The GC did not provide gc_add_weak_root_set_entry()

Apache Harmony Launcher : (c) Copyright 1991, 2006 The Apache Software Foundation or its licensors, as applicable.
[debug] started null(org.apache.harmony.test.share.stress.ReliabilityRunner)
[debug] timeToWork = 30, timeToAbort = 30
[debug] started null(org.apache.harmony.test.share.stress.generator.Thread)
[debug] Thread.setContext  { org.apache.harmony.test.stress.classloader.OneThread.MethodNameLmt.testMethodNameLmt {} }
[debug] Starting 1 threads
[debug] ThreadToRun.run()
[debug] Generator.execute()
[debug] class = org.apache.harmony.test.stress.classloader.OneThread.MethodNameLmt.testMethodNameLmt
[debug] completed null(org.apache.harmony.test.share.stress.generator.Thread)
[debug] org.apache.harmony.test.stress.classloader.OneThread.MethodNameLmt.testMethodNameLmt { }...
Test: testClass: stress.org.apache.harmony.test.stress.classloader.OneThread.SubClasses.testManySubClassesjava version "1.5.0" 
pre-alpha : not complete or compatible
svn = r557495, (Jul 20 2007), Linux/ia32/gcc 3.3.3, release build
http://harmony.apache.org
The GC did not provide gc_add_weak_root_set_entry()

Apache Harmony Launcher : (c) Copyright 1991, 2006 The Apache Software Foundation or its licensors, as applicable.
[debug] started null(org.apache.harmony.test.share.stress.ReliabilityRunner)
[debug] timeToWork = 30, timeToAbort = 30
[debug] started null(org.apache.harmony.test.share.stress.generator.Thread)
[debug] Thread.setContext  { org.apache.harmony.test.stress.classloader.OneThread.SubClasses.testManySubClasses {} }
[debug] Starting 1 threads
[debug] ThreadToRun.run()
[debug] completed null(org.apache.harmony.test.share.stress.generator.Thread)
[debug] Generator.execute()
[debug] class = org.apache.harmony.test.stress.classloader.OneThread.SubClasses.testManySubClasses
[debug] org.apache.harmony.test.stress.classloader.OneThread.SubClasses.testManySubClasses { }
[debu...
Test: testClass: stress.org.apache.harmony.test.stress.classloader.OneThread.SupIntf.testManySupIntf1java version "1.5.0" 
pre-alpha : not complete or compatible
svn = r557495, (Jul 20 2007), Linux/ia32/gcc 3.3.3, release build
http://harmony.apache.org
The GC did not provide gc_add_weak_root_set_entry()

Apache Harmony Launcher : (c) Copyright 1991, 2006 The Apache Software Foundation or its licensors, as applicable.
[debug] started null(org.apache.harmony.test.share.stress.ReliabilityRunner)
[debug] timeToWork = 30, timeToAbort = 30
[debug] started null(org.apache.harmony.test.share.stress.generator.Thread)
[debug] Thread.setContext  { org.apache.harmony.test.stress.classloader.OneThread.SupIntf.testManySupIntf1 {} }
[debug] Starting 1 threads
[debug] ThreadToRun.run()
[debug] completed null(org.apache.harmony.test.share.stress.generator.Thread)
[debug] Generator.execute()
[debug] class = org.apache.harmony.test.stress.classloader.OneThread.SupIntf.testManySupIntf1
[debug] org.apache.harmony.test.stress.classloader.OneThread.SupIntf.testManySupIntf1 { }
[debug] started test...
Test: testClass: stress.org.apache.harmony.test.stress.classloader.OneThread.WrongClasses.testWCLoadjava version "1.5.0" 
pre-alpha : not complete or compatible
svn = r557495, (Jul 20 2007), Linux/ia32/gcc 3.3.3, release build
http://harmony.apache.org
The GC did not provide gc_add_weak_root_set_entry()

Apache Harmony Launcher : (c) Copyright 1991, 2006 The Apache Software Foundation or its licensors, as applicable.
[debug] started null(org.apache.harmony.test.share.stress.ReliabilityRunner)
[debug] timeToWork = 30, timeToAbort = 30
[debug] started null(org.apache.harmony.test.share.stress.generator.Thread)
[debug] Thread.setContext  { org.apache.harmony.test.stress.classloader.OneThread.WrongClasses.testWCLoad {} }
[debug] Starting 1 threads
[debug] ThreadToRun.run()
[debug] completed null(org.apache.harmony.test.share.stress.generator.Thread)
[debug] Generator.execute()
[debug] class = org.apache.harmony.test.stress.classloader.OneThread.WrongClasses.testWCLoad
[debug] org.apache.harmony.test.stress.classloader.OneThread.WrongClasses.testWCLoad { }
[debug] started test(or...
Test: testClass: stress.org.apache.harmony.test.stress.classloader.SynchThreads.ConstantPool.testCPLmt1java version "1.5.0" 
pre-alpha : not complete or compatible
svn = r557495, (Jul 20 2007), Linux/ia32/gcc 3.3.3, release build
http://harmony.apache.org
The GC did not provide gc_add_weak_root_set_entry()

Apache Harmony Launcher : (c) Copyright 1991, 2006 The Apache Software Foundation or its licensors, as applicable.
[debug] started null(org.apache.harmony.test.share.stress.ReliabilityRunner)
[debug] timeToWork = 30, timeToAbort = 30
[debug] started null(org.apache.harmony.test.share.stress.generator.Thread)
[debug] Thread.setContext  { org.apache.harmony.test.stress.classloader.SynchThreads.ConstantPool.testCPLmt {} }
[debug] Starting 1 threads
[debug] ThreadToRun.run()
[debug] completed null(org.apache.harmony.test.share.stress.generator.Thread)
[debug] Generator.execute()
[debug] class = org.apache.harmony.test.stress.classloader.SynchThreads.ConstantPool.testCPLmt
[debug] org.apache.harmony.test.stress.classloader.SynchThreads.ConstantPool.testCPLmt { }
[debug] started t...
Test: testClass: stress.org.apache.harmony.test.stress.classloader.SynchThreads.ConstantPool.testCPLmt2java version "1.5.0" 
pre-alpha : not complete or compatible
svn = r557495, (Jul 20 2007), Linux/ia32/gcc 3.3.3, release build
http://harmony.apache.org
The GC did not provide gc_add_weak_root_set_entry()

Apache Harmony Launcher : (c) Copyright 1991, 2006 The Apache Software Foundation or its licensors, as applicable.
[debug] started null(org.apache.harmony.test.share.stress.ReliabilityRunner)
[debug] timeToWork = 30, timeToAbort = 30
[debug] started null(org.apache.harmony.test.share.stress.generator.Thread)
[debug] Thread.setContext  { org.apache.harmony.test.stress.classloader.SynchThreads.ConstantPool.testCPLmt {} }
[debug] Starting 1 threads
[debug] completed null(org.apache.harmony.test.share.stress.generator.Thread)
[debug] ThreadToRun.run()
[debug] Generator.execute()
[debug] class = org.apache.harmony.test.stress.classloader.SynchThreads.ConstantPool.testCPLmt
[debug] org.apache.harmony.test.stress.classloader.SynchThreads.ConstantPool.testCPLmt { }
[debug] started t...
Test: testClass: stress.org.apache.harmony.test.stress.classloader.SynchThreads.FieldsLmt.testFieldsLmt1java version "1.5.0" 
pre-alpha : not complete or compatible
svn = r557495, (Jul 20 2007), Linux/ia32/gcc 3.3.3, release build
http://harmony.apache.org
The GC did not provide gc_add_weak_root_set_entry()

Apache Harmony Launcher : (c) Copyright 1991, 2006 The Apache Software Foundation or its licensors, as applicable.
[debug] started null(org.apache.harmony.test.share.stress.ReliabilityRunner)
[debug] timeToWork = 30, timeToAbort = 30
[debug] started null(org.apache.harmony.test.share.stress.generator.Thread)
[debug] Thread.setContext  { org.apache.harmony.test.stress.classloader.SynchThreads.FieldsLmt.testFieldsLmt {} }
[debug] Starting 1 threads
[debug] ThreadToRun.run()
[debug] completed null(org.apache.harmony.test.share.stress.generator.Thread)
[debug] Generator.execute()
[debug] class = org.apache.harmony.test.stress.classloader.SynchThreads.FieldsLmt.testFieldsLmt
[debug] org.apache.harmony.test.stress.classloader.SynchThreads.FieldsLmt.testFieldsLmt { }
[debug] starte...
Test: testClass: stress.org.apache.harmony.test.stress.classloader.SynchThreads.FieldsLmt.testFieldsLmt2java version "1.5.0" 
pre-alpha : not complete or compatible
svn = r557495, (Jul 20 2007), Linux/ia32/gcc 3.3.3, release build
http://harmony.apache.org
The GC did not provide gc_add_weak_root_set_entry()

Apache Harmony Launcher : (c) Copyright 1991, 2006 The Apache Software Foundation or its licensors, as applicable.
[debug] started null(org.apache.harmony.test.share.stress.ReliabilityRunner)
[debug] timeToWork = 30, timeToAbort = 30
[debug] started null(org.apache.harmony.test.share.stress.generator.Thread)
[debug] Thread.setContext  { org.apache.harmony.test.stress.classloader.SynchThreads.FieldsLmt.testFieldsLmt {} }
[debug] Starting 1 threads
[debug] ThreadToRun.run()
[debug] Generator.execute()
[debug] class = org.apache.harmony.test.stress.classloader.SynchThreads.FieldsLmt.testFieldsLmt
[debug] org.apache.harmony.test.stress.classloader.SynchThreads.FieldsLmt.testFieldsLmt { }
[debug] started test(org.apache.harmony.test.stress.classloader.SynchThreads.FieldsLmt.testF...
Test: testClass: stress.org.apache.harmony.test.stress.classloader.SynchThreads.LargeClassName.testLargeClassName_R1java version "1.5.0" 
pre-alpha : not complete or compatible
svn = r557495, (Jul 20 2007), Linux/ia32/gcc 3.3.3, release build
http://harmony.apache.org
The GC did not provide gc_add_weak_root_set_entry()

Apache Harmony Launcher : (c) Copyright 1991, 2006 The Apache Software Foundation or its licensors, as applicable.
[debug] started null(org.apache.harmony.test.share.stress.ReliabilityRunner)
[debug] timeToWork = 30, timeToAbort = 30
[debug] started null(org.apache.harmony.test.share.stress.generator.Thread)
[debug] Thread.setContext  { org.apache.harmony.test.stress.classloader.SynchThreads.LargeClassName.testLCN {} }
[debug] Starting 1 threads
[debug] completed null(org.apache.harmony.test.share.stress.generator.Thread)
[debug] ThreadToRun.run()
[debug] Generator.execute()
[debug] class = org.apache.harmony.test.stress.classloader.SynchThreads.LargeClassName.testLCN
[debug] org.apache.harmony.test.stress.classloader.SynchThreads.LargeClassName.testLCN { }
[debug] started t...
Test: testClass: stress.org.apache.harmony.test.stress.classloader.SynchThreads.LargeClassName.testLargeClassName_W1java version "1.5.0" 
pre-alpha : not complete or compatible
svn = r557495, (Jul 20 2007), Linux/ia32/gcc 3.3.3, release build
http://harmony.apache.org
The GC did not provide gc_add_weak_root_set_entry()

Apache Harmony Launcher : (c) Copyright 1991, 2006 The Apache Software Foundation or its licensors, as applicable.
[debug] started null(org.apache.harmony.test.share.stress.ReliabilityRunner)
[debug] timeToWork = 30, timeToAbort = 30
[debug] started null(org.apache.harmony.test.share.stress.generator.Thread)
[debug] Thread.setContext  { org.apache.harmony.test.stress.classloader.SynchThreads.LargeClassName.testLCN {} }
[debug] Starting 1 threads
[debug] ThreadToRun.run()
[debug] Generator.execute()
[debug] class = org.apache.harmony.test.stress.classloader.SynchThreads.LargeClassName.testLCN
[debug] org.apache.harmony.test.stress.classloader.SynchThreads.LargeClassName.testLCN { }
[debug] started test(org.apache.harmony.test.stress.classloader.SynchThreads.LargeClassName.tes...
Test: testClass: stress.org.apache.harmony.test.stress.classloader.SynchThreads.MethodArgs.testMethodArgs1java version "1.5.0" 
pre-alpha : not complete or compatible
svn = r557495, (Jul 20 2007), Linux/ia32/gcc 3.3.3, release build
http://harmony.apache.org
The GC did not provide gc_add_weak_root_set_entry()

Apache Harmony Launcher : (c) Copyright 1991, 2006 The Apache Software Foundation or its licensors, as applicable.
[debug] started null(org.apache.harmony.test.share.stress.ReliabilityRunner)
[debug] timeToWork = 30, timeToAbort = 30
[debug] started null(org.apache.harmony.test.share.stress.generator.Thread)
[debug] Thread.setContext  { org.apache.harmony.test.stress.classloader.SynchThreads.MethodArgs.testMethodArgs {} }
[debug] Starting 1 threads
[debug] ThreadToRun.run()
[debug] completed null(org.apache.harmony.test.share.stress.generator.Thread)
[debug] Generator.execute()
[debug] class = org.apache.harmony.test.stress.classloader.SynchThreads.MethodArgs.testMethodArgs
[debug] org.apache.harmony.test.stress.classloader.SynchThreads.MethodArgs.testMethodArgs { }
[debug] ...
Test: testClass: stress.org.apache.harmony.test.stress.classloader.SynchThreads.MethodNameLmt.testMethodNameLmt1java version "1.5.0" 
pre-alpha : not complete or compatible
svn = r557495, (Jul 20 2007), Linux/ia32/gcc 3.3.3, release build
http://harmony.apache.org
The GC did not provide gc_add_weak_root_set_entry()

Apache Harmony Launcher : (c) Copyright 1991, 2006 The Apache Software Foundation or its licensors, as applicable.
[debug] started null(org.apache.harmony.test.share.stress.ReliabilityRunner)
[debug] timeToWork = 30, timeToAbort = 30
[debug] started null(org.apache.harmony.test.share.stress.generator.Thread)
[debug] Thread.setContext  { org.apache.harmony.test.stress.classloader.SynchThreads.MethodNameLmt.testMethodNameLmt {} }
[debug] Starting 1 threads
[debug] ThreadToRun.run()
[debug] Generator.execute()
[debug] class = org.apache.harmony.test.stress.classloader.SynchThreads.MethodNameLmt.testMethodNameLmt
[debug] org.apache.harmony.test.stress.classloader.SynchThreads.MethodNameLmt.testMethodNameLmt { }
[debug] started test(org.apache.harmony.test.stress.classloader.Sync...
Test: testClass: stress.org.apache.harmony.test.stress.classloader.SynchThreads.MethodNameLmt.testMethodNameLmt2java version "1.5.0" 
pre-alpha : not complete or compatible
svn = r557495, (Jul 20 2007), Linux/ia32/gcc 3.3.3, release build
http://harmony.apache.org
The GC did not provide gc_add_weak_root_set_entry()

Apache Harmony Launcher : (c) Copyright 1991, 2006 The Apache Software Foundation or its licensors, as applicable.
[debug] started null(org.apache.harmony.test.share.stress.ReliabilityRunner)
[debug] timeToWork = 30, timeToAbort = 30
[debug] started null(org.apache.harmony.test.share.stress.generator.Thread)
[debug] Thread.setContext  { org.apache.harmony.test.stress.classloader.SynchThreads.MethodNameLmt.testMethodNameLmt {} }
[debug] Starting 1 threads
[debug] ThreadToRun.run()
[debug] completed null(org.apache.harmony.test.share.stress.generator.Thread)
[debug] Generator.execute()
[debug] class = org.apache.harmony.test.stress.classloader.SynchThreads.MethodNameLmt.testMethodNameLmt
[debug] org.apache.harmony.test.stress.classloader.SynchThreads.MethodNameLmt.testMethodNa...
Test: testClass: stress.org.apache.harmony.test.stress.classloader.SynchThreads.SupIntf.testManySupIntf1java version "1.5.0" 
pre-alpha : not complete or compatible
svn = r557495, (Jul 20 2007), Linux/ia32/gcc 3.3.3, release build
http://harmony.apache.org
The GC did not provide gc_add_weak_root_set_entry()

Apache Harmony Launcher : (c) Copyright 1991, 2006 The Apache Software Foundation or its licensors, as applicable.
[debug] started null(org.apache.harmony.test.share.stress.ReliabilityRunner)
[debug] timeToWork = 30, timeToAbort = 30
[debug] started null(org.apache.harmony.test.share.stress.generator.Thread)
[debug] Thread.setContext  { org.apache.harmony.test.stress.classloader.SynchThreads.SupIntf.testManySupIntf1 {} }
[debug] Starting 1 threads
[debug] ThreadToRun.run()
[debug] completed null(org.apache.harmony.test.share.stress.generator.Thread)
[debug] Generator.execute()
[debug] class = org.apache.harmony.test.stress.classloader.SynchThreads.SupIntf.testManySupIntf1
[debug] org.apache.harmony.test.stress.classloader.SynchThreads.SupIntf.testManySupIntf1 { }
[debug] sta...
Test: testClass: stress.org.apache.harmony.test.stress.classloader.SynchThreads.SupIntf.testManySupIntf2java version "1.5.0" 
pre-alpha : not complete or compatible
svn = r557495, (Jul 20 2007), Linux/ia32/gcc 3.3.3, release build
http://harmony.apache.org
The GC did not provide gc_add_weak_root_set_entry()

Apache Harmony Launcher : (c) Copyright 1991, 2006 The Apache Software Foundation or its licensors, as applicable.
[debug] started null(org.apache.harmony.test.share.stress.ReliabilityRunner)
[debug] timeToWork = 30, timeToAbort = 30
[debug] started null(org.apache.harmony.test.share.stress.generator.Thread)
[debug] Thread.setContext  { org.apache.harmony.test.stress.classloader.SynchThreads.SupIntf.testManySupIntf1 {} }
[debug] Starting 1 threads
[debug] ThreadToRun.run()
[debug] Generator.execute()
[debug] class = org.apache.harmony.test.stress.classloader.SynchThreads.SupIntf.testManySupIntf1
[debug] org.apache.harmony.test.stress.classloader.SynchThreads.SupIntf.testManySupIntf1 { }
[debug] started test(org.apache.harmony.test.stress.classloader.SynchThreads.SupIntf.test...
Test: testClass: stress.org.apache.harmony.test.stress.classloader.SynchThreads.SupIntf.testManySupIntf3java version "1.5.0" 
pre-alpha : not complete or compatible
svn = r557495, (Jul 20 2007), Linux/ia32/gcc 3.3.3, release build
http://harmony.apache.org
The GC did not provide gc_add_weak_root_set_entry()

Apache Harmony Launcher : (c) Copyright 1991, 2006 The Apache Software Foundation or its licensors, as applicable.
[debug] started null(org.apache.harmony.test.share.stress.ReliabilityRunner)
[debug] timeToWork = 30, timeToAbort = 30
[debug] started null(org.apache.harmony.test.share.stress.generator.Thread)
[debug] Thread.setContext  { org.apache.harmony.test.stress.classloader.SynchThreads.SupIntf.testManySupIntf2 {} }
[debug] Starting 1 threads
[debug] completed null(org.apache.harmony.test.share.stress.generator.Thread)
[debug] ThreadToRun.run()
[debug] Generator.execute()
[debug] class = org.apache.harmony.test.stress.classloader.SynchThreads.SupIntf.testManySupIntf2
[debug] org.apache.harmony.test.stress.classloader.SynchThreads.SupIntf.testManySupIntf2 { }
[debug] sta...
Test: testClass: stress.org.apache.harmony.test.stress.classloader.SynchThreads.SupIntf.testManySupIntf4java version "1.5.0" 
pre-alpha : not complete or compatible
svn = r557495, (Jul 20 2007), Linux/ia32/gcc 3.3.3, release build
http://harmony.apache.org
The GC did not provide gc_add_weak_root_set_entry()

Apache Harmony Launcher : (c) Copyright 1991, 2006 The Apache Software Foundation or its licensors, as applicable.
[debug] started null(org.apache.harmony.test.share.stress.ReliabilityRunner)
[debug] timeToWork = 30, timeToAbort = 30
[debug] started null(org.apache.harmony.test.share.stress.generator.Thread)
[debug] Thread.setContext  { org.apache.harmony.test.stress.classloader.SynchThreads.SupIntf.testManySupIntf2 {} }
[debug] Starting 1 threads
[debug] ThreadToRun.run()
[debug] completed null(org.apache.harmony.test.share.stress.generator.Thread)
[debug] Generator.execute()
[debug] class = org.apache.harmony.test.stress.classloader.SynchThreads.SupIntf.testManySupIntf2
[debug] org.apache.harmony.test.stress.classloader.SynchThreads.SupIntf.testManySupIntf2 { }
[debug] sta...
Test: testClass: stress.org.apache.harmony.test.stress.classloader.SynchThreads.WrongClasses.testNECLoad1java version "1.5.0" 
pre-alpha : not complete or compatible
svn = r557495, (Jul 20 2007), Linux/ia32/gcc 3.3.3, release build
http://harmony.apache.org
The GC did not provide gc_add_weak_root_set_entry()

Apache Harmony Launcher : (c) Copyright 1991, 2006 The Apache Software Foundation or its licensors, as applicable.
[debug] started null(org.apache.harmony.test.share.stress.ReliabilityRunner)
[debug] timeToWork = 30, timeToAbort = 30
[debug] started null(org.apache.harmony.test.share.stress.generator.Thread)
[debug] Thread.setContext  { org.apache.harmony.test.stress.classloader.SynchThreads.WrongClasses.testNECLoad_ST {} }
[debug] Starting 1 threads
[debug] ThreadToRun.run()
[debug] completed null(org.apache.harmony.test.share.stress.generator.Thread)
[debug] Generator.execute()
[debug] class = org.apache.harmony.test.stress.classloader.SynchThreads.WrongClasses.testNECLoad_ST
[debug] org.apache.harmony.test.stress.classloader.SynchThreads.WrongClasses.testNECLoad_ST { }
[d...
Test: testClass: stress.org.apache.harmony.test.stress.classloader.SynchThreads.WrongClasses.testNECLoad2java version "1.5.0" 
pre-alpha : not complete or compatible
svn = r557495, (Jul 20 2007), Linux/ia32/gcc 3.3.3, release build
http://harmony.apache.org
The GC did not provide gc_add_weak_root_set_entry()

Apache Harmony Launcher : (c) Copyright 1991, 2006 The Apache Software Foundation or its licensors, as applicable.
[debug] started null(org.apache.harmony.test.share.stress.ReliabilityRunner)
[debug] timeToWork = 30, timeToAbort = 30
[debug] started null(org.apache.harmony.test.share.stress.generator.Thread)
[debug] Thread.setContext  { org.apache.harmony.test.stress.classloader.SynchThreads.WrongClasses.testNECLoad_ST {} }
[debug] Starting 1 threads
[debug] ThreadToRun.run()
[debug] completed null(org.apache.harmony.test.share.stress.generator.Thread)
[debug] Generator.execute()
[debug] class = org.apache.harmony.test.stress.classloader.SynchThreads.WrongClasses.testNECLoad_ST
[debug] org.apache.harmony.test.stress.classloader.SynchThreads.WrongClasses.testNECLoad_ST { }
[d...
Test: testClass: stress.org.apache.harmony.test.stress.classloader.SynchThreads.WrongClasses.testWCLoad1java version "1.5.0" 
pre-alpha : not complete or compatible
svn = r557495, (Jul 20 2007), Linux/ia32/gcc 3.3.3, release build
http://harmony.apache.org
The GC did not provide gc_add_weak_root_set_entry()

Apache Harmony Launcher : (c) Copyright 1991, 2006 The Apache Software Foundation or its licensors, as applicable.
[debug] started null(org.apache.harmony.test.share.stress.ReliabilityRunner)
[debug] timeToWork = 30, timeToAbort = 30
[debug] started null(org.apache.harmony.test.share.stress.generator.Thread)
[debug] Thread.setContext  { org.apache.harmony.test.stress.classloader.SynchThreads.WrongClasses.testWCLoad_ST {} }
[debug] Starting 1 threads
[debug] ThreadToRun.run()
[debug] Generator.execute()
[debug] class = org.apache.harmony.test.stress.classloader.SynchThreads.WrongClasses.testWCLoad_ST
[debug] org.apache.harmony.test.stress.classloader.SynchThreads.WrongClasses.testWCLoad_ST { }
[debug] started test(org.apache.harmony.test.stress.classloader.SynchThreads.WrongC...
Test: testClass: stress.org.apache.harmony.test.stress.classloader.SynchThreads.WrongClasses.testWCLoad2java version "1.5.0" 
pre-alpha : not complete or compatible
svn = r557495, (Jul 20 2007), Linux/ia32/gcc 3.3.3, release build
http://harmony.apache.org
The GC did not provide gc_add_weak_root_set_entry()

Apache Harmony Launcher : (c) Copyright 1991, 2006 The Apache Software Foundation or its licensors, as applicable.
[debug] started null(org.apache.harmony.test.share.stress.ReliabilityRunner)
[debug] timeToWork = 30, timeToAbort = 30
[debug] started null(org.apache.harmony.test.share.stress.generator.Thread)
[debug] Thread.setContext  { org.apache.harmony.test.stress.classloader.SynchThreads.WrongClasses.testWCLoad_ST {} }
[debug] Starting 1 threads
[debug] ThreadToRun.run()
[debug] completed null(org.apache.harmony.test.share.stress.generator.Thread)
[debug] Generator.execute()
[debug] class = org.apache.harmony.test.stress.classloader.SynchThreads.WrongClasses.testWCLoad_ST
[debug] org.apache.harmony.test.stress.classloader.SynchThreads.WrongClasses.testWCLoad_ST { }
[debu...
Test: testClass: stress.org.apache.harmony.test.stress.gc.frag.FragmentationGCFinalizeTest3.FragmentationGCFinalizeTest3java version "1.5.0" 
pre-alpha : not complete or compatible
svn = r557495, (Jul 20 2007), Linux/ia32/gcc 3.3.3, release build
http://harmony.apache.org
The GC did not provide gc_add_weak_root_set_entry()

Apache Harmony Launcher : (c) Copyright 1991, 2006 The Apache Software Foundation or its licensors, as applicable.
[debug] started null(org.apache.harmony.test.share.stress.ReliabilityRunner)
[debug] timeToWork = 30, timeToAbort = 30
[debug] started null(org.apache.harmony.test.share.stress.generator.Thread)
[debug] Thread.setContext  { org.apache.harmony.test.stress.gc.frag.share.FragmentationGCFinalizeTest {} }
[debug] Starting 1 threads
[debug] ThreadToRun.run()
[debug] completed null(org.apache.harmony.test.share.stress.generator.Thread)
[debug] Generator.execute()
[debug] class = org.apache.harmony.test.stress.gc.frag.share.FragmentationGCFinalizeTest
[debug] org.apache.harmony.test.stress.gc.frag.share.FragmentationGCFinalizeTest { }
[debug] started test(org.apache.har...
Test: testClass: stress.org.apache.harmony.test.stress.gc.frag.FragmentationSimpleTest2.FragmentationSimpleTest2TestHarness:ExecUnit	runProc(): Timeout!!!. The test hung (not finished in 180 second).

java version "1.5.0" 
pre-alpha : not complete or compatible
svn = r557495, (Jul 20 2007), Linux/ia32/gcc 3.3.3, release build
http://harmony.apache.org
The GC did not provide gc_add_weak_root_set_entry()

Apache Harmony Launcher : (c) Copyright 1991, 2006 The Apache Software Foundation or its licensors, as applicable.
[debug] started null(org.apache.harmony.test.share.stress.ReliabilityRunner)
[debug] timeToWork = 30, timeToAbort = 30
[debug] started null(org.apache.harmony.test.share.stress.generator.Thread)
[debug] Thread.setContext  { org.apache.harmony.test.stress.gc.frag.share.FragmentationSimpleTest {} }
[debug] Starting 1 threads
[debug] ThreadToRun.run()
[debug] Generator.execute()
[debug] class = org.apache.harmony.test.stress.gc.frag.share.FragmentationSimpleTest
[debug] org.apache.harmony.test.stress.gc.frag.share.FragmentationSimpleTest { }
[debug] started test(org.apache.harm...
Test: testClass: stress.org.apache.harmony.test.stress.gc.frag.FragmentationSimpleTest6.FragmentationSimpleTest6java version "1.5.0" 
pre-alpha : not complete or compatible
svn = r557495, (Jul 20 2007), Linux/ia32/gcc 3.3.3, release build
http://harmony.apache.org
The GC did not provide gc_add_weak_root_set_entry()

Apache Harmony Launcher : (c) Copyright 1991, 2006 The Apache Software Foundation or its licensors, as applicable.
[debug] started null(org.apache.harmony.test.share.stress.ReliabilityRunner)
[debug] timeToWork = 30, timeToAbort = 30
[debug] started null(org.apache.harmony.test.share.stress.generator.Thread)
[debug] Thread.setContext  { org.apache.harmony.test.stress.gc.frag.share.FragmentationSimpleTest {} }
[debug] Starting 1 threads
[debug] ThreadToRun.run()
[debug] completed null(org.apache.harmony.test.share.stress.generator.Thread)
[debug] Generator.execute()
[debug] class = org.apache.harmony.test.stress.gc.frag.share.FragmentationSimpleTest
[debug] org.apache.harmony.test.stress.gc.frag.share.FragmentationSimpleTest { }
[debug] started test(org.apache.harmony.test.st...
Test: testClass: stress.org.apache.harmony.test.stress.gc.frag.FragmentationSoftRefTest1.FragmentationSoftRefTest1java version "1.5.0" 
pre-alpha : not complete or compatible
svn = r557495, (Jul 20 2007), Linux/ia32/gcc 3.3.3, release build
http://harmony.apache.org
The GC did not provide gc_add_weak_root_set_entry()

Apache Harmony Launcher : (c) Copyright 1991, 2006 The Apache Software Foundation or its licensors, as applicable.
[debug] started null(org.apache.harmony.test.share.stress.ReliabilityRunner)
[debug] timeToWork = 30, timeToAbort = 30
[debug] started null(org.apache.harmony.test.share.stress.generator.Thread)
[debug] Thread.setContext  { org.apache.harmony.test.stress.gc.frag.share.FragmentationSoftRefTest {} }
[debug] Starting 1 threads
[debug] ThreadToRun.run()
[debug] Generator.execute()
[debug] class = org.apache.harmony.test.stress.gc.frag.share.FragmentationSoftRefTest
[debug] org.apache.harmony.test.stress.gc.frag.share.FragmentationSoftRefTest { }
[debug] started test(org.apache.harmony.test.stress.gc.frag.share.FragmentationSoftRefTest)
[debug] MAX_MEM=40000000, FACT...
Test: testClass: stress.org.apache.harmony.test.stress.gc.frag.FragmentationTest2.FragmentationTest2java version "1.5.0" 
pre-alpha : not complete or compatible
svn = r557495, (Jul 20 2007), Linux/ia32/gcc 3.3.3, release build
http://harmony.apache.org
The GC did not provide gc_add_weak_root_set_entry()

Apache Harmony Launcher : (c) Copyright 1991, 2006 The Apache Software Foundation or its licensors, as applicable.
[debug] started null(org.apache.harmony.test.share.stress.ReliabilityRunner)
[debug] timeToWork = 30, timeToAbort = 30
[debug] started null(org.apache.harmony.test.share.stress.generator.Thread)
[debug] Thread.setContext  { org.apache.harmony.test.stress.gc.frag.share.FragmentationTest {} }
[debug] Starting 1 threads
[debug] ThreadToRun.run()
[debug] completed null(org.apache.harmony.test.share.stress.generator.Thread)
[debug] Generator.execute()
[debug] class = org.apache.harmony.test.stress.gc.frag.share.FragmentationTest
[debug] org.apache.harmony.test.stress.gc.frag.share.FragmentationTest { }
[debug] started test(org.apache.harmony.test.stress.gc.frag.share...
Test: testClass: stress.org.apache.harmony.test.stress.jni.stack.StackTest12TestHarness:ExecUnit	runProc(): Timeout!!!. The test hung (not finished in 540 second).

java version "1.5.0" 
pre-alpha : not complete or compatible
svn = r557495, (Jul 20 2007), Linux/ia32/gcc 3.3.3, release build
http://harmony.apache.org
The GC did not provide gc_add_weak_root_set_entry()

Apache Harmony Launcher : (c) Copyright 1991, 2006 The Apache Software Foundation or its licensors, as applicable.
[debug] started null(org.apache.harmony.test.share.stress.ReliabilityRunner)
[debug] timeToWork = 30, timeToAbort = 30
[debug] started null(org.apache.harmony.test.share.stress.generator.Thread)
[debug] Thread.setContext  { org.apache.harmony.test.stress.jni.stack.StackTest12 {} }
[debug] Starting 1 threads
[debug] ThreadToRun.run()
[debug] Generator.execute()
[debug] class = org.apache.harmony.test.stress.jni.stack.StackTest12
[debug] completed null(org.apache.harmony.test.share.stress.generator.Thread)
[debug] org.apache.harmony.test.stress.jni.stack.StackTest12 { }
[debug...
Test: testClass: stress.org.apache.harmony.test.stress.jni.stack.StackTest14java version "1.5.0" 
pre-alpha : not complete or compatible
svn = r557495, (Jul 20 2007), Linux/ia32/gcc 3.3.3, release build
http://harmony.apache.org
The GC did not provide gc_add_weak_root_set_entry()

Apache Harmony Launcher : (c) Copyright 1991, 2006 The Apache Software Foundation or its licensors, as applicable.
[debug] started null(org.apache.harmony.test.share.stress.ReliabilityRunner)
[debug] timeToWork = 30, timeToAbort = 30
[debug] started null(org.apache.harmony.test.share.stress.generator.Thread)
[debug] Thread.setContext  { org.apache.harmony.test.stress.jni.stack.StackTest14 {} }
[debug] Starting 1 threads
[debug] ThreadToRun.run()
[debug] completed null(org.apache.harmony.test.share.stress.generator.Thread)
[debug] Generator.execute()
[debug] class = org.apache.harmony.test.stress.jni.stack.StackTest14
[debug] org.apache.harmony.test.stress.jni.stack.StackTest14 { }
[debug] started test(org.apache.harmony.test.stress.jni.stack.StackTest14)
[debug] Main thread:...
Test: testClass: stress.org.apache.harmony.test.stress.jni.stack.StackTest3java version "1.5.0" 
pre-alpha : not complete or compatible
svn = r557495, (Jul 20 2007), Linux/ia32/gcc 3.3.3, release build
http://harmony.apache.org
The GC did not provide gc_add_weak_root_set_entry()

Apache Harmony Launcher : (c) Copyright 1991, 2006 The Apache Software Foundation or its licensors, as applicable.
[debug] started null(org.apache.harmony.test.share.stress.ReliabilityRunner)
[debug] timeToWork = 30, timeToAbort = 30
[debug] started null(org.apache.harmony.test.share.stress.generator.Thread)
[debug] Thread.setContext  { org.apache.harmony.test.stress.jni.stack.StackTest3 {} }
[debug] Starting 1 threads
[debug] ThreadToRun.run()
[debug] Generator.execute()
[debug] class = org.apache.harmony.test.stress.jni.stack.StackTest3
[debug] completed null(org.apache.harmony.test.share.stress.generator.Thread)
[debug] org.apache.harmony.test.stress.jni.stack.StackTest3 { }
[debug] started test(org.apache.harmony.test.stress.jni.stack.StackTest3)
Native code: Cannot get ...
Test: testClass: stress.org.apache.harmony.test.stress.jni.stack.StackTest4TestHarness:ExecUnit	runProc(): Timeout!!!. The test hung (not finished in 540 second).

java version "1.5.0" 
pre-alpha : not complete or compatible
svn = r557495, (Jul 20 2007), Linux/ia32/gcc 3.3.3, release build
http://harmony.apache.org
The GC did not provide gc_add_weak_root_set_entry()

Apache Harmony Launcher : (c) Copyright 1991, 2006 The Apache Software Foundation or its licensors, as applicable.
[debug] started null(org.apache.harmony.test.share.stress.ReliabilityRunner)
[debug] timeToWork = 30, timeToAbort = 30
[debug] started null(org.apache.harmony.test.share.stress.generator.Thread)
[debug] Thread.setContext  { org.apache.harmony.test.stress.jni.stack.StackTest4 {} }
[debug] Starting 1 threads
[debug] ThreadToRun.run()
[debug] completed null(org.apache.harmony.test.share.stress.generator.Thread)
[debug] Generator.execute()
[debug] class = org.apache.harmony.test.stress.jni.stack.StackTest4
[debug] org.apache.harmony.test.stress.jni.stack.StackTest4 { }
[debug] s...
Test: testClass: stress.org.apache.harmony.test.stress.jni.stack.StackTest6TestHarness:ExecUnit	runProc(): Timeout!!!. The test hung (not finished in 540 second).

java version "1.5.0" 
pre-alpha : not complete or compatible
svn = r557495, (Jul 20 2007), Linux/ia32/gcc 3.3.3, release build
http://harmony.apache.org
The GC did not provide gc_add_weak_root_set_entry()

Apache Harmony Launcher : (c) Copyright 1991, 2006 The Apache Software Foundation or its licensors, as applicable.
[debug] started null(org.apache.harmony.test.share.stress.ReliabilityRunner)
[debug] timeToWork = 30, timeToAbort = 30
[debug] started null(org.apache.harmony.test.share.stress.generator.Thread)
[debug] Thread.setContext  { org.apache.harmony.test.stress.jni.stack.StackTest6 {} }
[debug] Starting 1 threads
[debug] completed null(org.apache.harmony.test.share.stress.generator.Thread)
[debug] ThreadToRun.run()
[debug] Generator.execute()
[debug] class = org.apache.harmony.test.stress.jni.stack.StackTest6
[debug] org.apache.harmony.test.stress.jni.stack.StackTest6 { }
[debug] s...
Test: testClass: stress.org.apache.harmony.test.stress.jni.strings.StringsTest1java version "1.5.0" 
pre-alpha : not complete or compatible
svn = r557495, (Jul 20 2007), Linux/ia32/gcc 3.3.3, release build
http://harmony.apache.org
The GC did not provide gc_add_weak_root_set_entry()

Apache Harmony Launcher : (c) Copyright 1991, 2006 The Apache Software Foundation or its licensors, as applicable.
[debug] started null(org.apache.harmony.test.share.stress.ReliabilityRunner)
[debug] timeToWork = 30, timeToAbort = 30
[debug] started null(org.apache.harmony.test.share.stress.generator.Thread)
[debug] Thread.setContext  { org.apache.harmony.test.stress.jni.strings.StringsTest1 {} }
[debug] Starting 1 threads
[debug] ThreadToRun.run()
[debug] completed null(org.apache.harmony.test.share.stress.generator.Thread)
[debug] Generator.execute()
[debug] class = org.apache.harmony.test.stress.jni.strings.StringsTest1
[debug] org.apache.harmony.test.stress.jni.strings.StringsTest1 { }
[debug] started test(org.apache.harmony.test.stress.jni.strings.StringsTest1)
Native c...
Test: testClass: stress.org.apache.harmony.test.stress.jni.strings.StringsTest2java version "1.5.0" 
pre-alpha : not complete or compatible
svn = r557495, (Jul 20 2007), Linux/ia32/gcc 3.3.3, release build
http://harmony.apache.org
The GC did not provide gc_add_weak_root_set_entry()

Apache Harmony Launcher : (c) Copyright 1991, 2006 The Apache Software Foundation or its licensors, as applicable.
[debug] started null(org.apache.harmony.test.share.stress.ReliabilityRunner)
[debug] timeToWork = 30, timeToAbort = 30
[debug] started null(org.apache.harmony.test.share.stress.generator.Thread)
[debug] Thread.setContext  { org.apache.harmony.test.stress.jni.strings.StringsTest2 {} }
[debug] Starting 1 threads
[debug] ThreadToRun.run()
[debug] Generator.execute()
[debug] class = org.apache.harmony.test.stress.jni.strings.StringsTest2
[debug] org.apache.harmony.test.stress.jni.strings.StringsTest2 { }
[debug] started test(org.apache.harmony.test.stress.jni.strings.StringsTest2)
[debug] completed null(org.apache.harmony.test.share.stress.generator.Thread)
Native c...
Test: testClass: stress.org.apache.harmony.test.stress.jni.strings.StringsTest3java version "1.5.0" 
pre-alpha : not complete or compatible
svn = r557495, (Jul 20 2007), Linux/ia32/gcc 3.3.3, release build
http://harmony.apache.org
The GC did not provide gc_add_weak_root_set_entry()

Apache Harmony Launcher : (c) Copyright 1991, 2006 The Apache Software Foundation or its licensors, as applicable.
[debug] started null(org.apache.harmony.test.share.stress.ReliabilityRunner)
[debug] timeToWork = 30, timeToAbort = 30
[debug] started null(org.apache.harmony.test.share.stress.generator.Thread)
[debug] Thread.setContext  { org.apache.harmony.test.stress.jni.strings.StringsTest3 {} }
[debug] Starting 1 threads
[debug] ThreadToRun.run()
[debug] Generator.execute()
[debug] class = org.apache.harmony.test.stress.jni.strings.StringsTest3
[debug] org.apache.harmony.test.stress.jni.strings.StringsTest3 { }
[debug] started test(org.apache.harmony.test.stress.jni.strings.StringsTest3)
[debug] Main thread: Creating 100 threads
[debug] Main thread: Starting 100 threads
Na...
Test: testClass: stress.org.apache.harmony.test.stress.jpda.jdwp.scenario.FRAME002.FrameTest002TestHarness:ExecUnit	runProc(): Timeout!!!. The test hung (not finished in 540 second).

java version "1.5.0" 
pre-alpha : not complete or compatible
svn = r557495, (Jul 20 2007), Linux/ia32/gcc 3.3.3, release build
http://harmony.apache.org
09:42:26| Test: class org.apache.harmony.test.stress.jpda.jdwp.scenario.FRAME002.FrameTest002
		test case(s) to run 1
09:42:26| Launching as a server listening on: nstdrlxl16:37398
09:42:26| Launching: /export/users/cc/cc-suites/build/checkouts/snapshot/hdk/jdk/jre/bin/java -cp "/export/users/cc/cc-suites/build/classes/stress/classes:/export/users/cc/cc-suites/build/results/stress/temp:/export/users/cc/cc-suites/build/classes/stress/classes:/export/users/cc/cc-suites/build/classes/stress/lib:/export/users/cc/cc-suites/build/libs/th.jar:/export/users/cc/cc-suites/build/libs/junit-3.8.2.jar" -agentlib:jdwp=transport=dt_socket,address=nstdrlxl16:37398,server=n -Dvm.assert_dialog=false -Djpda.settings.verbose=true org.apache.harmony.test.stres...
Test: testClass: stress.org.apache.harmony.test.stress.jpda.jdwp.scenario.MEMORY001.MemoryTest001TestHarness:ExecUnit	runProc(): Timeout!!!. The test hung (not finished in 360 second).

java version "1.5.0" 
pre-alpha : not complete or compatible
svn = r557495, (Jul 20 2007), Linux/ia32/gcc 3.3.3, release build
http://harmony.apache.org
08:44:41| Test: class org.apache.harmony.test.stress.jpda.jdwp.scenario.MEMORY001.MemoryTest001
		test case(s) to run 1
08:44:41| Launching as a server listening on: nstdrlxl16:37314
08:44:41| Launching: /export/users/cc/cc-suites/build/checkouts/snapshot/hdk/jdk/jre/bin/java -cp "/export/users/cc/cc-suites/build/classes/stress/classes:/export/users/cc/cc-suites/build/results/stress/temp:/export/users/cc/cc-suites/build/classes/stress/classes:/export/users/cc/cc-suites/build/classes/stress/lib:/export/users/cc/cc-suites/build/libs/th.jar:/export/users/cc/cc-suites/build/libs/junit-3.8.2.jar" -agentlib:jdwp=transport=dt_socket,address=nstdrlxl16:37314,server=n -Dvm.assert_dialog=false -Djpda.settings.verbose=true org.apache.harmony.test.str...
Test: testClass: stress.org.apache.harmony.test.stress.jpda.jdwp.scenario.MEMORY006.MemoryTest006TestHarness:ExecUnit	runProc(): Timeout!!!. The test hung (not finished in 180 second).

java version "1.5.0" 
pre-alpha : not complete or compatible
svn = r557495, (Jul 20 2007), Linux/ia32/gcc 3.3.3, release build
http://harmony.apache.org
08:55:42| Test: class org.apache.harmony.test.stress.jpda.jdwp.scenario.MEMORY006.MemoryTest006
		test case(s) to run 1
08:55:42| Launching as a server listening on: nstdrlxl16:37334
08:55:42| Launching: /export/users/cc/cc-suites/build/checkouts/snapshot/hdk/jdk/jre/bin/java -cp "/export/users/cc/cc-suites/build/classes/stress/classes:/export/users/cc/cc-suites/build/results/stress/temp:/export/users/cc/cc-suites/build/classes/stress/classes:/export/users/cc/cc-suites/build/classes/stress/lib:/export/users/cc/cc-suites/build/libs/th.jar:/export/users/cc/cc-suites/build/libs/junit-3.8.2.jar" -agentlib:jdwp=transport=dt_socket,address=nstdrlxl16:37334,server=n -Dvm.assert_dialog=false -Djpda.settings.verbose=true org.apache.harmony.test.str...
Test: testClass: stress.org.apache.harmony.test.stress.jpda.jdwp.scenario.MIXED001.MixedTest001TestHarness:ExecUnit	runProc(): Timeout!!!. The test hung (not finished in 540 second).

java version "1.5.0" 
pre-alpha : not complete or compatible
svn = r557495, (Jul 20 2007), Linux/ia32/gcc 3.3.3, release build
http://harmony.apache.org
09:00:35| Test: class org.apache.harmony.test.stress.jpda.jdwp.scenario.MIXED001.MixedTest001
		test case(s) to run 1
09:00:35| Launching as a server listening on: nstdrlxl16:37346
09:00:35| Launching: /export/users/cc/cc-suites/build/checkouts/snapshot/hdk/jdk/jre/bin/java -cp "/export/users/cc/cc-suites/build/classes/stress/classes:/export/users/cc/cc-suites/build/results/stress/temp:/export/users/cc/cc-suites/build/classes/stress/classes:/export/users/cc/cc-suites/build/classes/stress/lib:/export/users/cc/cc-suites/build/libs/th.jar:/export/users/cc/cc-suites/build/libs/junit-3.8.2.jar" -agentlib:jdwp=transport=dt_socket,address=nstdrlxl16:37346,server=n -Dvm.assert_dialog=false -Djpda.settings.verbose=true org.apache.harmony.test.stres...
Test: testClass: stress.org.apache.harmony.test.stress.jpda.jdwp.scenario.OBJECT008.ObjectTest008TestHarness:ExecUnit	runProc(): Timeout!!!. The test hung (not finished in 360 second).

java version "1.5.0" 
pre-alpha : not complete or compatible
svn = r557495, (Jul 20 2007), Linux/ia32/gcc 3.3.3, release build
http://harmony.apache.org
09:25:27| Test: class org.apache.harmony.test.stress.jpda.jdwp.scenario.OBJECT008.ObjectTest008
		test case(s) to run 1
09:25:27| Launching as a server listening on: nstdrlxl16:37381
09:25:27| Launching: /export/users/cc/cc-suites/build/checkouts/snapshot/hdk/jdk/jre/bin/java -cp "/export/users/cc/cc-suites/build/classes/stress/classes:/export/users/cc/cc-suites/build/results/stress/temp:/export/users/cc/cc-suites/build/classes/stress/classes:/export/users/cc/cc-suites/build/classes/stress/lib:/export/users/cc/cc-suites/build/libs/th.jar:/export/users/cc/cc-suites/build/libs/junit-3.8.2.jar" -agentlib:jdwp=transport=dt_socket,address=nstdrlxl16:37381,server=n -Dvm.assert_dialog=false -Djpda.settings.verbose=true org.apache.harmony.test.str...
Test: testClass: stress.org.apache.harmony.test.stress.jpda.jdwp.scenario.OBJECT009.ObjectTest009TestHarness:ExecUnit	runProc(): Timeout!!!. The test hung (not finished in 360 second).

java version "1.5.0" 
pre-alpha : not complete or compatible
svn = r557495, (Jul 20 2007), Linux/ia32/gcc 3.3.3, release build
http://harmony.apache.org
09:31:59| Test: class org.apache.harmony.test.stress.jpda.jdwp.scenario.OBJECT009.ObjectTest009
		test case(s) to run 1
09:31:59| Launching as a server listening on: nstdrlxl16:37387
09:31:59| Launching: /export/users/cc/cc-suites/build/checkouts/snapshot/hdk/jdk/jre/bin/java -cp "/export/users/cc/cc-suites/build/classes/stress/classes:/export/users/cc/cc-suites/build/results/stress/temp:/export/users/cc/cc-suites/build/classes/stress/classes:/export/users/cc/cc-suites/build/classes/stress/lib:/export/users/cc/cc-suites/build/libs/th.jar:/export/users/cc/cc-suites/build/libs/junit-3.8.2.jar" -agentlib:jdwp=transport=dt_socket,address=nstdrlxl16:37387,server=n -Dvm.assert_dialog=false -Djpda.settings.verbose=true org.apache.harmony.test.str...
Test: testClass: stress.org.apache.harmony.test.stress.jpda.jdwp.scenario.THREAD002.ThreadTest002TestHarness:ExecUnit	runProc(): Timeout!!!. The test hung (not finished in 180 second).

java version "1.5.0" 
pre-alpha : not complete or compatible
svn = r557495, (Jul 20 2007), Linux/ia32/gcc 3.3.3, release build
http://harmony.apache.org
09:10:59| Test: class org.apache.harmony.test.stress.jpda.jdwp.scenario.THREAD002.ThreadTest002
		test case(s) to run 1
09:10:59| Launching as a server listening on: nstdrlxl16:37355
09:10:59| Launching: /export/users/cc/cc-suites/build/checkouts/snapshot/hdk/jdk/jre/bin/java -cp "/export/users/cc/cc-suites/build/classes/stress/classes:/export/users/cc/cc-suites/build/results/stress/temp:/export/users/cc/cc-suites/build/classes/stress/classes:/export/users/cc/cc-suites/build/classes/stress/lib:/export/users/cc/cc-suites/build/libs/th.jar:/export/users/cc/cc-suites/build/libs/junit-3.8.2.jar" -agentlib:jdwp=transport=dt_socket,address=nstdrlxl16:37355,server=n -Dvm.assert_dialog=false -Djpda.settings.verbose=true org.apache.harmony.test.str...
Test: testClass: stress.org.apache.harmony.test.stress.jpda.jdwp.scenario.THREAD004.ThreadTest004TestHarness:ExecUnit	runProc(): Timeout!!!. The test hung (not finished in 180 second).

java version "1.5.0" 
pre-alpha : not complete or compatible
svn = r557495, (Jul 20 2007), Linux/ia32/gcc 3.3.3, release build
http://harmony.apache.org
09:17:28| Test: class org.apache.harmony.test.stress.jpda.jdwp.scenario.THREAD004.ThreadTest004
		test case(s) to run 1
09:17:28| Launching as a server listening on: nstdrlxl16:37366
09:17:28| Launching: /export/users/cc/cc-suites/build/checkouts/snapshot/hdk/jdk/jre/bin/java -cp "/export/users/cc/cc-suites/build/classes/stress/classes:/export/users/cc/cc-suites/build/results/stress/temp:/export/users/cc/cc-suites/build/classes/stress/classes:/export/users/cc/cc-suites/build/classes/stress/lib:/export/users/cc/cc-suites/build/libs/th.jar:/export/users/cc/cc-suites/build/libs/junit-3.8.2.jar" -agentlib:jdwp=transport=dt_socket,address=nstdrlxl16:37366,server=n -Dvm.assert_dialog=false -Djpda.settings.verbose=true org.apache.harmony.test.str...
Test: testClass: stress.org.apache.harmony.test.stress.jpda.jdwp.scenario.THREAD008.ThreadTest008TestHarness:ExecUnit	runProc(): Timeout!!!. The test hung (not finished in 180 second).

java version "1.5.0" 
pre-alpha : not complete or compatible
svn = r557495, (Jul 20 2007), Linux/ia32/gcc 3.3.3, release build
http://harmony.apache.org
09:38:04| Test: class org.apache.harmony.test.stress.jpda.jdwp.scenario.THREAD008.ThreadTest008
		test case(s) to run 1
09:38:05| Launching as a server listening on: nstdrlxl16:37390
09:38:05| Launching: /export/users/cc/cc-suites/build/checkouts/snapshot/hdk/jdk/jre/bin/java -cp "/export/users/cc/cc-suites/build/classes/stress/classes:/export/users/cc/cc-suites/build/results/stress/temp:/export/users/cc/cc-suites/build/classes/stress/classes:/export/users/cc/cc-suites/build/classes/stress/lib:/export/users/cc/cc-suites/build/libs/th.jar:/export/users/cc/cc-suites/build/libs/junit-3.8.2.jar" -agentlib:jdwp=transport=dt_socket,address=nstdrlxl16:37390,server=n -Dvm.assert_dialog=false -Djpda.settings.verbose=true org.apache.harmony.test.str...
Test: testClass: stress.org.apache.harmony.test.stress.jpda.jdwp.scenario.THREAD010.ThreadTest010TestHarness:ExecUnit	runProc(): Timeout!!!. The test hung (not finished in 180 second).

java version "1.5.0" 
pre-alpha : not complete or compatible
svn = r557495, (Jul 20 2007), Linux/ia32/gcc 3.3.3, release build
http://harmony.apache.org
08:41:35| Test: class org.apache.harmony.test.stress.jpda.jdwp.scenario.THREAD010.ThreadTest010
		test case(s) to run 1
08:41:35| Launching as a server listening on: nstdrlxl16:37312
08:41:35| Launching: /export/users/cc/cc-suites/build/checkouts/snapshot/hdk/jdk/jre/bin/java -cp "/export/users/cc/cc-suites/build/classes/stress/classes:/export/users/cc/cc-suites/build/results/stress/temp:/export/users/cc/cc-suites/build/classes/stress/classes:/export/users/cc/cc-suites/build/classes/stress/lib:/export/users/cc/cc-suites/build/libs/th.jar:/export/users/cc/cc-suites/build/libs/junit-3.8.2.jar" -agentlib:jdwp=transport=dt_socket,address=nstdrlxl16:37312,server=n -Dvm.assert_dialog=false -Djpda.settings.verbose=true org.apache.harmony.test.str...
Test: testClass: stress.org.apache.harmony.test.stress.misc.WaitNotifyTestjava version "1.5.0" 
pre-alpha : not complete or compatible
svn = r557495, (Jul 20 2007), Linux/ia32/gcc 3.3.3, release build
http://harmony.apache.org
The GC did not provide gc_add_weak_root_set_entry()

Apache Harmony Launcher : (c) Copyright 1991, 2006 The Apache Software Foundation or its licensors, as applicable.
[debug] started null(org.apache.harmony.test.share.stress.ReliabilityRunner)
[debug] timeToWork = 30, timeToAbort = 30
[debug] started null(org.apache.harmony.test.share.stress.generator.Thread)
[debug] Thread.setContext  { org.apache.harmony.test.stress.misc.WaitNotifyTest {} }
[debug] Starting 1 threads
[debug] ThreadToRun.run()
[debug] Generator.execute()
[debug] class = org.apache.harmony.test.stress.misc.WaitNotifyTest
[debug] completed null(org.apache.harmony.test.share.stress.generator.Thread)
[debug] org.apache.harmony.test.stress.misc.WaitNotifyTest { }
[debug] started test(org.apache.harmony.test.stress.misc.WaitNotifyTest)
[debug] i=0
[debug] i=1
[deb...
Test: testClass: stress.org.apache.harmony.test.stress.threads.StressThreads12Test.StressThreads12TestTestHarness:ExecUnit	runProc(): Timeout!!!. The test hung (not finished in 180 second).

java version "1.5.0" 
pre-alpha : not complete or compatible
svn = r557495, (Jul 20 2007), Linux/ia32/gcc 3.3.3, release build
http://harmony.apache.org
The GC did not provide gc_add_weak_root_set_entry()

Apache Harmony Launcher : (c) Copyright 1991, 2006 The Apache Software Foundation or its licensors, as applicable.

***********************************************************
Modifications since last successful build:	(5)
            
add cc-snapshot log20070720152501Lbuild.5 07/20/2007 15:25:01snapshot
add cc-snapshot log20070719194303Lbuild.4 07/19/2007 19:43:03snapshot
add cc-snapshot log20070713091307Lbuild.3 07/13/2007 09:13:07snapshot
add cc-snapshot log20070712133841Lbuild.2 07/12/2007 13:38:41snapshot
add cc-snapshot log20070706021248Lbuild.1 07/06/2007 02:12:48snapshot

begin 644 execution_log.zip
M4$L#! H    ( !U/]38-55^&*@H   6&   2    97AE8W5T:6]N7VQO9RYH
M=&ULW9UK<]LV%H8_)[\"T]F=.C.)*.IFB>MZQK7EQEY?,I);[\Y.Q@.3D(2$
M ED M*WN]+\O (H6*9&ZI&YQO$YLD0 )/GAY#FY'$@\F<AH>'MQ'P>SP(.;D
M\  C(6<A^>'[4<3D!T%_(Q[JUO_^C^\/W_*$>6\10O\)2$@D^8Q.]"ME8^3V
MNFA$0R+0B$=3Y)"G..+2203APO%]]?^#2*@DPKE/:!@XG(@DE,(14FT)7:8J
M]0M^P)_1C_H 79:'S+&UIVE8.*"PXT^(_[7F1VQ$QUXA)]TF_B3ZC(Y-?L*Q
MI!'S4/83LJ<[BIN-N['O5Y[[RV7*@?[VWX?I_$J_>R@@]\FX\J0;(B0)T+G*
M0$HU2:=$G2]-:FV>\'LUK_[9J*&I>I1H%1F.Q222SB3XZGS1OYPX]Y0YNN2R
MBSP1_S,ZBK$J GW$?!JQ&;K "5/[''EHSW^G)(MGG(XG4MW;GOL>->KU#KI1
MQ\]/&T8C^8@Y0:=1P@(C+(HXHE*@D/J$B8B+]P@+A.-8)>#[D-0J470*>E#U
MU*5\Y];:M?IWJ/)H9:8?<!A/L$)ED41^-(VU/>KKZVT%HZY6>;IX8.@'Q-OM
M_5:O_1[MG2>AJIVNX/Z[]^B"LN3)T5;A**M S9KZ]QYQ9>A8D-02*DN>2!E[
MCC-)%:UAHU0MXM5VHL1GR@&0GS=0XTG*7"9I9LT?C;_=5K3-97[F_(H=59C^
MO2/L8<6S\L7VG_PP"4C&\BNND32E%E(A7Y8G*UE?J]K5E=O4S-EEUTZWM7WJ
M0]!<NF>;H@+5:]J$ZVVW@_8N\0RYG=2HWU67IDJ:WR#O$E/V1A'LO?/0,2=8
M69M?;%2N_[E]04)B+H<S=CS!C)%0%ZKV5&-F=C5MPM29-*QRF]5R3R@_I2P@
M_,U(O>@2E1],D(R0()C[$Z.+T$7O<',$]TV:L[-&-^9JCT0U$$+YCJ_:/2T1
MVI.1Q*%J4YK;Z7Y"A:J';I=TR1>1CXU:'<_M>&T7#1*&0IU8,V?IZFI73*3J
M/=0UMKK$4$:<#(@X$N<_O\%!D.&C1]5ZJ8NBN1[*CYW4I3,/3[699W]AU,&<
MXYEPCLR++L-%:._3T7#8/]FNNG\F2P,02QL02P<02P\0BUNW"3-.IH1)S3/?
M,B59 U(MMO_5&>J_EOUZB:2I2/J#P?7 -D@+"HC%MF6)I -%$HO-RK+C-*!H
MXC;AB&+3=[B:OPO%8EYU*?LV=5FAZ8*B<2'=*)NNM )CLQ]:@;':!:S06!Q@
MFKD1)R/AF*G30&U9="HUSR>QGBVK:6<ZJ4O;P)_9HYJS*KDN,9M=WW]1TT6#
M*=9G6YK0O' M6O\7M;#4:6RLQ1D3-"!GC,JR2A1S;4UX7K02EIJ^%ZV#I0;S
M1>L U2'*R"%W"56\EF;@W\P+U2^K>"W9+XZIB5HY(69C1XU<G.&=&K403IA/
M='EW=;<D"0ZLCHN5 )<E[PA=L12^[[E=K]5=60HW:^]3S/"8!'I=7 =O4;,+
M4)]&1;+EFTJC+(D3'.A8R;$ZWJR/#DS"\OXMIY+PH3G'7!@:_R<:DV#.GMLN
MX?[K9W)KL-.IU)P[OP-#\+'OC#@>.Z?JCUZI-O% ,S\I2;*B;25ALR0)D(A#
MJ@/[ \R":&KZ_ W9@-$[&[(!H_<V9 -"_^GXE#(<TM](B74O9<+QQ(66C<H,
M0"(OJ)J5&8!P4WNM;#Y@-APEQI#+@&.Z"ZC2!BYKVL#1EK9IT%JS^9BXS'1S
M.;;DC=79>CPVQ6&8+@1^Q.'HDTFUZU2K9("H;FBV;@I,K@48!*@IF:8W4+\!
M>;%U1<9V^Y?U7);6\C=R65I\JN8":5QV!UIKH,"9.V1;!V=6<RZ[EG5)IA&?
MI8-VM6W?JA9 G0S(TB183O1"DUEF4KO#1,2$!;H<AT77UY=]]3*\[J]FVUIU
M+O*>,4DX3V*9)WZD<K)@+AQB:UEU"^J\SD5F$$K?8BJO(DE'LVJIB\? T+J<
M.R_V$C4(M6_2/;=AH$O2=IOW5 9/6@W/;6X7/-GOV)/C/*)F>=;Q)YBR<N/+
MCH%A=N7$>;-[Y@5A<,^\81IH6"\QB+ZJ KE48TM3@*7.-20DKFX]G[-A6/ *
M;6$@\,QJR7JG5/C.L1IC'O&QQ>B7P3!O'[A^('P41H^V66;,'Q _,1_\L\Q2
M[%BMK-3Y(18BC-+8J9)F,N]$G0O,Q^18YU[A*3'G%)/N!G;6%O\(L:5VXP\@
MW[XZD6^AB:S?BFKPYI]@S>U;:IN_!16:JL<1$Q(S^2F*0G/&\:>+J:5PPXZ0
M=@)DE9"GE(2!4%SF\.<]8%)64 +3<IC<+_O/(@F:"PV3^(S)48[4[-MYZ\&N
ME'8^D[8K)3 GJJ $YD2W/&+CO!M=]8\OU'' Q*S"A*[F[:L0\_85:6DI5+$K
MIJ606/5HD\A)%.CU@;1!>MX%9ILWG)"\FKE]: /X-:C01A_I[=93MFQ05T@!
MYOD;:.U;[%4D7]_ZR3= [VK&%9&5KM?Q6KWM BNNVWH] MT":)*^@1I Z[1,
MO68Q!!YL^4H#. <'.TW:$M1^K[0,6C4+@6>B%:-2^(HN)DS %*T<0,-#73,P
MA0>[8;!G'_B2/KVJ<=YNO #& CL! XB1[<9KOQ?+\<(.CVT'"LMBH8;&-B*"
MLDNP8;'-C*!T7!-E@N,R:X),X"%AM9)K)DYP(.%&F+: !.7=8*-+FQE?@XZP
M6DFX<:7\,&U=5.D58,)J*6''OK8#A:4H^+C7]JPO]!5A7:_9\AI;?LK%;3=L
M"7/-2"K,*UG$V(470@!FP;OV;736'23/"32<L4"$NNJ^D1! ][)@7+?2#D5'
MT$OLRU*N6URW\#WM<8"=+\%C[ B?,,QIY-Q\'/2/3NINW4FY=:EU\Q7,(/ N
M^Y?7@W_7ZV[ND^KUNJ7O_Z]6SRVH9^NQ--7R-0KRV7H$5;5^C8)^</@R_9H%
M_6P]LJ2:KU7@LS117</7+O#9>BY$-5^GP&?I@4'5>/L%/%M/AEGEZ__2O[K1
MC7/_@3"Y:)M!T37R='":ECE=+T]GZP%1)99W]J_^B>EVZ1,)@/6Z<[A&'@[.
MC9WW:?7"F "06V1\A3ZW;NDI1JMXUS^>]X]O=)>6?@T>M"XMDZ]9D _.D"#3
MKUW0#TZ7F^G7*NAGZ=%KU?)U"O+9>G94M7SM@GQP;F^FWWY!/SA#EDR_3D$_
M./<WTZ];T*\+Q3TR^?8+\L&YO9E\O8)\/6CR=0OR[7AW*\(+/:_E>ITMHPN]
M.A E>@4EX R 3P='EWT]B#OE>$J@C>'F=(T\76X$]_9F0N9/8*<10Z='9Q?]
M$Z2_Y0E)E3.*PC!ZI&R,GI]+Y)E3<AF<1QQ%OI]PKNSF<4+#YQ)5MIQ0@4+*
MB/=VS7/L<8!C)<'SH^SG^[6G:>BY];H2XR^^IMOY4ZXI?$YC*?1WAT_)8\2_
MSFO8Z7GH7%D%XD0FRB0"Y7C-_;<'#CX\<&).U-_[*)BIEXF<AH?_ U!+ 0(4
M PH    ( !U/]38-55^&*@H   6&   2              "D@0    !E>&5C
D=71I;VY?;&]G+FAT;6Q02P4&      $  0!     6@H      
end

Mime
View raw message