harmony-alerts mailing list archives

Site index · List index
Message view « Date » · « Thread »
Top « Date » · « Thread »
From nom...@intel.com
Subject [build-test alert] BUILD FAILED Linux x86: scimark
Date Fri, 20 Jul 2007 09:11:37 GMT
BUILD FAILED:
	Ant Error Message:
/export/users/cc/cc-spec/scripts/cc-exec-adaptor.xml:101: The following error occurred while
executing this line: /export/users/cc/cc-spec/adaptors/scimark/adaptor.xml:46: Java returned:
139

Date of build:	07/20/2007 02:11:31
Time to build:	1 second
Last changed:	07/20/2007 02:06:48
Last log entry:	snapshot

***********************************************************
Errors/Warnings:	(2)
            
Tested Runtime: /export/users/cc/cc-spec/build/checkouts/snapshot/hdk/jdk/jre/bin/java /export/users/cc/cc-spec/build/checkouts/snapshot/hdk/jdk/jre/bin/java
The execution FAILED with the following exception:
The following error occurred while executing this line:
/export/users/cc/cc-spec/adaptors/scimark/adaptor.xml:46: Java returned: 139

***********************************************************
Unit Tests: (0)
        
No Tests Run: This project doesn't have any tests

***********************************************************
Modifications since last successful build:	(1)
            
add cc-snapshot log20070720020648Lbuild.7 07/20/2007 02:06:48snapshot

begin 644 execution_log.zip
M4$L#! H    ( ' 1]#;OB\UC%P$  /P!   2    97AE8W5T:6]N7VQO9RYH
M=&ULK9'!2@,Q$(;O^Q1SD9[:4131N"X(55 \26_20YJ=FK399)E,[-:G-UM%
MO8@78<) _IF/F?EK*YUOZE5L]TW=,S6UAB1[3]>3=0PR3>Z-%%P<'UU-FHIS
M4!4 /+?D26@)\S&[\*( :>@C"^9$G-"8$M/4D\%5=KY%II2])$S&=9JW)4>F
MF0PRX@J0C(U+6% 2:N$I!W$=_0DUELPVYA$;=)]L%+3M%C?C8\*5"[C1K_J?
M,%6UL 0TD,GB8H"[F_O'VSGLG%B0HJRC]W%7CE%J#/5CC3JT_!"8(T,T)C.7
M/7?6^2]BD<6Z!-X%4M6O(^M6]Q+Y^Y*?'[.A\^KL7,'#N#&39 [4*C@YO:QJ
MU$V-!W/QPV@\N/X.4$L! A0#"@    @ <!'T-N^+S6,7 0  _ $  !(     
M         *2!     &5X96-U=&EO;E]L;V<N:'1M;%!+!08      0 ! $  
(  !' 0     ! 
end

Mime
View raw message