harmony-alerts mailing list archives

Site index · List index
Message view « Date » · « Thread »
Top « Date » · « Thread »
From nom...@intel.com
Subject [build-test alert] BUILD FAILED Linux x86: snapshot
Date Fri, 20 Jul 2007 07:47:55 GMT
BUILD FAILED:
	Ant Error Message:
/export/users/cc/cc-reliability/scripts/cc-exec-adaptor.xml:101: The following error occurred
while executing this line: /export/users/cc/cc-reliability/adaptors/snapshot/adaptor.xml:111:
Problem expanding gzip invalid block type

Date of build:	07/20/2007 14:47:46
Time to build:	3 seconds
Last changed:	07/20/2007 14:33:47
Last log entry:	

***********************************************************
Errors/Warnings:	(1)
            
The execution FAILED with the following exception:
The following error occurred while executing this line:
/export/users/cc/cc-reliability/adaptors/snapshot/adaptor.xml:111: Problem expanding gzip
invalid block type

***********************************************************
Unit Tests: (0)
        
No Tests Run: This project doesn't have any tests

***********************************************************
Modifications since last successful build:	(1)
            
change User /export/users/cc/cc-reliability/build/checkouts/snapshot/ latest-harmony-hdk-linux-x86.tar.gz
07/20/2007 14:33:47 

begin 644 execution_log.zip
M4$L#! H    ( /EU]#8EM_Q-,0$  %P"   2    97AE8W5T:6]N7VQO9RYH
M=&ULM9+!:\,@%,;O^2O>9?1D72^C9%F@T X&.^RPV^C!Z&N4&A5]69/^]3-I
M-WH;# :"XJ>_S^?[*DV=K:O&J[&N0L2Z$I!HM/BT.'A'+)DSEK"^OWM<U 7K
MW=F$LBA8>UT!P(="BX1[V$ZS<2TH$U&2CR-P'(*/Q/N$,7$I\V 1K1&-L89&
MWO3&*BXURJ/O*?'D1$C:$]?J.+,O/GO8#4$X-<'_C+2",!'3(G;>C2P[,&M<
M/[!A_; D$9?M&<C_'[\HWC4"#BA[,M[!\^;E=;>%DR$-E)6#M]:?IA)QD!BF
M,^5\Y4:(T4?P4O8QHH*3-O:'F&72)D'VQ++XK0JA1,@=NGG^=6<Y=+9<K58E
MO$7?6.PR__OKV]P*,.Y36*.@L5X>@<: 1<5%7?$Y//P2)#ZGZ@M02P$"% ,*
M    " #Y=?0V);?\33$!  !< @  $@              I($     97AE8W5T
B:6]N7VQO9RYH=&UL4$L%!@     !  $ 0    &$!      $! 
end

Mime
View raw message