harmony-alerts mailing list archives

Site index · List index
Message view « Date » · « Thread »
Top « Date » · « Thread »
From nom...@intel.com
Subject [build-test alert] BUILD FAILED Linux x86_64: drlvm-test
Date Thu, 19 Jul 2007 18:14:28 GMT
BUILD FAILED:
	Ant Error Message:
/export/users/cc/cc-common/scripts/cc-exec-adaptor.xml:101: The following error occurred while
executing this line: /export/users/cc/cc-common/adaptors/drlvm-test/adaptor.xml:75: There
were drlvm-test failures

Date of build:	07/19/2007 23:00:34
Time to build:	132 minutes 49 seconds
Last changed:	07/19/2007 21:38:32
Last log entry:	hdk

***********************************************************
Errors/Warnings:	(70)
            
[cc] /export/users/cc/cc-common/build/checkouts/hdk/working_vm/vm/tests/unit/thread/test_native_suspend.c:
In function `test_hythread_thread_suspend':
[cc] /export/users/cc/cc-common/build/checkouts/hdk/working_vm/vm/tests/unit/thread/test_native_suspend.c:44:
warning: passing arg 5 of `hythread_create' from incompatible pointer type
[cc] /export/users/cc/cc-common/build/checkouts/hdk/working_vm/vm/tests/unit/thread/test_native_suspend.c:66:
warning: cast from pointer to integer of different size
[cc] /export/users/cc/cc-common/build/checkouts/hdk/working_vm/vm/tests/unit/thread/test_native_suspend.c:
In function `test_hythread_thread_suspend_all':
[cc] /export/users/cc/cc-common/build/checkouts/hdk/working_vm/vm/tests/unit/thread/test_native_suspend.c:90:
warning: passing arg 5 of `hythread_create' from incompatible pointer type
[cc] /export/users/cc/cc-common/build/checkouts/hdk/working_vm/vm/tests/unit/thread/test_native_basic.c:
In function `test_hythread_create':
[cc] /export/users/cc/cc-common/build/checkouts/hdk/working_vm/vm/tests/unit/thread/test_native_basic.c:56:
warning: passing arg 6 of `hythread_create_with_group' from incompatible pointer type
[cc] /export/users/cc/cc-common/build/checkouts/hdk/working_vm/vm/tests/unit/thread/test_native_basic.c:
In function `test_hythread_iterator':
[cc] /export/users/cc/cc-common/build/checkouts/hdk/working_vm/vm/tests/unit/thread/test_native_basic.c:111:
warning: passing arg 6 of `hythread_create_with_group' from incompatible pointer type
[cc] /export/users/cc/cc-common/build/checkouts/hdk/working_vm/vm/tests/unit/thread/test_native_basic.c:120:
warning: int format, different type arg (arg 2)
[cc] /export/users/cc/cc-common/build/checkouts/hdk/working_vm/vm/tests/unit/thread/test_native_basic.c:
In function `test_hythread_iterator_default':
[cc] /export/users/cc/cc-common/build/checkouts/hdk/working_vm/vm/tests/unit/thread/test_native_basic.c:149:
warning: passing arg 5 of `hythread_create' from incompatible pointer type
[cc] /export/users/cc/cc-common/build/checkouts/hdk/working_vm/vm/tests/unit/thread/test_native_basic.c:158:
warning: int format, different type arg (arg 2)
[cc] /export/users/cc/cc-common/build/checkouts/hdk/working_vm/vm/tests/unit/thread/test_native_basic.c:
In function `test_hythread_create_many':
[cc] /export/users/cc/cc-common/build/checkouts/hdk/working_vm/vm/tests/unit/thread/test_native_basic.c:204:
warning: passing arg 6 of `hythread_create_with_group' from incompatible pointer type
[cc] /export/users/cc/cc-common/build/checkouts/hdk/working_vm/vm/tests/unit/thread/test_native_fat_monitor.c:
In function `test_wait_signal':
[cc] /export/users/cc/cc-common/build/checkouts/hdk/working_vm/vm/tests/unit/thread/test_native_fat_monitor.c:64:
warning: passing arg 5 of `hythread_create' from incompatible pointer type
[cc] /export/users/cc/cc-common/build/checkouts/hdk/working_vm/vm/tests/unit/thread/test_java_basic.c:
In function `test_jthread_attach':
[cc] /export/users/cc/cc-common/build/checkouts/hdk/working_vm/vm/tests/unit/thread/test_java_basic.c:70:
warning: passing arg 1 of `tested_os_threads_run' from incompatible pointer type
[cc] /export/users/cc/cc-common/build/checkouts/hdk/working_vm/vm/tests/unit/thread/test_java_basic.c:
In function `run_for_test_jthread_timed_join':
[cc] /export/users/cc/cc-common/build/checkouts/hdk/working_vm/vm/tests/unit/thread/test_java_basic.c:225:
warning: unsigned int format, different type arg (arg 2)
[cc] /export/users/cc/cc-common/build/checkouts/hdk/working_vm/vm/tests/unit/thread/test_java_basic.c:225:
warning: int format, different type arg (arg 3)
[cc] /export/users/cc/cc-common/build/checkouts/hdk/working_vm/vm/tests/unit/thread/test_native_thin_monitor.c:
In function `test_hythread_thin_monitor_fat_unlock':
[cc] /export/users/cc/cc-common/build/checkouts/hdk/working_vm/vm/tests/unit/thread/test_native_thin_monitor.c:109:
warning: int format, different type arg (arg 2)
[cc] /export/users/cc/cc-common/build/checkouts/hdk/working_vm/vm/tests/unit/thread/test_native_thin_monitor.c:
In function `test_hythread_thin_monitor_enter_contended':
[cc] /export/users/cc/cc-common/build/checkouts/hdk/working_vm/vm/tests/unit/thread/test_native_thin_monitor.c:140:
warning: passing arg 5 of `hythread_create' from incompatible pointer type
[cc] /export/users/cc/cc-common/build/checkouts/hdk/working_vm/vm/tests/unit/thread/test_native_thin_monitor.c:158:
warning: passing arg 5 of `hythread_create' from incompatible pointer type
[cc] /export/users/cc/cc-common/build/checkouts/hdk/working_vm/vm/tests/unit/thread/test_native_thin_monitor.c:170:
warning: cast from pointer to integer of different size
[cc] /usr/lib64/gcc-lib/x86_64-suse-linux/3.3.3/../../../../x86_64-suse-linux/bin/ld: warning:
libhysig.so, needed by /export/users/cc/cc-common/build/checkouts/hdk/working_classlib/deploy/jdk/jre/bin/libhyzlib.so,
not found (try using -rpath or -rpath-link)
[cc] /usr/lib64/gcc-lib/x86_64-suse-linux/3.3.3/../../../../x86_64-suse-linux/bin/ld: warning:
libhysig.so, needed by /export/users/cc/cc-common/build/checkouts/hdk/working_classlib/deploy/jdk/jre/bin/libhyzlib.so,
not found (try using -rpath or -rpath-link)
[cc] /usr/lib64/gcc-lib/x86_64-suse-linux/3.3.3/../../../../x86_64-suse-linux/bin/ld: warning:
libhysig.so, needed by /export/users/cc/cc-common/build/checkouts/hdk/working_classlib/deploy/jdk/jre/bin/libhyzlib.so,
not found (try using -rpath or -rpath-link)
[cc] /usr/lib64/gcc-lib/x86_64-suse-linux/3.3.3/../../../../x86_64-suse-linux/bin/ld: warning:
libhysig.so, needed by /export/users/cc/cc-common/build/checkouts/hdk/working_classlib/deploy/jdk/jre/bin/libhyzlib.so,
not found (try using -rpath or -rpath-link)
[cc] /usr/lib64/gcc-lib/x86_64-suse-linux/3.3.3/../../../../x86_64-suse-linux/bin/ld: warning:
libhysig.so, needed by /export/users/cc/cc-common/build/checkouts/hdk/working_classlib/deploy/jdk/jre/bin/libhyzlib.so,
not found (try using -rpath or -rpath-link)
[cc] /usr/lib64/gcc-lib/x86_64-suse-linux/3.3.3/../../../../x86_64-suse-linux/bin/ld: warning:
libhysig.so, needed by /export/users/cc/cc-common/build/checkouts/hdk/working_classlib/deploy/jdk/jre/bin/libhyzlib.so,
not found (try using -rpath or -rpath-link)
[cc] /usr/lib64/gcc-lib/x86_64-suse-linux/3.3.3/../../../../x86_64-suse-linux/bin/ld: warning:
libhysig.so, needed by /export/users/cc/cc-common/build/checkouts/hdk/working_classlib/deploy/jdk/jre/bin/libhyzlib.so,
not found (try using -rpath or -rpath-link)
[cc] /usr/lib64/gcc-lib/x86_64-suse-linux/3.3.3/../../../../x86_64-suse-linux/bin/ld: warning:
libhysig.so, needed by /export/users/cc/cc-common/build/checkouts/hdk/working_classlib/deploy/jdk/jre/bin/libhyzlib.so,
not found (try using -rpath or -rpath-link)
[cc] /usr/lib64/gcc-lib/x86_64-suse-linux/3.3.3/../../../../x86_64-suse-linux/bin/ld: warning:
libhysig.so, needed by /export/users/cc/cc-common/build/checkouts/hdk/working_classlib/deploy/jdk/jre/bin/libhyzlib.so,
not found (try using -rpath or -rpath-link)
[cc] /usr/lib64/gcc-lib/x86_64-suse-linux/3.3.3/../../../../x86_64-suse-linux/bin/ld: warning:
libhysig.so, needed by /export/users/cc/cc-common/build/checkouts/hdk/working_classlib/deploy/jdk/jre/bin/libhyzlib.so,
not found (try using -rpath or -rpath-link)
[cc] /usr/lib64/gcc-lib/x86_64-suse-linux/3.3.3/../../../../x86_64-suse-linux/bin/ld: warning:
libhysig.so, needed by /export/users/cc/cc-common/build/checkouts/hdk/working_classlib/deploy/jdk/jre/bin/libhyzlib.so,
not found (try using -rpath or -rpath-link)
[cc] /usr/lib64/gcc-lib/x86_64-suse-linux/3.3.3/../../../../x86_64-suse-linux/bin/ld: warning:
libhysig.so, needed by /export/users/cc/cc-common/build/checkouts/hdk/working_classlib/deploy/jdk/jre/bin/libhyzlib.so,
not found (try using -rpath or -rpath-link)
[cc] /usr/lib64/gcc-lib/x86_64-suse-linux/3.3.3/../../../../x86_64-suse-linux/bin/ld: warning:
libhysig.so, needed by /export/users/cc/cc-common/build/checkouts/hdk/working_classlib/deploy/jdk/jre/bin/libhyzlib.so,
not found (try using -rpath or -rpath-link)
[cc] /usr/lib64/gcc-lib/x86_64-suse-linux/3.3.3/../../../../x86_64-suse-linux/bin/ld: warning:
libhysig.so, needed by /export/users/cc/cc-common/build/checkouts/hdk/working_classlib/deploy/jdk/jre/bin/libhyzlib.so,
not found (try using -rpath or -rpath-link)
[cc] /usr/lib64/gcc-lib/x86_64-suse-linux/3.3.3/../../../../x86_64-suse-linux/bin/ld: warning:
libhysig.so, needed by /export/users/cc/cc-common/build/checkouts/hdk/working_classlib/deploy/jdk/jre/bin/libhyzlib.so,
not found (try using -rpath or -rpath-link)
[cc] /usr/lib64/gcc-lib/x86_64-suse-linux/3.3.3/../../../../x86_64-suse-linux/bin/ld: warning:
libhysig.so, needed by /export/users/cc/cc-common/build/checkouts/hdk/working_classlib/deploy/jdk/jre/bin/libhyzlib.so,
not found (try using -rpath or -rpath-link)
[cc] /usr/lib64/gcc-lib/x86_64-suse-linux/3.3.3/../../../../x86_64-suse-linux/bin/ld: warning:
libhysig.so, needed by /export/users/cc/cc-common/build/checkouts/hdk/working_classlib/deploy/jdk/jre/bin/libhyzlib.so,
not found (try using -rpath or -rpath-link)
[cc] /usr/lib64/gcc-lib/x86_64-suse-linux/3.3.3/../../../../x86_64-suse-linux/bin/ld: warning:
libhysig.so, needed by /export/users/cc/cc-common/build/checkouts/hdk/working_classlib/deploy/jdk/jre/bin/libhyzlib.so,
not found (try using -rpath or -rpath-link)
[cc] /usr/lib64/gcc-lib/x86_64-suse-linux/3.3.3/../../../../x86_64-suse-linux/bin/ld: warning:
libhysig.so, needed by /export/users/cc/cc-common/build/checkouts/hdk/working_classlib/deploy/jdk/jre/bin/libhyzlib.so,
not found (try using -rpath or -rpath-link)
[java] Java Result: 1
[java] Java Result: 1
[java] Java Result: 130
[java] Java Result: 1
[java] Java Result: 1
[java] Java Result: 130
[java] Java Result: 1
[java] Java Result: 1
[java] Java Result: 130
[java] Java Result: 1
[java] Java Result: 1
[java] Java Result: 130
[java] Java Result: 1
[java] Java Result: 1
[java] Java Result: 130
[junit] Tests FAILED
BUILD FAILED
/export/users/cc/cc-common/build/checkouts/hdk/working_vm/build/make/build.xml:398: The following
error occurred while executing this line:
/export/users/cc/cc-common/build/checkouts/hdk/working_vm/build/make/build_component.xml:73:
The following error occurred while executing this line:
/export/users/cc/cc-common/build/checkouts/hdk/working_vm/build/lnx_em64t_gcc_debug/semis/build/targets/test.xml:6:
Some tests failed
Total time: 132 minutes 41 seconds
The execution FAILED with the following exception:
The following error occurred while executing this line:
/export/users/cc/cc-common/adaptors/drlvm-test/adaptor.xml:75: There were drlvm-test failures

***********************************************************
Unit Tests: (4287)
        
failure: testInterrupt_Terminated java.lang.ThreadTest
Unit Test Error Details:	(1)
                
Test: testInterrupt_TerminatedClass: java.lang.ThreadTestjunit.framework.AssertionFailedError:
interrupt status has not changed to true
	at junit.framework.Assert.fail(Assert.java:47)
	at junit.framework.Assert.assertTrue(Assert.java:20)
	at java.lang.ThreadTest.testInterrupt_Terminated(ThreadTest.java:1403)
	at java.lang.reflect.VMReflection.invokeMethod(VMReflection.java)
	at java.lang.reflect.Method.invoke(Method.java:317)
	at junit.framework.TestCase.runTest(TestCase.java:164)
	at junit.framework.TestCase.runBare(TestCase.java:130)
	at junit.framework.TestResult$1.protect(TestResult.java:106)
	at junit.framework.TestResult.runProtected(TestResult.java:124)
	at junit.framework.TestResult.run(TestResult.java:109)
	at junit.framework.TestCase.run(TestCase.java:120)
	at junit.framework.TestSuite.runTest(TestSuite.java:230)
	at junit.framework.TestSuite.run(TestSuite.java:225)
	at org.apache.tools.ant.taskdefs.optional.junit.JUnitTestRunner.run(JUnitTestRunner.java:297)
	at org.apache.tools.ant.taskdefs.optional.junit.JUnitTestRunner.launch(JUnitTestRunner.java:672)
	at org.apache.tools.ant.taskdefs.optional.junit.JUnitTestRunner.main(JUnitTestRunner.java:546)

***********************************************************
Modifications since last successful build:	(6)
            
add cc-hdk log20070719213832Lbuild.2 07/19/2007 21:38:32hdk
add cc-hdk log20070719213832Lbuild.2 07/19/2007 21:38:32hdk
modified ayza  /harmony/enhanced/jdktools/trunk/modules/jpda/make/exclude.common 07/19/2007
21:34:51 Applying patch from HARMONY-2894 ([jdktools][jdwp] JDWP agent uses non-standard VM
property)
modified ayza  /harmony/enhanced/jdktools/trunk/modules/jpda/src/main/native/jdwp/common/agent/commands/VirtualMachine.cpp
07/19/2007 21:34:51 Applying patch from HARMONY-2894 ([jdktools][jdwp] JDWP agent uses non-standard
VM property)
modified ayza  /harmony/enhanced/jdktools/trunk/modules/jpda/make/exclude.common 07/19/2007
21:34:51 Applying patch from HARMONY-2894 ([jdktools][jdwp] JDWP agent uses non-standard VM
property)
modified ayza  /harmony/enhanced/jdktools/trunk/modules/jpda/src/main/native/jdwp/common/agent/commands/VirtualMachine.cpp
07/19/2007 21:34:51 Applying patch from HARMONY-2894 ([jdktools][jdwp] JDWP agent uses non-standard
VM property)

begin 644 execution_log.zip
M4$L#! H    ( ,H)]#:Z64<#<"0  /!! @ 2    97AE8W5T:6]N7VQO9RYH
M=&UL[5U[<^,VDO\_GP)7NU>9;,64J+>\2:HF,T[BN9FQSW*R>Y5*Z6@*DCFF
M2!T?'CN?_AH@9;WXZ*8$/29P4A[* KH;W8U& _@!_.X^FKH_?'?GCYY_^&X6
M\!^^LU@8/;O\^Z_'OA>=A<Z?_)SUZO_YSZ]_^"J(O?.O&&._C[C+(_X'>RO^
M=;P)Z[9,-G9<'K)QX$]9C3_-_""JQ2$/PIIMP_]GMC^=^E[M+G;<42W@8>Q&
M86T4N(_3LXB'D: +E#]9C]8?[$=12- [9U/K@2>5C*>INU)JY4/XZ)V-0"@[
M.B\N- O\64$1_A3QP!N.^%JAY)G;]SX\_QJ*1K]Y_WHP>'_Y(_N^O,'V/;<?
M_!B:?#]ZJ'WV@P>@,+1=*PQ=YRY?G*1)AA\:5F#?&_;3DV&/)P7R.YX3&9\=
MKZQ([#E/19KBD1'RJ1,:(R<(BPO&1?J4#3>BZ<SX9!42$E+EJUQ69E$0\WP*
M$Y#9\B(;_#9P[@I8S=QXXGBXLHG\4-1X!-,Z?I%BI2X,\&T_#FQ>JC4CH2W[
M36E9X;8\B)SUHLM*BJ5;0LFG9U%+]$Q0FOQL.-/0<+R(NP;X)1/.>MXWS;)V
MQ]Z?SFS&1T;2+2RW2- )]WA@15SR$86-1RMPK#M$\TH\$<.=8M2TK#V;15;X
M4-TKW_C>V)G$T.@-QU@N)G]^\4,9*M_!UQ Q3*-MU(?U/GLUB#WVP;$#/WP.
M(SX-V:5G&]\4$IO'#1;X?K3C\+,A^.+'#X'7>\>+GW U1,B"&GS::45('A#@
MH,;$MK'EQQ,H/^)W\:2X!H1^%O!'1W1AJ-%N=SNM1AD3T.',][@7A9+)S/6?
MBQTUL@(1A2+?$&-:@5^5? UQ-QGSP)=#B'IVQ$=%06I>:BAK%90L^U[(-7R<
MKI9X&\]<QX:>/1+!Y!,,2,RSIAPZ!W.FPO$,=IW^_>;BYYN+P>#RZB.[O1C<
M#MC-KQ]!<V/'@\IC&$HB4:NBOSY.TZ]=[VDHO6H(GC*4UJ_)T2K]/C%#"&G&
M1!K"@,Q%I _,\D;,FEA"\.VED*E)'JLB8TUG$/+//CU.(T?F/B$D)7QF!;PH
M9 5\N!F,U@E/U\/0%8Q:@3-*Q@5P?S\.$W,X(F0Q?PR=8LP#[MF<17Y*0@1&
M(Q4SV 6Y71)S'>]AC5!)Q-[X>OC2KXNUN6$F\<UFF/]]^@!)$HP& 9=]!#Z<
M*W1Q*9#T-: K(C@/-T42C[88H$0CA(9-EF0E,DT7ZCP. :M+ ?\G+"2[VH^@
M_(>9#ZF'N?QL"#Y:/;5K?_93 #';7#QIU22J&<"?73Z(^,Q<?M;J2=3SVX=+
M")GF_-]-M91&30_2XT=^5'$S$2DW_?O;WY8,_.ZW#[>7+*D1POBQC8SY0>OX
MM%,HG?AD@YLUP.,CRTT7?\#[[_C<!T9&;JT!9$UR,B0&\^-.-0N3O-WFDU6S
MVN-6X$GGZDFOX-,[\.:IY3GCC6G;(<+&RQ!^A$$C7S8=,G3(T"'C0"%C*;$]
MPJ!1))T.&SILZ+!QH+"13OJ.,&3D23;O^*8.%SI<_)7#Q?KNP=*2S%$MQ01<
M, G+FKHI]]$YE.Z1?^4>"0665SWSQ^[2G>WO2W]*2=S$7IH62&%29(C$94 H
MB-;VSQ0)<811I@8JR)4;E.8)-16NRGZ*(>V OG/QXZ\_G[.?$Y1-JFON/3J!
M/^5>9!A&1O-7ZXY\C_]'6:%!RL"V9M8=I'L" +1SXOQ10!QV1O8#C^[]T847
M!<\@M^O>6?8#<T+Y+,*%'RRKV%A^%L9ZM8E]66/PU@FM.YGZ+K.2K< V FM8
MX,*9%\,X&[!(0)F P2[HSU5_]])XE/XWJS'?2X1LUY6)MN#15MM\3-6W'-S(
MAV$KSSP[L?^/2XVW[7CF@./"V#*./5N"$[9S8-7>]4:$S$W]4AK]XE6EO%QN
M!8)7=,_35&#!=4?MT3;?J\W;^ "\5'VG\7<>(,+8MGD80CHBP;^[(J_(H=8S
MB8*-FMWE$553!/KH?PN.#GTBN@>CC\2('HKE$CXJS0ADPB=XO9X KUM9'^&;
M<ZV( H9K>1,CJ<JVJ2O1P;$=^0&!BIP7A9&(<XA:+\VU1'-3?5'J35S_SG*7
MX&\B9Q)A!D]K+OD"[O/R]'>3HL!, D9T[P2C(;C#[-4W;"JS, +-*C%P-67 
MC2UB&D2T@5QG*!T*,I2RHA(<EY>ADS1@)G7GZEALG;P$8"2!.)QQ3Z(O:9XE
M%;I=YRPA83P[W!U1'"LE^#(&+K4(AA#94!&L(HRCI;1NETB(4)=0002[M/Z9
M^&'FBZO(Z4_R5R0%D#4=_K \;W@8 Z>EUN]3<1M=9WGRAYHY[HK"4J?(ZK[G
M+.0P#,P[ZV_?)@<JSMG[#)CDW\U_[J=#[<;A&MKAMG$750X7Q-X7YFC-+1SM
MI69R#E1((3/?X<7-S=7-\./5\,/5S<7PIYO7'RX&>%^<^H\5A\3Y:"KUF?8!
MO$(K]X*%$0X5'LLIK,]I"I$D>G5T%ZNCRRCTY>>C61V]\!1/_T]O^;755+_\
MVNKJY==D_K5=#SF=I;A6$]T5,T:]8UXJ6_?(["$I"8I'8\\E*1.5^!XFN=BL
M)=J&M[$V@6H3M/"#ZFGW,QU8YT.IWN/8S1Y'%A!SY8,M:&;@MY:)K>!9QV)J
M*' >F:;=+X8$B@P7#0AK0__NTV8K6((>;=,PIUEM?\,$LP2UD\O'[%<"M^X 
M%2R$JR6S5OF788+&':9K"(9]SBZ7HLG_RC+WSTF-8?I/6OCK#'?8IZ2MUCG[
M; 7"B<_9S HE1,H*)F!&?\S^]T5J6WK:U\G-5HXG] RDH LQ&1-$AWJ>9?23
M?;:ETUEJBVV%42+MBX"^Q'Y-X!&:-G+&<E\I8N)VKU-QER%$LT.[3+]^ZBYS
M9X6.7:+W5/J#Z'HN7[N3H^E.EJ:'GYWH?C@)_'AVJDIW(G%WEA\<5NVF:7Z!
M>C<;R_U6Y'%C/YA:T;=+H5#(*!OZ2OQJ9-R_=5Q^ EG*V(K=Z,#^TNI_*1'1
M;/>^&"=)>^?4\IX/ZQ^->EZ2=8KQ9&Q%0Z#C".Q0I@$^6TXT#)V)9QTH55F5
ML'.Z&:[@4N3JGU+1K2BR[/L]*WM%N&Y>3FA*)4<2,S?TPS2=#8=![)V*JD'4
M(43!X8K*(V<*#?H$XAY2[8U&>TGOL2=ZG5S+.KJX72 V1MKF04:9Z-[QBF/=
MTC1M450&H-AS??OA, %P36ZSWC^)0;VJNKD(&4,!:94(CN/0>>OD9\GK+5I)
M#;^(%JV,6ELN&!UZ2?;.\8Y-IN2X8=&2[WO'>UA;\$W@.<EX 7E-D+\ 7-_Q
MY08K3AB'0<UU[CJM&K3R#)YJ3[W.L-,Z"T%O\-F+GVI- _ZK&<;B_\TR8)::
M.UIR,R!U_PSCM!'ZWS*/<PA8[.YYV\NK:\F]S+5/\-VG@"=L!:<_X7?"RA=A
M/_9&[)5 PB1G8<\"Z)KWS _2)R'T0_ZMV^46DR.\MM@)6<P904ASQL_::*=D
M-#$^!?$L([AJJQVMU=+,0X]HIV2TF17D*U4;[ @-%LFYX*,VV@D9+=U=UC8[
M#9LM;W!HFYV4S98V1[3E3LIR.D:>HM66UQRUZ4[#=)$#,VSQ+K&IMMC)6$R@
MO-UA"-W,FN3O+FB['9O=YKMXCC?VM=E.QFPS;CW /#O.NDI2&^U(C198G_4J
MY.F935X%HNUU,O:*G"E\IPUV3 :[>.)V'-'!!BF%RX\_79W+:[_9"@YPPJ/A
M+'#\P(F>DYL MR)QSJY?#P87;\E$PNWE""ER@$8EA?)BI8K/644LD3;!O%9L
M:E*YLK)'? O>264R[S5X%9'Y6NUMN2<0]1=PWE:RK-*J;!/1B]Y]O!QR[W&+
M?IA2J"R%  179"^J5N:[@".7<#]+?^3U8K%XHWN]7C=-L]MEK[KPV/V&F?7-
MZXX+J\L?]JI^@E7;XNE+JUSN))7]C#_9?";ZJ5AHF57T]%4BU8>\ZA)LQ]?E
MO#)C4;=Z])57@E8-M[+R/@?V?&A9:2;BCBLG,>YXJS'$H>IWM?)6O.<W0%;F
MGSSNU<;Y2+02>5]J5FSO2_W**G?"!1%>5>VK1"K+8HM;D'<@S@:=?3I#_M)2
MB=2+-6"GJCLLDZALA943)5L*(FEL+0E,>7<BS0N=[77SM+6-!(FMY?!\,;:(
M"S&VE&9!:&N9Q-'7+:41)+;W&IGI[4":!:$=RB0?_7AWLLT)[C/69>-"2T07
ME8:Q)_ZIV/@E"I4M(FEL._RN$MERXKJ%0A8$]FK]7) I(DN3%+;.]9:H;)5T
MON!4MI1GA<X^;9&+BRJ;*J17*@7)Q=45YQLK1*K/*1?7.Z6DMAC8LHGMR23%
MT-"R.:J8OHFZE=<W7PB<^ *KN+5DRW550:*Z'/,K=DJ$6!1S_H16%RW%E;+:
M7MCY?4 E0L]+R3M6V(*]6=^\$)/,>[_]K!#.FR/ZT@4M1!=;JKG?9E)C?,[U
M>55[U"J5ZGZZ&:!W(]'^XWLQK+5<^O7K&ZKK89W2-M99HE5UXEU";4?2O<QZ
M(/ZX+I^0>S*6[,[EW;&<.Y)O<6-+B7S)?LPYDWME.V.ZHU:L782RNSZUH+FG
M*%.$P$;,143FF]XTM<6,9HG*#I;U$[#DUHO["9FMY+D3+L>W%VB%SOX<HP3H
M7;I!!(;UD@:L4-H"-9-);W\**490(PSYTKOGI+9PB@U:E5WUWG='X1 1D\L)
M;-5=!(&A_]FKO :_2F0K602%%\UN$]M6">W/5W-@X^H9%T.?2S2V5+G:\D ^
MH<KNL$QJ!%\$?E7@7P:EG4BUS;[5!IV=2+3M;EHFK=WHJOJNVCJ9_77F'%PZ
M9O'Z<3JO/^P@4FZ^0$ UV*OY4S[@]TNK@];E_HR? 7*ORO0H[JFKW4=3=T6T
MY$4PR;=_L-O \D)Q<283$\]S9C9[O6G^4 )-OG:Y6,D>.]Y(:BUDD"BF;_N$
MYVB/3<PWDP",>.<%WR<'$XQPZC]P2<T07VS>L7D (RYD MKB0 '?M(=\M/]8
M>KM,M\]"/P[$"^7G!S".1\R/OD@)=G 'IF1:F]BUF]C[R?$LU_D3:%UY%S!"
MW,ZMR(!!*$Y1^(\\"!P8_)G%1GP6<%O:\/7U9=9[I99%O>&IAS"!XV9G_P8=
M1^=S&@(=+E[F*4#OCAN6$1OX4\X<;Q9'J6U /H@]LK4@#A"*O= :<^;/Q*([
M4"\EF2W?@F:N="L?EKP_60 U),Z(U&V2BD?7<1*Q,CSR*,2JA?=Q-(+92FZ@
M773LPPE7$SWJK<6!U97W+\O)/Q-K[OCLU]MXYCI)9YT%_B=N1\RS9"=BSE1H
MPV#7Z=]O+GZ^N1@,+J\^RL%XP&Y^_2BVPAQQ9?C8"<)(U-I6B5,+P@Z("YF)
M&%DGB>\'L6<\35TY %H32TBW/:M\>R7?YTEQW JLVJK=ZK;0C&5QDD_OP)NG
MEN>,>=$+[XZFZ_YD09^\"(*"*UITQ]4=5W?<8^NXEZ47X>I^J_OM7[K?EDQ+
M"@J+W\E;;V3QHYNY)"LSJS.7JV0B*[HNS$ ?'3\.$X]QY%S4'[. R]<XP/0?
M@H&H9,@YN2&N$3AN1]4]_:_<T]=Z8W)L_I,3#?WTO!?XN]B-R!VT<[^8_WQ?
M^E-*8B!$2Q<[H;N]<1WQPI2I/^+LW>4M>Y5B)/,7NG<H"UT1O\J[1?B3[<:C
M9'60?;\;<Z<TP_F#,0K<QVD:S>2%*T9R!8L!%BV2O;1Q\NWP<G$OM\@U#\:(
M8OE+V^R7US<?KC[^SUFSV>SE%IO8M?=7@V(>4.8#^(-SF\!LB@O/0.Z5X@,(
M(S"8;=N*1K_;R"T&F:#]\+)@FEOLY4Q[;;[8BJP81@$/PYHL7;DE8[%\*3K<
MKW>Q%\4=ECA3H=JM8'O[-[K=1LI<AJ"I$T70X=WG_,II>S\X3]M[7ZO?9O>6
M-UGG7M3NC]<7VS/NF_G8/^!Q#4)%_O1FGFF4>P%4^A>W'@@U,&)VFOW<8LD&
M(KB!]YSVIMWP;/3[*]8H=?QGSZ[(=?,GM^A-[(E;K.3(Q,[9+TX^T62/LKC0
M&KGD,BO?&O' >".>A2I_YM%;#M\$4%#^$<%R2T(%8EW,X],E_ >Y<+(?),@3
MQ:I J$"L]_[DO7PB2E%>KX#I1S_Z25PH1N196JV Y4 Z>Z6FHJJNL7X9C1;F
M>AF.$.PK5<\5 2(NB6=1^34F$]N X?:UZ_KY9\T6+#"E,QDD/H[F4%(\@X4?
MV/DXFE7RA44S2 ?69%H4AE>IEY7.8L"QHA>5W"3\WD'Y:EG)3<+KH_-_QSSF
MR)Y1J?JF"%#YAD_]1Z3FRHMGL,C>]D<R)%;>9)]$+1 <Q["\> 8+R!SN ]\#
M(4<+:?&-K%!_4X@D=QK(8U@A1"\<:W2M-89B&<N0^U0KHV]&]>3Y'?QF-Q)P
M=,Y,A&QX!OGR747WJ&")*+Q.WC=>!X'UC P-J.*;+"Z3=[YB\C5,Z34&GSS'
M$(/Y>^<NL(+\J<J"";;&&B,_COSQ%,)&\&R\]>,[%Q-L")4*V%VBQAMLC0)&
MUZZ5\=K;8E;%=0J8X8(9MD8!(X@._F<BJ^(Z!<Q^XW;1$<YL;B652ME5\D=4
MU5+6=-\LKU?*E.XZY?76F(K%,2/9B!%S^I?$'1/&Z'6QS(<C>+C?1H02"EF"
M#/@C#RPW7=; ,D?6RF0HLY<W?N#Q8)#U<O \EMAZ&*;#_!64$K8%-;,8RU C
MC(3E5UZAD W=E2E5D:QICDPG4"A&1>8TE@$?NQ!TC)]Y](%']SYF>01?9XW9
M',1AE ,G-YC2ZQ8Q+X)^5<VB\0S*Y2M N&2*U\R_@"5'P"(.Y?*]]^W\>]!R
M.!;666<F@Y7QHS.!L 5__S$>CU'3"V+%;+:4Q1]TE6Q6T@R89!97/IL)?DQ$
M5LAF@TXJ<>6SF8@-DU^L\'YJS9"3?F+%-;;)CHDA%D,&J3?_XOL8YZ?6S&9\
MZ4D8"Z?X)+EJ'NLT1"!#-*E:-LN!N"D;SZJX>#:+Q+?+P]\&,VS%(K975Q^H
M#(NJK+&*(\<UWA:=SESP*"^;2=R_#IQ'[O()QV0*^#I9S*X#'^,+Y66SB"?#
M SK\XNNLG_]CZ>&O_1X#7$;,K8AZ=/ LC6_3^+;3PK>!>! '?./=Q>T^N-.;
M?A2(-JX1;3F%-:(MKR4:T:81;1EB:D1;3B:K$6T:T:81;;GL-:)-(]KP##2B
M32/:-*)-(]HTH@W#0"/:-**MA)%&M&E$FT:T:40;C:E&M&E$FT:TD9EK1)M&
MM.6SU8@VC6C3B#:-:-.(-HUHTX@VC6@[;@5J1%MVWTU_U"':KJXUHBT7T>;/
M-*(MI[!&M.6UY*"(MK*F[02\MD>@E(;,H<7<&V2N-!XN?K#9K$:U:52;1K7E
MLM>H-HUJPS/0J#:-:M.H-HUJTZ@V# .-:M.HMA)&&M6F46T:U:91;32F&M6F
M46T:U49FKE%M&M66SU:CVC2J3:/:-*I-H]HTJDVCVC2J[;@5J%%MV7TW_=D]
MJFU)KGUPIS?]&%!MH*0BV4L;MQ=46^@6+)_N##+5[^9#>QR_-M]+./7;QMH]
MD]D!9-@PUOU?#'DG\\? OXSW;G!;&CZUSO/VW@E3'2=Y"'Q\Y,&S='IL&$MM
ME*0\7RR2BX*2(4-B-$Q,P\2*6?Z586(;V&F2!/C:&J>F<6HEQ&DXM:L!CFY1
MP3W"WY8/4> 8H&IL,L+UIY*"&KZGX7LY/#5\;T.VOSQ\3Z/K-+JNA)%&UVET
MG4;754<E;1["Q0I J*EA?1K6E\]0P_HTK*^$N8;U:5A?/ML]POKD@B2>37%Q
M#>K+Y:9!?1K4IT%]&M2G07W'A4G3H#X-ZCLM4-^ !X\\8%-_Q-F[2WU=72ZP
M+PP>BV0O;9R^KH[<"GU=767-Z>OJ-A2KKZM+BNGKZC0.$266QB&6LCUY'**&
M 9:RT## />+U--ZMG*'&NR&%T'BW+POOIJ^KTX Z#:@KXZ8!=32F&E!7601]
M71V2J<:U:5R;QK61F6M<F\:UY;/5U]5I9)M&MFEDFT:V:63;EX9L6_D@*0T#
M+@39! _]/GT8.<$?+)F@C1A\.-^CV(E80"9:@T;]_BF&L)9\_0>[#2PO'/O!
ME$7.E$,NU.AU&M/\L>OV/@$IL82 N,5'*;RLJ%DU<!+^9&RT<.7#HO)Y?B&0
M=>:X_.P!7).[9YNE#V#01):79H=^'-A\TS#RT0:I9!-$/VVRI*P$9(4L\H] 
MR .J+@T@",69G?:A5%<FY$<_@LXY\"4&=!9'J8 @%?,#YC_"H.J,.+,83%\#
MGB!'7U]?&B4$;WCJ^4Q@(MG9OT$/T?F<!DS!&80&H!D)O%09L>JJ@O\3-20Z
MJ0FR-=?R)C6)W7CM>7XDQ5E 8D33H?V>I F-!3%C+[3&H ^8T">%J[5^0;.H
M[;^/8$B.^!_LK?A7> _XM,S(G_?L,S50SG@#8['RX0SL.;."HXYO,JSG-R&(
MO7SICPXNK?'F?V6\^=F:LY[=69%]?UAX.23Q+!$IQ9C'$KO]QG6X%[W S-DK
ML*0%.?8W^Y")KI"] \[3(+6"./_D;'>5[-_$99@\G(/](2Y#HN$77_ZZ&!'!
MD")3?ST:.6*0LUPQ)/ZC*C051%F5! ;1R+H#O8J.)*"\);>FE@AFFL62E51O
MMK:KWM^J>JN^7?7MVMYJ5#3JYL\Q#O4UZ$:&B#L929J8H"[6'?Q@8E@S"[@;
M]U8 XCP;0FO&A'L\<.PP0?TF8,_,M<DYP5OIY1"<SUG#_);]!(E=#'.6<U;_
MELG-AN3Q%DS!N&O-0CZ"";'1[+=8R#?ACUED.UBR=</LEI"%F?;/;\ T(P89
MGAB7'T6*/[&'UF@T_,RMAV'@^]$PY-$08GCP_&HS:&>(:+;Q+>^5B;@@V\-2
M;1F]1@]+M8E79[O;Q%(E:*!5W[VLIM$PVUBJ:#^M&\TFVEIFGZ#8)EJQS19>
M!^U&0X$.ZDJ(MM%.0-!KLV&JD-7$!RL*5;3#DJBB]8IV+*#:1,N*#EK"L3I8
MJH0QH-Y ]RV*!O!=BR0K6J\4JBVTK%TE>B4,,01_I6B@V5<@:P,?74B>I6+H
M)D070GQ5Y*]*!AC\$$M2 'HHH"A 32=01!4=M$G#EAJJ*C1@XM,!--4&!!<5
M^6O=1/<"4H=%!T+* &-VT1JH*Q&6$@A,%2,,(6A11AC\6$#*!]!A6XVLI-D&
M.KR8Z 06YIQHAVU0'+:%=BV\L'6CU<1W+[0;](UZ%Z]:M,6:1E=%3H ?O/&B
MDB9'^#6"EM'%1QC"XHO90GM!"^U<3:-31Y,EA$,3WVW[>-]J&4W\Q),2O/'A
MP"0,M@TE<QF"L/AU72$LWF($JO@50](D$1UC&H0XV\2/X0V*P? N2\B0FW6T
M<Y'R;OP(=N@Y0J..3@\I7M#HX%5 T$$'OWM 6C!""TO(CGKXS( 2#DTE2[S-
M3:I'!^#0"!B-@#D)!,PG1\#2?>/=A;YDL0#SPC7F!2N8QKQHS$L>YH6?"N:%
MD&M3EJ/+=OL.CWGIU'>/>>D:;7PF2,&1H!=ST IH&,TNFBI:U(9A$A:>"%,,
M_#XO!?+2ZN,GL.CUX@9,B-!+ Z3I@ JB^*4WRD9$2\E\"+\I35D7P*^,''S/
M!+\X1$&\*)F]-]5 ?M#>JD96-50I&UQXJJ0M/C4^H&+]G= )2)Z%U@!)5B7;
MO'@HE1IKD6(V.K\\O ;:2H!$^(2(1/7 PQ:)JI+HTMW]6& :?36I&[X7J/$!
MT@B#WY"N*QFX*(% T1"C9(118BRT8Y%$53+5Z.!GAH0=';./AZQ3_+6##P24
MC5C\C!,/>#'KAH*-O:;1Q4\-*-OQ>*@B"?'2QL\Y"8B7#AZN24&\=/ AAH!X
MP2<PA&C8Q&]QKP)>S&+ 2[\,/7 QN)7KR,F*:'+-DV#&?GI]^?[B[:Z#?EL-
M4J:#3E5)PN*#'J5K=E2L!C74S*_QP M"?&[W\>OAE%,:'?RR, 4I@T<V4?)U
M_)H@::51Q8&UAAHW:.+C,PDITU/1$P@H?0I2IJ-BUM9HX?,?2BS !-F,8>/H
MT" :3J/A-"<%I[FZUG":?#B-/]-P&JQ@&DZCX30Y<!KH1B<!IVE!+H;'[Q/2
MIFZW9/YP:#Q-NVZ8>(P&?DFC8;1[N]^9,XU^'STA0^N@9?3QTP:\K)"*JUB&
M:_?PLSST9+]KM/'0#SRDIF6T>FI.;RB9Z>(7. FK*&J.&"@ZXHX_QT69Y*%E
M50,I(:P?F*:2#6I\("!H0,75 <):2K8\T<:B;*+A]WQ)9^,.K-;#'_'OJI%5
MQ24R)CZ\DJRE)FBK6*4W\4APB@;P>18I$"J1%;_N34*_*!EB50 A.WAWQ4-J
M>F"MP\*AU;@ 98#!;ZM1(#6FDDMD%!Q@()WL)^5NZ#"@)AV@R$K87B8<8%"!
MJ.G@9X841(W94W#?3</HM/$S0PJBID.XMA-ML;:2\S$-HX$'&E/V*TT"6@D=
M8MH&?O0F0&J:^ Z&A]1T*-O6E$N,\9&+<(E,U^CV54QE"  ./#3&-!HM%7"E
M!C[CI!R4[.+=BS#8]I5 8QKXB1<>%&$:;<*R#NE";_PT$9TA-TDWZ1P<&Z/D
M9%L#?U,5#2*E !MC&BV\M(2NT,:GWOB>T(3)LHKY5UO)=9N-C'SVZ& ;&O>B
M<2\G@7MQQ&M-9P&/BEXQO#LI3A3W EHJ$KZT=1KW@JZN<2\5C+J@*P$A/Z?P
M$$$3*]!&Q1([G#H&![KT*6!P&D:'<'DB8;;:*CL9<&@(3M]HX'?ST?.S=LMH
MX3>(\>LU]8[1(2P(HLUO&J:*UR,UC0Y^2Q\/;.F9BI+^'OXM612J^#-VA$60
M'F&5D2*KBK/L/?QQ+A)5M \0MAQZ>, ,8?JO9.NUUU.B "67O1)DI5#%KX(1
M]K+Z^-?8$%;L"(Y%T4!?Q5E^0H<E=2T5T)8>?O6>%%X/W&-)PY:*J]K[=24]
MMJ<"@=!3<*V)H*IB@9D0LTB#H0(4BM' H]/Q+TBJ&UW"K0.4W$4%?)30N0A#
M3*^'?RM*G=)G5;PJC9!JDL88%>_@(XRR%'/A-4#*M%0<42 <0:8@1@AP+#R^
MQ52#;^D;7?Q^-@'?8AI=-?B6)A[90-@<-/%OYJ7@6_J$\Q_H*-,Q3/S=083[
M>AOX_)AR9TP=G\80K@$F /[P !>S;_3PU_$0I&T2+GM"#[A-RHD5@K"4*TI(
MRZ:[3[T;!OZ.:<)K*>OXN0<!WR(@"/C%'?P"*N4D"![@TC#Z^"4^ M5Z?_<O
MN8,.AC\52)$5/ZFA#+AX, [E,K6&@KN+&S P[O[NE[[14G"_:I/RGBB":[4R
MWIMW=.@,#6_1\):3@+<,>/#( R8V>MF[2WVU2S[$)0P>BX0O;9V&N*"K:XC+
MEPLK@6YT"K 2$Q(X/ " =+5+6;IY:%Q)JVTT\1M3^)4'$\CN_@"(.+Z&GA<1
MKG9I*'B9=)]R]H&PK-4EO%F>L*R%GV[A 3 =5:>#\3?NDZBJ.7FOXKWR=<)-
M5!2J:DZSJX!_$%XY0'E=DI([7 FKL!0-*-FB)EB+1!6].D Z>J_BC&$=O]5#
M\@$ELN)7'TG'V56(BE\BH[PC1(VQ"&.LDO!*TH"2#HL_!ZA&KZ1[/92\V*BE
M E5C*CD3W,9?DX!'U;2-EI($5M$;^90,,"V\ NI*1D-*(, C'TB7NZBYF$])
M.G#0L9#0!9J$%Y%1SO#C!T/2W2Z$2UC0TK9@X%* ?>D;S8:"-Q"U2#?1$';X
M\$,7Z6H7PF8<X6H7<_=K+^(EY?CI(=J[VD9'P9*..,2_>^!+LVUT\1=/J)G(
M4&YV(=QY1Q#6)-P_0L"6-?!8?@K2M*L"PHL_*T:YV*6)[PB4BUT(4$ *[J6)
M7X AY?(J#LR9>,@U1=8^_E5*E)<>$>X9)_2O#OZ5/X2>T,0O:U N=FDK.3+6
M5'+&T\S 0JY\2/;8EI$'JYB#A'U2"H0(+"\<^\&4B5U($?#;G?8TI-1H=UM-
M8HU&OTNLT:XWB#5@H%^KL?)!;FCF:REYGF^J_B/_I[@6^Z]EM$4865$<LM):
M*%XE>\!O7(=[T0NF@[T:\;$5N]$W[/KU8)#Q(L75ZO,W_;R[N,U[\V)VA:OK
M6QR'I3M5<!764"I9E7(I7+O<"@5JQ!NQ$8^@K_$1])00%!*RV!L!W?UN@8MM
M=VY'?O!LY+=@J>)YF2<GC2DH]N.OE^_?9MER)Q@:^2@ 4>?-?N]<[E^/?=?U
M/TO0C@AGS+?M. A [Y_O!7B'/W$[CL37T;T3,M?Q^+DBN890;>9[T!^DA-WF
M<0B(A;=)O)D0O'/.!OYT#MD92R_.-_BM'UGN/!PV&VSJ>#'49 DJU_=&J]'Q
M'?QF-XD7,3/]RO9GSW^P-_!;Z*$+507P*F217][ZM'O5))I*AMBOTC[YIS,#
M?Q2%!%7XA "@;%(;-NKU;KUK]H>-9MTT@,Q77PFSIG;SO=39V6<GN@<;KAC\
MR>8S4>;\JZJ>4""Q-;)FT+67A9W_+7' MG3 @+//XM>BE+2IR *^^JYF_?!=
M#<(C_+[S1\_PSWTT=7_X?U!+ 0(4 PH    ( ,H)]#:Z64<#<"0  /!! @ 2
M              "D@0    !E>&5C=71I;VY?;&]G+FAT;6Q02P4&      $ 
, 0!     H"0      
end

Mime
View raw message