harmony-alerts mailing list archives

Site index · List index
Message view « Date » · « Thread »
Top « Date » · « Thread »
From nom...@intel.com
Subject [build-test alert] BUILD FAILED Windows 2003 x86_64: classlib-gui-test
Date Thu, 19 Jul 2007 13:33:32 GMT
BUILD FAILED:
	Ant Error Message:
C:\cc\cc-common\scripts\cc-exec-adaptor.xml:101: The following error occurred while executing
this line: C:\cc\cc-common\adaptors\classlib-gui-test\adaptor.xml:80: There were CLASSLIB
Unit Test failures.

Date of build:	07/19/2007 20:14:52
Time to build:	18 minutes 0 seconds
Last changed:	07/19/2007 19:47:33
Last log entry:	hdk

***********************************************************
Errors/Warnings:	(7)
            
[junit] Tests FAILED (timeout)
BUILD FAILED
C:\cc\cc-common\build\checkouts\hdk\working_classlib\build.xml:169: The following error occurred
while executing this line:
C:\cc\cc-common\build\checkouts\hdk\working_classlib\make\build-test.xml:142: There were test
crashes: C:\cc\cc-common\build\checkouts\hdk\working_classlib\build\test_report\TEST-javax.swing.plaf.basic.BasicInternalFrameUI$InternalFrameLayoutTest.xml
Total time: 17 minutes 56 seconds
The execution FAILED with the following exception:
The following error occurred while executing this line:
C:\cc\cc-common\adaptors\classlib-gui-test\adaptor.xml:80: There were CLASSLIB Unit Test failures.

***********************************************************
Unit Tests: (3408)
        
error: javax.swing.plaf.basic.BasicInternalFrameUI$InternalFrameLayoutTest vmcrash.CrashedTests
failure: testCreateStandardLabels javax.swing.JSliderTest
failure: testSelectAllClearSelection javax.swing.JTableRTest
failure: testGetAcceptAllFileFilter javax.swing.plaf.basic.BasicFileChooserUITest
failure: testGetApproveButtonText javax.swing.plaf.basic.BasicFileChooserUITest
failure: testGetApproveButtonToolTipText javax.swing.plaf.basic.BasicFileChooserUITest
failure: testGetModel javax.swing.plaf.basic.BasicFileChooserUITest
failure: testBasicFileView javax.swing.plaf.basic.BasicFileChooserUITest
failure: testCreatePropertyChangeListener javax.swing.plaf.basic.BasicFileChooserUITest
failure: testGetApproveButton javax.swing.plaf.basic.BasicFileChooserUITest
failure: testGetDialogTitle javax.swing.plaf.basic.BasicFileChooserUITest
failure: testGetFileView javax.swing.plaf.basic.BasicFileChooserUITest
failure: testGetSetDirectory javax.swing.plaf.basic.BasicFileChooserUITest
failure: testGetSetDirectoryName javax.swing.plaf.basic.BasicFileChooserUITest
failure: testGetSetDirectorySelected javax.swing.plaf.basic.BasicFileChooserUITest
failure: testGetAccessoryPanel javax.swing.plaf.basic.BasicFileChooserUITest
failure: testGetApproveButtonAction javax.swing.plaf.basic.BasicFileChooserUITest
failure: testGetPreferredSize javax.swing.plaf.basic.BasicFileChooserUITest
failure: testEnsureFileIsVisible javax.swing.plaf.basic.BasicFileChooserUITest
failure: testInstallDefaults javax.swing.plaf.basic.BasicFileChooserUITest
failure: testCreateUIJComponent javax.swing.plaf.basic.BasicFormattedTextFieldUITest
failure: testGetPropertyPrefix javax.swing.plaf.basic.BasicFormattedTextFieldUITest
failure: testGetRadioButtonIcon javax.swing.plaf.basic.BasicIconFactoryTest
failure: testGetMenuArrowIcon javax.swing.plaf.basic.BasicIconFactoryTest
failure: testGetMenuItemArrowIcon javax.swing.plaf.basic.BasicIconFactoryTest
failure: testCreateEmptyFrameIcon javax.swing.plaf.basic.BasicIconFactoryTest
failure: testGetCheckBoxIcon javax.swing.plaf.basic.BasicIconFactoryTest
failure: testGetCheckBoxMenuItemIcon javax.swing.plaf.basic.BasicIconFactoryTest
failure: testGetMenuItemCheckIcon javax.swing.plaf.basic.BasicIconFactoryTest
failure: testGetRadioButtonMenuItemIcon javax.swing.plaf.basic.BasicIconFactoryTest
Unit Test Error Details:	(30)
                
Test: javax.swing.plaf.basic.BasicInternalFrameUI$InternalFrameLayoutTestClass: vmcrash.CrashedTests
Test: testCreateStandardLabelsClass: javax.swing.JSliderTestjunit.framework.AssertionFailedError:
Test interrupted due timeout
	at javax.swing.BasicSwingTestCase.runBare(BasicSwingTestCase.java:147)
Test: testSelectAllClearSelectionClass: javax.swing.JTableRTestjunit.framework.AssertionFailedError:
Test interrupted due timeout
	at javax.swing.BasicSwingTestCase.runBare(BasicSwingTestCase.java:147)
Test: testGetAcceptAllFileFilterClass: javax.swing.plaf.basic.BasicFileChooserUITestjunit.framework.AssertionFailedError:
Test interrupted due timeout
	at javax.swing.BasicSwingTestCase.runBare(BasicSwingTestCase.java:147)
Test: testGetApproveButtonTextClass: javax.swing.plaf.basic.BasicFileChooserUITestjunit.framework.AssertionFailedError:
Test interrupted due timeout
	at javax.swing.BasicSwingTestCase.runBare(BasicSwingTestCase.java:147)
Test: testGetApproveButtonToolTipTextClass: javax.swing.plaf.basic.BasicFileChooserUITestjunit.framework.AssertionFailedError:
Test interrupted due timeout
	at javax.swing.BasicSwingTestCase.runBare(BasicSwingTestCase.java:147)
Test: testGetModelClass: javax.swing.plaf.basic.BasicFileChooserUITestjunit.framework.AssertionFailedError:
Test interrupted due timeout
	at javax.swing.BasicSwingTestCase.runBare(BasicSwingTestCase.java:147)
Test: testBasicFileViewClass: javax.swing.plaf.basic.BasicFileChooserUITestjunit.framework.AssertionFailedError:
Test interrupted due timeout
	at javax.swing.BasicSwingTestCase.runBare(BasicSwingTestCase.java:147)
Test: testCreatePropertyChangeListenerClass: javax.swing.plaf.basic.BasicFileChooserUITestjunit.framework.AssertionFailedError:
Test interrupted due timeout
	at javax.swing.BasicSwingTestCase.runBare(BasicSwingTestCase.java:147)
Test: testGetApproveButtonClass: javax.swing.plaf.basic.BasicFileChooserUITestjunit.framework.AssertionFailedError:
Test interrupted due timeout
	at javax.swing.BasicSwingTestCase.runBare(BasicSwingTestCase.java:147)
Test: testGetDialogTitleClass: javax.swing.plaf.basic.BasicFileChooserUITestjunit.framework.AssertionFailedError:
Test interrupted due timeout
	at javax.swing.BasicSwingTestCase.runBare(BasicSwingTestCase.java:147)
Test: testGetFileViewClass: javax.swing.plaf.basic.BasicFileChooserUITestjunit.framework.AssertionFailedError:
Test interrupted due timeout
	at javax.swing.BasicSwingTestCase.runBare(BasicSwingTestCase.java:147)
Test: testGetSetDirectoryClass: javax.swing.plaf.basic.BasicFileChooserUITestjunit.framework.AssertionFailedError:
Test interrupted due timeout
	at javax.swing.BasicSwingTestCase.runBare(BasicSwingTestCase.java:147)
Test: testGetSetDirectoryNameClass: javax.swing.plaf.basic.BasicFileChooserUITestjunit.framework.AssertionFailedError:
Test interrupted due timeout
	at javax.swing.BasicSwingTestCase.runBare(BasicSwingTestCase.java:147)
Test: testGetSetDirectorySelectedClass: javax.swing.plaf.basic.BasicFileChooserUITestjunit.framework.AssertionFailedError:
Test interrupted due timeout
	at javax.swing.BasicSwingTestCase.runBare(BasicSwingTestCase.java:147)
Test: testGetAccessoryPanelClass: javax.swing.plaf.basic.BasicFileChooserUITestjunit.framework.AssertionFailedError:
Test interrupted due timeout
	at javax.swing.BasicSwingTestCase.runBare(BasicSwingTestCase.java:147)
Test: testGetApproveButtonActionClass: javax.swing.plaf.basic.BasicFileChooserUITestjunit.framework.AssertionFailedError:
Test interrupted due timeout
	at javax.swing.BasicSwingTestCase.runBare(BasicSwingTestCase.java:147)
Test: testGetPreferredSizeClass: javax.swing.plaf.basic.BasicFileChooserUITestjunit.framework.AssertionFailedError:
Test interrupted due timeout
	at javax.swing.BasicSwingTestCase.runBare(BasicSwingTestCase.java:147)
Test: testEnsureFileIsVisibleClass: javax.swing.plaf.basic.BasicFileChooserUITestjunit.framework.AssertionFailedError:
Test interrupted due timeout
	at javax.swing.BasicSwingTestCase.runBare(BasicSwingTestCase.java:147)
Test: testInstallDefaultsClass: javax.swing.plaf.basic.BasicFileChooserUITestjunit.framework.AssertionFailedError:
Test interrupted due timeout
	at javax.swing.BasicSwingTestCase.runBare(BasicSwingTestCase.java:147)
Test: testCreateUIJComponentClass: javax.swing.plaf.basic.BasicFormattedTextFieldUITestjunit.framework.AssertionFailedError:
Test interrupted due timeout
	at javax.swing.BasicSwingTestCase.runBare(BasicSwingTestCase.java:147)
Test: testGetPropertyPrefixClass: javax.swing.plaf.basic.BasicFormattedTextFieldUITestjunit.framework.AssertionFailedError:
Test interrupted due timeout
	at javax.swing.BasicSwingTestCase.runBare(BasicSwingTestCase.java:147)
Test: testGetRadioButtonIconClass: javax.swing.plaf.basic.BasicIconFactoryTestjunit.framework.AssertionFailedError:
Test interrupted due timeout
	at javax.swing.BasicSwingTestCase.runBare(BasicSwingTestCase.java:147)
Test: testGetMenuArrowIconClass: javax.swing.plaf.basic.BasicIconFactoryTestjunit.framework.AssertionFailedError:
Test interrupted due timeout
	at javax.swing.BasicSwingTestCase.runBare(BasicSwingTestCase.java:147)
Test: testGetMenuItemArrowIconClass: javax.swing.plaf.basic.BasicIconFactoryTestjunit.framework.AssertionFailedError:
Test interrupted due timeout
	at javax.swing.BasicSwingTestCase.runBare(BasicSwingTestCase.java:147)
Test: testCreateEmptyFrameIconClass: javax.swing.plaf.basic.BasicIconFactoryTestjunit.framework.AssertionFailedError:
Test interrupted due timeout
	at javax.swing.BasicSwingTestCase.runBare(BasicSwingTestCase.java:147)
Test: testGetCheckBoxIconClass: javax.swing.plaf.basic.BasicIconFactoryTestjunit.framework.AssertionFailedError:
Test interrupted due timeout
	at javax.swing.BasicSwingTestCase.runBare(BasicSwingTestCase.java:147)
Test: testGetCheckBoxMenuItemIconClass: javax.swing.plaf.basic.BasicIconFactoryTestjunit.framework.AssertionFailedError:
Test interrupted due timeout
	at javax.swing.BasicSwingTestCase.runBare(BasicSwingTestCase.java:147)
Test: testGetMenuItemCheckIconClass: javax.swing.plaf.basic.BasicIconFactoryTestjunit.framework.AssertionFailedError:
Test interrupted due timeout
	at javax.swing.BasicSwingTestCase.runBare(BasicSwingTestCase.java:147)
Test: testGetRadioButtonMenuItemIconClass: javax.swing.plaf.basic.BasicIconFactoryTestjunit.framework.AssertionFailedError:
Test interrupted due timeout
	at javax.swing.BasicSwingTestCase.runBare(BasicSwingTestCase.java:147)

***********************************************************
Modifications since last successful build:	(60)
            
add cc-hdk log20070719194733Lbuild.1 07/19/2007 19:47:33hdk
added leoli  /harmony/enhanced/classlib/trunk/modules/beans/src/main/java/java/beans/UtilMapPersistenceDelegate.java
07/19/2007 13:39:34 Apply patch for HARMONY-4487([classlib][beans] Persistence delegate for
j.u.Map is missing).
modified leoli  /harmony/enhanced/classlib/trunk/modules/beans/src/main/java/java/beans/Encoder.java
07/19/2007 13:39:34 Apply patch for HARMONY-4487([classlib][beans] Persistence delegate for
j.u.Map is missing).
modified leoli  /harmony/enhanced/classlib/trunk/modules/beans/src/test/java/org/apache/harmony/beans/tests/java/beans/PersistenceDelegateTest.java
07/19/2007 13:39:34 Apply patch for HARMONY-4487([classlib][beans] Persistence delegate for
j.u.Map is missing).
modified tonywu  /harmony/enhanced/classlib/trunk/modules/beans/src/main/java/java/beans/EventSetDescriptor.java
07/19/2007 13:30:02 Tidy up compiler warning and format code, no functional change
modified tonywu  /harmony/enhanced/classlib/trunk/modules/beans/src/main/java/java/beans/StandardBeanInfo.java
07/19/2007 13:30:02 Tidy up compiler warning and format code, no functional change
modified tonywu  /harmony/enhanced/classlib/trunk/modules/beans/src/main/java/java/beans/PropertyDescriptor.java
07/19/2007 13:30:02 Tidy up compiler warning and format code, no functional change
modified tonywu  /harmony/enhanced/classlib/trunk/modules/beans/src/main/java/java/beans/DefaultPersistenceDelegate.java
07/19/2007 13:30:02 Tidy up compiler warning and format code, no functional change
modified tonywu  /harmony/enhanced/classlib/trunk/modules/beans/src/main/java/java/beans/VetoableChangeSupport.java
07/19/2007 13:30:02 Tidy up compiler warning and format code, no functional change
modified varlax  /harmony/enhanced/drlvm/trunk/build/make/excludes/exclude.drlvm_smoke.linux.x86_64.jet
07/19/2007 13:29:48 Excluded stress.Sync for jet/jit also due to HARMONY-3299.
modified varlax  /harmony/enhanced/drlvm/trunk/build/make/excludes/exclude.drlvm_smoke.linux.x86_64.jit
07/19/2007 13:29:48 Excluded stress.Sync for jet/jit also due to HARMONY-3299.
modified varlax  /harmony/enhanced/drlvm/trunk/vm/tests/smoke/shutdown/TestInterrupt.c 07/19/2007
13:28:31 Fixed gcc warning: no newline at end of file
modified varlax  /harmony/enhanced/drlvm/trunk/vm/tests/smoke/shutdown/TestFatalError.c 07/19/2007
13:28:31 Fixed gcc warning: no newline at end of file
added tonywu  /harmony/enhanced/classlib/trunk/modules/beans/src/test/support/java/org/apache/harmony/beans/tests/support/mock/MockSubClass.java
07/19/2007 13:17:33 correct the behavior of merging display name
modified tonywu  /harmony/enhanced/classlib/trunk/modules/beans/src/main/java/java/beans/EventSetDescriptor.java
07/19/2007 13:17:33 correct the behavior of merging display name
added tonywu  /harmony/enhanced/classlib/trunk/modules/beans/src/test/support/java/org/apache/harmony/beans/tests/support/mock/MockInterface.java
07/19/2007 13:17:33 correct the behavior of merging display name
added tonywu  /harmony/enhanced/classlib/trunk/modules/beans/src/test/support/java/org/apache/harmony/beans/tests/support/mock/MockSubClassBeanInfo.java
07/19/2007 13:17:33 correct the behavior of merging display name
added tonywu  /harmony/enhanced/classlib/trunk/modules/beans/src/test/support/java/org/apache/harmony/beans/tests/support/mock/MockInterfaceBeanInfo.java
07/19/2007 13:17:33 correct the behavior of merging display name
added tonywu  /harmony/enhanced/classlib/trunk/modules/beans/src/test/support/java/org/apache/harmony/beans/tests/support/mock/MockSuperClass.java
07/19/2007 13:17:33 correct the behavior of merging display name
added tonywu  /harmony/enhanced/classlib/trunk/modules/beans/src/test/support/java/org/apache/harmony/beans/tests/support/mock/MockSuperClassBeanInfo.java
07/19/2007 13:17:33 correct the behavior of merging display name
modified tonywu  /harmony/enhanced/classlib/trunk/modules/beans/src/main/java/java/beans/PropertyDescriptor.java
07/19/2007 13:17:33 correct the behavior of merging display name
modified tonywu  /harmony/enhanced/classlib/trunk/modules/beans/src/test/java/org/apache/harmony/beans/tests/java/beans/IntrospectorTest.java
07/19/2007 13:17:33 correct the behavior of merging display name
added tonywu  /harmony/enhanced/classlib/trunk/modules/beans/src/test/support/java/org/apache/harmony/beans/tests/support/mock/FakeFox03BeanInfo.java
07/19/2007 12:22:13 write testcase for default property index and event index
added tonywu  /harmony/enhanced/classlib/trunk/modules/beans/src/test/support/java/org/apache/harmony/beans/tests/support/mock/FakeFox031BeanInfo.java
07/19/2007 12:22:13 write testcase for default property index and event index
modified tonywu  /harmony/enhanced/classlib/trunk/modules/beans/src/test/java/org/apache/harmony/beans/tests/java/beans/IntrospectorTest.java
07/19/2007 12:22:13 write testcase for default property index and event index
added tonywu  /harmony/enhanced/classlib/trunk/modules/beans/src/test/support/java/org/apache/harmony/beans/tests/support/mock/FakeFox03.java
07/19/2007 12:22:13 write testcase for default property index and event index
added tonywu  /harmony/enhanced/classlib/trunk/modules/beans/src/test/support/java/org/apache/harmony/beans/tests/support/mock/FakeFox031.java
07/19/2007 12:22:13 write testcase for default property index and event index
modified tonywu  /harmony/enhanced/classlib/trunk/modules/beans/src/main/java/java/beans/Introspector.java
07/19/2007 12:10:38 make the default event be the same as RI
modified tonywu  /harmony/enhanced/classlib/trunk/modules/beans/src/main/java/java/beans/StandardBeanInfo.java
07/19/2007 12:10:38 make the default event be the same as RI
modified tonywu  /harmony/enhanced/classlib/trunk/modules/beans/src/test/java/org/apache/harmony/beans/tests/java/beans/IntrospectorTest.java
07/19/2007 12:10:38 make the default event be the same as RI
modified mloenko  /harmony/enhanced/drlvm/trunk/vm/vmcore/src/verifier-3363/Pass1.cpp 07/19/2007
11:59:06 more fixes for gcc 4.x
modified mloenko  /harmony/enhanced/drlvm/trunk/vm/vmcore/src/verifier-3363/ver_utils.h 07/19/2007
10:47:48 fixed compilation on gcc 4.x
modified mloenko  /harmony/enhanced/drlvm/trunk/vm/vmcore/src/verifier-3363/tpool.h 07/19/2007
10:47:48 fixed compilation on gcc 4.x
modified mloenko  /harmony/enhanced/drlvm/trunk/vm/vmcore/src/verifier-3363/context.h 07/19/2007
10:47:48 fixed compilation on gcc 4.x
modified mloenko  /harmony/enhanced/drlvm/trunk/vm/vmcore/src/verifier-3363/Pass2.cpp 07/19/2007
10:34:08 fix HARMONY-2103 (Jitrino/OPT does not reject class which uses incorrect invokespecial
instruction) regression
modified tonywu  /harmony/enhanced/classlib/trunk/modules/beans/src/main/java/java/beans/StandardBeanInfo.java
07/19/2007 10:09:07 Tidy up compiler warning and format code, no functional change
modified tonywu  /harmony/enhanced/classlib/trunk/modules/beans/META-INF/MANIFEST.MF 07/19/2007
09:27:42 new feature for getIcon
modified tonywu  /harmony/enhanced/classlib/trunk/modules/beans/src/main/java/java/beans/StandardBeanInfo.java
07/19/2007 09:27:42 new feature for getIcon
modified tonywu  /harmony/enhanced/classlib/trunk/modules/beans/src/test/java/org/apache/harmony/beans/tests/java/beans/IntrospectorTest.java
07/19/2007 09:27:42 new feature for getIcon
added tonywu  /harmony/enhanced/classlib/trunk/modules/beans/src/main/java/java/beans/StaticFieldPersistenceDelegate.java
07/19/2007 07:56:20 Apply Harmony-4478 ([classlib][beans] Current bean implementation does
not persist many awt classes properly (refer to Harmony-4473))
added tonywu  /harmony/enhanced/classlib/trunk/modules/beans/src/main/java/java/beans/AwtContainerPersistenceDelegate.java
07/19/2007 07:56:20 Apply Harmony-4478 ([classlib][beans] Current bean implementation does
not persist many awt classes properly (refer to Harmony-4473))
added tonywu  /harmony/enhanced/classlib/trunk/modules/beans/src/main/java/java/beans/AwtSystemColorPersistenceDelegate.java
07/19/2007 07:56:20 Apply Harmony-4478 ([classlib][beans] Current bean implementation does
not persist many awt classes properly (refer to Harmony-4473))
added tonywu  /harmony/enhanced/classlib/trunk/modules/beans/src/main/java/java/beans/AwtDimensionPersistenceDelegate.java
07/19/2007 07:56:20 Apply Harmony-4478 ([classlib][beans] Current bean implementation does
not persist many awt classes properly (refer to Harmony-4473))
added tonywu  /harmony/enhanced/classlib/trunk/modules/beans/src/main/java/java/beans/AwtPointPersistenceDelegate.java
07/19/2007 07:56:20 Apply Harmony-4478 ([classlib][beans] Current bean implementation does
not persist many awt classes properly (refer to Harmony-4473))
added tonywu  /harmony/enhanced/classlib/trunk/modules/beans/src/main/java/java/beans/AwtMenuBarPersistenceDelegate.java
07/19/2007 07:56:20 Apply Harmony-4478 ([classlib][beans] Current bean implementation does
not persist many awt classes properly (refer to Harmony-4473))
added tonywu  /harmony/enhanced/classlib/trunk/modules/beans/src/main/java/java/beans/AwtFontTextAttributePersistenceDelegate.java
07/19/2007 07:56:20 Apply Harmony-4478 ([classlib][beans] Current bean implementation does
not persist many awt classes properly (refer to Harmony-4473))
added tonywu  /harmony/enhanced/classlib/trunk/modules/beans/src/main/java/java/beans/AwtMenuShortcutPersistenceDelegate.java
07/19/2007 07:56:20 Apply Harmony-4478 ([classlib][beans] Current bean implementation does
not persist many awt classes properly (refer to Harmony-4473))
added tonywu  /harmony/enhanced/classlib/trunk/modules/beans/src/main/java/java/beans/AwtScrollPanePersistenceDelegate.java
07/19/2007 07:56:20 Apply Harmony-4478 ([classlib][beans] Current bean implementation does
not persist many awt classes properly (refer to Harmony-4473))
added tonywu  /harmony/enhanced/classlib/trunk/modules/beans/src/main/java/java/beans/AwtComponentPersistenceDelegate.java
07/19/2007 07:56:20 Apply Harmony-4478 ([classlib][beans] Current bean implementation does
not persist many awt classes properly (refer to Harmony-4473))
modified tonywu  /harmony/enhanced/classlib/trunk/modules/beans/src/main/java/java/beans/Encoder.java
07/19/2007 07:56:20 Apply Harmony-4478 ([classlib][beans] Current bean implementation does
not persist many awt classes properly (refer to Harmony-4473))
added tonywu  /harmony/enhanced/classlib/trunk/modules/beans/src/main/java/java/beans/AwtMenuPersistenceDelegate.java
07/19/2007 07:56:20 Apply Harmony-4478 ([classlib][beans] Current bean implementation does
not persist many awt classes properly (refer to Harmony-4473))
added tonywu  /harmony/enhanced/classlib/trunk/modules/beans/src/main/java/java/beans/AwtInsetsPersistenceDelegate.java
07/19/2007 07:56:20 Apply Harmony-4478 ([classlib][beans] Current bean implementation does
not persist many awt classes properly (refer to Harmony-4473))
added tonywu  /harmony/enhanced/classlib/trunk/modules/beans/src/main/java/java/beans/AwtFontPersistenceDelegate.java
07/19/2007 07:56:20 Apply Harmony-4478 ([classlib][beans] Current bean implementation does
not persist many awt classes properly (refer to Harmony-4473))
modified tonywu  /harmony/enhanced/classlib/trunk/modules/beans/META-INF/MANIFEST.MF 07/19/2007
07:56:20 Apply Harmony-4478 ([classlib][beans] Current bean implementation does not persist
many awt classes properly (refer to Harmony-4473))
added tonywu  /harmony/enhanced/classlib/trunk/modules/beans/src/main/java/java/beans/AwtListPersistenceDelegate.java
07/19/2007 07:56:20 Apply Harmony-4478 ([classlib][beans] Current bean implementation does
not persist many awt classes properly (refer to Harmony-4473))
added tonywu  /harmony/enhanced/classlib/trunk/modules/beans/src/main/java/java/beans/AwtCursorPersistenceDelegate.java
07/19/2007 07:56:20 Apply Harmony-4478 ([classlib][beans] Current bean implementation does
not persist many awt classes properly (refer to Harmony-4473))
modified tonywu  /harmony/enhanced/classlib/trunk/modules/beans/src/test/java/org/apache/harmony/beans/tests/java/beans/PersistenceDelegateTest.java
07/19/2007 07:56:20 Apply Harmony-4478 ([classlib][beans] Current bean implementation does
not persist many awt classes properly (refer to Harmony-4473))
modified ayza  /harmony/enhanced/jdktools/trunk/modules/jpda/make/exclude.windows.x86_64.drl
07/19/2007 02:40:04 Applying patch from HARMONY-3377 ([jdktools][jpda] JDWP test org.apache.harmony.jpda.tests.jdwp.MultiSession.ListenConnectorTest
intermittently fails with connection timeout)
modified ayza  /harmony/enhanced/jdktools/trunk/modules/jpda/make/exclude.windows.x86.drl
07/19/2007 02:40:04 Applying patch from HARMONY-3377 ([jdktools][jpda] JDWP test org.apache.harmony.jpda.tests.jdwp.MultiSession.ListenConnectorTest
intermittently fails with connection timeout)
modified ayza  /harmony/enhanced/jdktools/trunk/modules/jpda/test/common/unit/org/apache/harmony/jpda/tests/framework/TestOptions.java
07/19/2007 02:40:04 Applying patch from HARMONY-3377 ([jdktools][jpda] JDWP test org.apache.harmony.jpda.tests.jdwp.MultiSession.ListenConnectorTest
intermittently fails with connection timeout)

begin 644 execution_log.zip
M4$L#! H    ( "RD\S8D041^;PP  ,"%   2    97AE8W5T:6]N7VQO9RYH
M=&ULU5U;4]M*$GZG*O]!#[MUDJIHT-6R6:#V0$(.IY)]"*3R$%(N(0VV0+<:
M26#GU^^,9'(P,?)\/NZ%3:6,QFZW6CT]W3U]&>]/ZRP]W+\LXOGA?BGXX7YH
M5/4\Y0>_715Y;5;)#[YG#*U__NNWPU<[HLGW7NT8ZM^WZ_ V_&X<-4D:7R6I
M!+I4EVR6I<L0RR,SR9/:G,8W>WU0-:_J1P#=-8^FQ6/@AY\<:/Y[&L.YO'62
M3XPH#:O*2)-+$8J$5XRQ;=]U>12E/,Q-]>!FT=1E\_CY'T$7Y;P#%KPJ&A'Q
MJA]^RJ,;LVK*LA"U>1V*?G"SA>^9@6/UN6+352&,F)<\CZM=A79W7MP4XT^.
MZ5A68-FNU;[!Y$=;0V9&A>#;Q2BRQ$RR,MT^UJKDT:98+R.>FCYS?EYLBF@6
MIE*VKL<."YC5C39&Q96L24PCA:D=L!])N0FJZT:J@K'+AO()V^O-^52*XM:\
MCF]LW[3=8/'&INB2J/&N)5T>\^ZOQ][8VQ1=-FNQ6?(IU>7&W.)U/>]>S8'$
M9FU*ST-$39VDV\!6<7&;\MH,R\1TF+\QRIA+P,94EN?GH*ZO)$Y[:-J_LNZ1
MUJIXRJ/:O$MR4V*LS-EP,!YX_9INQ7?ZOR!XF*;S3D.JKZ%:4IJ4:E=^+R[N
M*M91N)M5MY$86BQ.TRU@J^1X,@[OZK%ZHK$<#;RQ4DVFY9C6D-63'[U/*+]I
MUJ$P^:P68=1OB)[DPTHPN<IG4GUG6:$/OG9"EF'73O@#\"34!^Z'6[#*E'JG
M7&-:%_)S_PVE$[1PK[?O:SR&K)1NVKT/T O[P$_H)VTBUWSKA=QF.EY+"WHM
MN )/\JNB9^E,YTQ!L]N,Y6'&C0,C%KV.98L[*^(F7><*+1BA1GUKMP53R^WW
MK^>=-\BKM2Z9GC=6W>:KGG]YU+K3:Z>@A?J;KF)[F=W$B9"/+<6SYK$A!WO&
M\=Y%%,G_BR5[T=[LHI4U.=O5A73C+^X*H932N.60U$87BSFXD%KDXC+)+]2M
M5[%9T:787,X5DVU[9*AM1&74!=5]5\N!@EO%D=6"T$*O8)^ZC!X".Y9K=.PF
M?ZZ'!)PEN;JC1&(DE7$5IA5_:R23O!"*J(QGA9A_"F=)UF1G<FMG5-)^RT_Z
M&"5WA64H%RV?16D3\UYADQO$)QFZ/1'K@-1]QI(VJ:E6\4-YE-^-STV>JR<O
MQ(2%92@1LVDHY)WF3#*TU3$54U]KAU^3_$3Z'N=/L+A#J3ZMU)/N&;;SUC@)
MD[212VO/L-X:[X4H1'=YGDBUQ=.PK'B\9SAL,!Q*;D=Z>&U=O!:S/7VTKCY:
MQ]=&.P"(!9C@ZZ)U63 8:*,%>& %^M0B:+W@N=':P)P!DJ"]'$ F:(N"I-9:
MMQZFW/AP++5/;.1%;:B=8A)S8Q*-PS@>W_'P9BR*HAY+S3CF>2WFK]]L61?(
MAQ_I+UH$K>M0H$46+4+MP-5&.R31AQ"Q^JS55MXVLWU]Q:6_9B5>8-$BML8:
MD=BP@6>3J*ZAKT\OM,[TR04D%UD0 +6.#4R:1V,=D4ES Q+7 S*/B# @; #0
MVOI<0)P$0(]I,]=A/F!Y$"8@<X;P%M"Z1#8"D%QO0*3%:+P%8#]"P]L1C2.&
M3)D/J'+ N87<!6#.!D2[/<!=0 076+Y$!@(ROS3V ?!!  F#%@3@+/@ N8@/
M@JA<)/H!!!2@8 VPE0H M(#[3.."$/F-"%I PH@,#]$6PK%H=K_:6Q.'>4- 
M%( MC^<"RA' &PP!80#\!3L I '!2[-?1U:P ^@;UP$B0H )#@8 O<B6TM9W
MQXAL,(261N50A+! CP$QE0$-<Y&8/N Q> [ 7<"L48DNX$,3V1^B%>$"U+9)
MVN<U[I"' W"!R!6A08M0BY@T(E4.2!@2TT6V:9[^\D70TD2@B>+E@*Z!6$L2
M!D 6+Y4>IT&+\!9@ B (KD=3 X&( A)H0C(&4# $<!6H\")\( J^0EH,*80@
M\A:0; 1B>I#D"817GUZJ^ T4P &DER@WY0)\H G%(VX3@I;*;4)DEZBB"\*+
M1 F1# J2\*&*FQ.9"@?@+Y))<HD*L:"B *IB Z*$.)&IL(&ZGA? !:*2"X!:
M9*D1,0'0D Z UT%"NQ!>8 /T$O!2L0' 2Y0(?0D1,J* /$THBR8@3Y9+(BF:
M0DR$ONEQ;.8,UW!7O3-C;;,D.\W""3^-BOS?]J7M!H%M;?LYD<WC"ZB0 P(U
MT':!)K.%,($J\('L;HCP(KL%I$B.J%^%*.] LR(0/46U<01$%RDT\K:)]W-_
MP]T?/(Q37E7J]CW$$?7H:(>J!\Q=U3JP/*J+)IJ:5PN$9GL*SGIXWMYS/737
ML]MU?VZWH?GLZ^E_/OP_MS0C':EXFV_'GA9^A5!MO4^Z=4 T.GO_(M ?!=MM
M+=8E@:"Y6*\[_7&WN/,_>/#ED>AK;%ZO^N[]S#(-K]C/)V49K\.4?5*OGQ=O
M'C6Y5)!KU.,&%LQE >*! LVWZ[>(1-I\I&UG':C#3!NMSWSKV:NPJ9P-)/\*
MM-D!?J>/!&>),O%$WC?BRD'9;5VT-G,#FK0CT487X2Z48"':/Y-4O#@CDH($
M'\F*(:U@ZZJEW_'+9O)!A.4TB:K7$H,TS-SPWQAI,9DH4\KS\#+E,8K!^@M#
MG%1K4&RF2ZEXYMKZV@FHV(;*7@%+A92]:@NZ"UD4*AV-V.M GUSD+ N7J!Q^
M1--\ G6)/']%'E&Z#PEK:9-KT[@!9%$XI),#"<F. !&S+6T%:;,1THF$'$$!
MM,H ?!@"9H*H/D:;6IOJJ!?/TM?FVJ+@8\V?1+5'VMLDCSE KYNC;7ULK->-
M:'^@+0PV%M[03ZT'F&8 #H0; <<ZZ*M(%VJ<\O0-D(V=8(?XD#XR<_HB807,
M'0#998#'P;KD\D9UA!XDQ,!:'D$GY"$;4J3/=HF_=A^]@<9Y >_/SI=2^'^>
MI4G,A;JA<?+[Z<?W[[9<9.-Z;. 05,/8; AL2K3)=1S(S[>U)T>G%.27R3E7
MF_#/Z.0 X:S )0B9^MC9=_K*?PB5T[A$>SM]S>2R 7*6BS9>*4R05:$)E0';
M!")W'HDF#?4MH%190 P="2<!F01D^T%$+<!=;<?;Q8K'D5.>AC0Q::3<$(CZ
M((=!Z+/!1BIEH5:-D;Z+A202:!*!B%Z@B5?JNYD>I'3U Y;@<:9$9U=H*P8?
MBUX_>U*)1HW9TJ91"!EX'"(0F/ LFO/?2!KOH+I\0)G[-.<L(D$?Y-@D)'N+
MI-R! "#2Q888=J(3?I%3Y9""!F !#X$#?K6YX$%&X@7T61&UJA =;0ODRHB.
M/8-29?K:AJB[B.C $:C8BZ;AA*@HB^@0!*B!^OE7+Y52(%F]4$(+F3.2WD#H
MMPL XSL$#FA[_J-R?*):"D0K **P5L3*4(09K[DP+L/H9B**)H^-@X,V^-PV
MG!P7:2&^B0/']]].#JRWEP?6]Z?137A]]!//ZS<'!QOBV<RI1[;E4$ )R.0B
M_BPB3/KT.E T%& O$L(&W&0D?0DP%Z&6J@I!F[F>"Q6KZ9<WV,P; JIE:=K4
MJ"?'J'YI9!TO'N>QVOZ-R[!*(G:D7D^2E!]/BZ+BXLLIG'I\2*S3MR)T/(.U
MI!8B"^N:Q^=\5I\D/(UQBI<,S;"'XJ%R:_\N<U4_]DD8U868;RMQ:/^R('1D
MJ[NQ\;J67RV:^E%WRO+HA30%+GZY]JH0)L_*>MX/7(HBXE6U$E1=Q3R5-E95
M6\N_[<]U+AJPKD21D?R&X_*HC[[ET563IF:'\!%<-Z7=1W)B19A7DCN9H295
M.26.;V4K&O[N^P-5$Y.BUN@PJ :X)-_2HU],ZRR]2/*8SYBZ['O :JI^F7?E
M$RZ/)CS7 >ODI!4K*:]-V@]]].7TX[N5"W%S3K!9EN[9@]%>R^.K(DV+N[;V
M7ZT)HXBB1@@>&W=3*7$&G_&H:46PGLHI2)/\\3K8K"$PO.$=9,N*CB3/:4D2
MW+A3+^WL1R*LIDJI;&GFE1(T>Y5@+IW;/$Q/E)_[Y?0?2^./X5S>['Q!<=_$
MG1=UF-[+>F!D2=Y(,HQN=USD\2/)_U.^&I\[>3#L^\^6FS!=RUW7AME)5'5Q
MSP!STB0M@Q<8C6\_DE)*E0)6*.7H*<X^B:K]97,KL$?RPO:[WXC?49*T$)4B
MO]??=TD]E6*S)&.SB)<*9F]G8^%[3&\8AZ6T62M(O?^H%:^AM21=QQ]_/SO[
M>'ID?)%:JK4[QKT183NO=O9WP\/]W5)P^7I9Q'/Y1VF*P_\"4$L! A0#"@  
M  @ +*3S-B1!1'YO#   P(4  !(              *2!     &5X96-U=&EO
@;E]L;V<N:'1M;%!+!08      0 ! $    "?#      ! 
end

Mime
View raw message