harmony-alerts mailing list archives

Site index · List index
Message view « Date » · « Thread »
Top « Date » · « Thread »
From nom...@intel.com
Subject [build-test alert] BUILD FAILED Linux x86: classlib-test
Date Thu, 19 Jul 2007 13:03:42 GMT
BUILD FAILED:
	Ant Error Message:
/export/users/cc/cc-common/scripts/cc-exec-adaptor.xml:101: The following error occurred while executing this line: /export/users/cc/cc-common/adaptors/classlib-test/adaptor.xml:80: There were CLASSLIB Unit Test failures.

Date of build:	07/19/2007 19:28:49
Time to build:	34 minutes 11 seconds
Last changed:	07/19/2007 19:07:49
Last log entry:	hdk

***********************************************************
Errors/Warnings:	(8)
            
[junit] Tests FAILED
[junit] Tests FAILED
BUILD FAILED
/export/users/cc/cc-common/build/checkouts/hdk/working_classlib/build.xml:169: The following error occurred while executing this line:
/export/users/cc/cc-common/build/checkouts/hdk/working_classlib/make/build-test.xml:147: There were test errors.
Total time: 34 minutes 4 seconds
The execution FAILED with the following exception:
The following error occurred while executing this line:
/export/users/cc/cc-common/adaptors/classlib-test/adaptor.xml:80: There were CLASSLIB Unit Test failures.

***********************************************************
Unit Tests: (15379)
        
error: testInstantiate_Normal org.apache.harmony.beans.ArrayPersistenceDelegateTest
error: testInstantiate_Normal org.apache.harmony.beans.ClassPersistenceDelegateTest
error: testInstantiate_Primitive org.apache.harmony.beans.ClassPersistenceDelegateTest
error: testInstantiate_Class org.apache.harmony.beans.ClassPersistenceDelegateTest
error: testInstantiate_Normal org.apache.harmony.beans.StringPersistenceDelegateTest
error: test_instantiate_with_applet org.apache.harmony.beans.tests.java.beans.BeansTest
error: testStringPD org.apache.harmony.beans.tests.java.beans.CustomizedPersistenceDelegateTest
error: testArrayPD org.apache.harmony.beans.tests.java.beans.CustomizedPersistenceDelegateTest
error: testClassPD org.apache.harmony.beans.tests.java.beans.CustomizedPersistenceDelegateTest
error: testProxyPD org.apache.harmony.beans.tests.java.beans.CustomizedPersistenceDelegateTest
error: testPrimitivePD org.apache.harmony.beans.tests.java.beans.CustomizedPersistenceDelegateTest
error: testMethodPD org.apache.harmony.beans.tests.java.beans.CustomizedPersistenceDelegateTest
error: testFieldPD org.apache.harmony.beans.tests.java.beans.CustomizedPersistenceDelegateTest
error: testInstantiate_Normal org.apache.harmony.beans.tests.java.beans.DefaultPersistenceDelegateTest
error: testInstantiate_NullInstance org.apache.harmony.beans.tests.java.beans.DefaultPersistenceDelegateTest
error: testInstantiate_NullProperty org.apache.harmony.beans.tests.java.beans.DefaultPersistenceDelegateTest
error: testInstantiate_NoProperty org.apache.harmony.beans.tests.java.beans.DefaultPersistenceDelegateTest
error: testInstantiate_NonExistingGetter org.apache.harmony.beans.tests.java.beans.DefaultPersistenceDelegateTest
error: testInstantiate_InvalidGetter org.apache.harmony.beans.tests.java.beans.DefaultPersistenceDelegateTest
error: testInstantiate_ExceptionalGetter org.apache.harmony.beans.tests.java.beans.DefaultPersistenceDelegateTest
error: testInstantiate_ErrorGetter org.apache.harmony.beans.tests.java.beans.DefaultPersistenceDelegateTest
error: testInstantiate_PrivateGetter org.apache.harmony.beans.tests.java.beans.DefaultPersistenceDelegateTest
error: testInstantiate_InitialUpperCasePropName org.apache.harmony.beans.tests.java.beans.DefaultPersistenceDelegateTest
error: testInstantiate_NoGetter org.apache.harmony.beans.tests.java.beans.DefaultPersistenceDelegateTest
error: testInstantiate_NotRegularGetter org.apache.harmony.beans.tests.java.beans.DefaultPersistenceDelegateTest
error: test_initialize org.apache.harmony.beans.tests.java.beans.DefaultPersistenceDelegateTest
error: testInitialize_Normal org.apache.harmony.beans.tests.java.beans.DefaultPersistenceDelegateTest
error: testInitialize_NormalBeanInfo org.apache.harmony.beans.tests.java.beans.DefaultPersistenceDelegateTest
error: testInitialize_TransientProperty org.apache.harmony.beans.tests.java.beans.DefaultPersistenceDelegateTest
error: testInitialize_NoSetter org.apache.harmony.beans.tests.java.beans.DefaultPersistenceDelegateTest
error: testInitialize_NoGetter org.apache.harmony.beans.tests.java.beans.DefaultPersistenceDelegateTest
error: testInitialize_NullClass org.apache.harmony.beans.tests.java.beans.DefaultPersistenceDelegateTest
error: testInitialize_NullInstances org.apache.harmony.beans.tests.java.beans.DefaultPersistenceDelegateTest
error: testArrayPD_Normal org.apache.harmony.beans.tests.java.beans.DefaultPersistenceDelegateTest
error: testGetExceptionListener org.apache.harmony.beans.tests.java.beans.EncoderTest
error: testSetExceptionListener_Null org.apache.harmony.beans.tests.java.beans.EncoderTest
error: testSetExceptionListener org.apache.harmony.beans.tests.java.beans.EncoderTest
error: testWriteExpression_Null org.apache.harmony.beans.tests.java.beans.EncoderTest
error: testWriteStatement_Null org.apache.harmony.beans.tests.java.beans.EncoderTest
error: testWriteObject_Null org.apache.harmony.beans.tests.java.beans.EncoderTest
error: testWriteObject org.apache.harmony.beans.tests.java.beans.EncoderTest
error: testGetPersistenceDelegate_Null org.apache.harmony.beans.tests.java.beans.EncoderTest
error: testGetPersistenceDelegate_ArrayClass org.apache.harmony.beans.tests.java.beans.EncoderTest
error: testGetPersistenceDelegate_ProxyClass org.apache.harmony.beans.tests.java.beans.EncoderTest
error: testGetPersistenceDelegate_BeanInfo org.apache.harmony.beans.tests.java.beans.EncoderTest
error: testGetPersistenceDelegate_Default org.apache.harmony.beans.tests.java.beans.EncoderTest
error: testSetPersistenceDelegate_Null org.apache.harmony.beans.tests.java.beans.EncoderTest
error: testSetPersistenceDelegate org.apache.harmony.beans.tests.java.beans.EncoderTest
error: testGet_NullParam org.apache.harmony.beans.tests.java.beans.EncoderTest
error: testGet_String org.apache.harmony.beans.tests.java.beans.EncoderTest
error: testGet_Integer org.apache.harmony.beans.tests.java.beans.EncoderTest
error: testRemove_Null org.apache.harmony.beans.tests.java.beans.EncoderTest
error: testRemove_String org.apache.harmony.beans.tests.java.beans.EncoderTest
error: testRemove_Integer org.apache.harmony.beans.tests.java.beans.EncoderTest
error: testWriteObject_NormalMutatesToTrue org.apache.harmony.beans.tests.java.beans.PersistenceDelegateTest
error: testWriteObject_NormalMutatesToFalse org.apache.harmony.beans.tests.java.beans.PersistenceDelegateTest
error: testWriteObject_NullObject org.apache.harmony.beans.tests.java.beans.PersistenceDelegateTest
error: testInitialize_Normal org.apache.harmony.beans.tests.java.beans.PersistenceDelegateTest
error: testInitialize_NullClass org.apache.harmony.beans.tests.java.beans.PersistenceDelegateTest
error: testInitialize_NullInstances org.apache.harmony.beans.tests.java.beans.PersistenceDelegateTest
error: testInitialize_circularRedundancy org.apache.harmony.beans.tests.java.beans.PersistenceDelegateTest
error: test_writeObject_Null_LXMLEncoder org.apache.harmony.beans.tests.java.beans.PersistenceDelegateTest
error: test_writeObject_java_lang_reflect_Field org.apache.harmony.beans.tests.java.beans.PersistenceDelegateTest
error: test_writeObject_java_lang_reflect_Method org.apache.harmony.beans.tests.java.beans.PersistenceDelegateTest
error: test_writeObject_java_util_Collection org.apache.harmony.beans.tests.java.beans.PersistenceDelegateTest
error: test_writeObject_java_awt_Choice org.apache.harmony.beans.tests.java.beans.PersistenceDelegateTest
error: test_writeObject_java_awt_SystemColor org.apache.harmony.beans.tests.java.beans.PersistenceDelegateTest
error: test_writeObject_java_awt_font_TextAttribute org.apache.harmony.beans.tests.java.beans.PersistenceDelegateTest
error: test_writeObject_java_awt_MenuShortcut org.apache.harmony.beans.tests.java.beans.PersistenceDelegateTest
error: test_writeObject_java_awt_Component org.apache.harmony.beans.tests.java.beans.PersistenceDelegateTest
error: test_writeObject_java_awt_Container org.apache.harmony.beans.tests.java.beans.PersistenceDelegateTest
error: test_writeObject_java_awt_Menu org.apache.harmony.beans.tests.java.beans.PersistenceDelegateTest
error: test_writeObject_java_awt_MenuBar org.apache.harmony.beans.tests.java.beans.PersistenceDelegateTest
error: test_writeObject_java_awt_List org.apache.harmony.beans.tests.java.beans.PersistenceDelegateTest
error: test_writeObject_java_awt_BorderLayout org.apache.harmony.beans.tests.java.beans.PersistenceDelegateTest
error: test_writeObject_java_awt_CardLayout org.apache.harmony.beans.tests.java.beans.PersistenceDelegateTest
error: test_writeObject_java_awt_GridBagLayout org.apache.harmony.beans.tests.java.beans.PersistenceDelegateTest
error: test_writeObject_java_awt_Cursor org.apache.harmony.beans.tests.java.beans.PersistenceDelegateTest
error: test_writeObject_java_awt_Insets org.apache.harmony.beans.tests.java.beans.PersistenceDelegateTest
error: test_writeObject_java_awt_point org.apache.harmony.beans.tests.java.beans.PersistenceDelegateTest
error: test_writeObject_java_awt_ScrollPane org.apache.harmony.beans.tests.java.beans.PersistenceDelegateTest
error: test_writeObject_java_util_Map org.apache.harmony.beans.tests.java.beans.PersistenceDelegateTest
error: testFontEditor org.apache.harmony.beans.tests.java.beans.PropertyEditorManagerTest
error: testLoadImage org.apache.harmony.beans.tests.java.beans.SimpleBeanInfoTest
error: testAvoidGui org.apache.harmony.beans.tests.java.beans.beancontext.BeanContextSupportTest
Unit Test Error Details:	(85)
                
Test: testInstantiate_NormalClass: org.apache.harmony.beans.ArrayPersistenceDelegateTestjava.lang.ExceptionInInitializerError
	at java.lang.reflect.VMField.getObject(VMField.java)
	at java.lang.reflect.Field.get(Field.java:163)
	at java.beans.StaticFieldPersistenceDelegate.init(StaticFieldPersistenceDelegate.java:36)
	at java.beans.AwtSystemColorPersistenceDelegate.<clinit>(AwtSystemColorPersistenceDelegate.java:28)
	at java.beans.Encoder.<clinit>(Encoder.java:102)
	at org.apache.harmony.beans.ArrayPersistenceDelegateTest.testInstantiate_Normal(ArrayPersistenceDelegateTest.java:52)
	at java.lang.reflect.VMReflection.invokeMethod(VMReflection.java)
Caused by: java.lang.NullPointerException
	at java.awt.Toolkit.init(Toolkit.java:565)
	at java.awt.Toolkit.<init>(Toolkit.java:539)
	at java.awt.ToolkitImpl.<init>(ToolkitImpl.java:39)
	at java.awt.Toolkit.getDefaultToolkit(Toolkit.java:471)
	at java.awt.SystemColor.<init>(SystemColor.java:143)
	at java.awt.SystemColor.<clinit>(SystemColor.java:91)
	at java.lang.reflect.VMField.getObject(VMField.java)
	... 18 more
Test: testInstantiate_NormalClass: org.apache.harmony.beans.ClassPersistenceDelegateTestjava.lang.NoClassDefFoundError: java/beans/Encoder
	at org.apache.harmony.beans.ClassPersistenceDelegateTest.testInstantiate_Normal(ClassPersistenceDelegateTest.java:50)
	at java.lang.reflect.VMReflection.invokeMethod(VMReflection.java)
Test: testInstantiate_PrimitiveClass: org.apache.harmony.beans.ClassPersistenceDelegateTestjava.lang.NoClassDefFoundError: java/beans/Encoder
	at org.apache.harmony.beans.ClassPersistenceDelegateTest.testInstantiate_Primitive(ClassPersistenceDelegateTest.java:60)
	at java.lang.reflect.VMReflection.invokeMethod(VMReflection.java)
Test: testInstantiate_ClassClass: org.apache.harmony.beans.ClassPersistenceDelegateTestjava.lang.NoClassDefFoundError: java/beans/Encoder
	at org.apache.harmony.beans.ClassPersistenceDelegateTest.testInstantiate_Class(ClassPersistenceDelegateTest.java:70)
	at java.lang.reflect.VMReflection.invokeMethod(VMReflection.java)
Test: testInstantiate_NormalClass: org.apache.harmony.beans.StringPersistenceDelegateTestjava.lang.NoClassDefFoundError: java/beans/Encoder
	at org.apache.harmony.beans.StringPersistenceDelegateTest.testInstantiate_Normal(StringPersistenceDelegateTest.java:50)
	at java.lang.reflect.VMReflection.invokeMethod(VMReflection.java)
Test: test_instantiate_with_appletClass: org.apache.harmony.beans.tests.java.beans.BeansTestjava.lang.NullPointerException
	at java.awt.Toolkit.init(Toolkit.java:565)
	at java.awt.Toolkit.<init>(Toolkit.java:539)
	at java.awt.ToolkitImpl.<init>(ToolkitImpl.java:39)
	at java.awt.Toolkit.getDefaultToolkit(Toolkit.java:471)
	at java.awt.FlowLayout.<init>(FlowLayout.java:42)
	at java.awt.FlowLayout.<init>(FlowLayout.java:60)
	at java.awt.Panel.<init>(Panel.java:48)
	at java.applet.Applet.<init>(Applet.java:90)
	at java.lang.reflect.VMReflection.newClassInstance(VMReflection.java)
	at java.lang.reflect.Constructor.newInstance(Constructor.java:283)
	at java.lang.Class.newInstance(Class.java:694)
	at java.beans.Beans.instantiate(Beans.java:182)
	at java.beans.Beans.instantiate(Beans.java:74)
	at org.apache.harmony.beans.tests.java.beans.BeansTest.test_instantiate_with_applet(BeansTest.java:451)
	at java.lang.reflect.VMReflection.invokeMethod(VMReflection.java)
Test: testStringPDClass: org.apache.harmony.beans.tests.java.beans.CustomizedPersistenceDelegateTestjava.lang.ExceptionInInitializerError
	at java.lang.reflect.VMField.getObject(VMField.java)
	at java.lang.reflect.Field.get(Field.java:163)
	at java.beans.StaticFieldPersistenceDelegate.init(StaticFieldPersistenceDelegate.java:36)
	at java.beans.AwtSystemColorPersistenceDelegate.<clinit>(AwtSystemColorPersistenceDelegate.java:28)
	at java.beans.Encoder.<clinit>(Encoder.java:102)
	at org.apache.harmony.beans.tests.java.beans.CustomizedPersistenceDelegateTest.setUp(CustomizedPersistenceDelegateTest.java:43)
Caused by: java.lang.NullPointerException
	at java.awt.Toolkit.init(Toolkit.java:565)
	at java.awt.Toolkit.<init>(Toolkit.java:539)
	at java.awt.ToolkitImpl.<init>(ToolkitImpl.java:39)
	at java.awt.Toolkit.getDefaultToolkit(Toolkit.java:471)
	at java.awt.SystemColor.<init>(SystemColor.java:143)
	at java.awt.SystemColor.<clinit>(SystemColor.java:91)
	at java.lang.reflect.VMField.getObject(VMField.java)
	... 15 more
Test: testArrayPDClass: org.apache.harmony.beans.tests.java.beans.CustomizedPersistenceDelegateTestjava.lang.NoClassDefFoundError: org/apache/harmony/beans/tests/java/beans/CustomizedPersistenceDelegateTest$MockEncoder
	at org.apache.harmony.beans.tests.java.beans.CustomizedPersistenceDelegateTest.setUp(CustomizedPersistenceDelegateTest.java:43)
Test: testClassPDClass: org.apache.harmony.beans.tests.java.beans.CustomizedPersistenceDelegateTestjava.lang.NoClassDefFoundError: org/apache/harmony/beans/tests/java/beans/CustomizedPersistenceDelegateTest$MockEncoder
	at org.apache.harmony.beans.tests.java.beans.CustomizedPersistenceDelegateTest.setUp(CustomizedPersistenceDelegateTest.java:43)
Test: testProxyPDClass: org.apache.harmony.beans.tests.java.beans.CustomizedPersistenceDelegateTestjava.lang.NoClassDefFoundError: org/apache/harmony/beans/tests/java/beans/CustomizedPersistenceDelegateTest$MockEncoder
	at org.apache.harmony.beans.tests.java.beans.CustomizedPersistenceDelegateTest.setUp(CustomizedPersistenceDelegateTest.java:43)
Test: testPrimitivePDClass: org.apache.harmony.beans.tests.java.beans.CustomizedPersistenceDelegateTestjava.lang.NoClassDefFoundError: org/apache/harmony/beans/tests/java/beans/CustomizedPersistenceDelegateTest$MockEncoder
	at org.apache.harmony.beans.tests.java.beans.CustomizedPersistenceDelegateTest.setUp(CustomizedPersistenceDelegateTest.java:43)
Test: testMethodPDClass: org.apache.harmony.beans.tests.java.beans.CustomizedPersistenceDelegateTestjava.lang.NoClassDefFoundError: org/apache/harmony/beans/tests/java/beans/CustomizedPersistenceDelegateTest$MockEncoder
	at org.apache.harmony.beans.tests.java.beans.CustomizedPersistenceDelegateTest.setUp(CustomizedPersistenceDelegateTest.java:43)
Test: testFieldPDClass: org.apache.harmony.beans.tests.java.beans.CustomizedPersistenceDelegateTestjava.lang.NoClassDefFoundError: org/apache/harmony/beans/tests/java/beans/CustomizedPersistenceDelegateTest$MockEncoder
	at org.apache.harmony.beans.tests.java.beans.CustomizedPersistenceDelegateTest.setUp(CustomizedPersistenceDelegateTest.java:43)
Test: testInstantiate_NormalClass: org.apache.harmony.beans.tests.java.beans.DefaultPersistenceDelegateTestjava.lang.NoClassDefFoundError: java/beans/Encoder
	at org.apache.harmony.beans.tests.java.beans.DefaultPersistenceDelegateTest.testInstantiate_Normal(DefaultPersistenceDelegateTest.java:111)
	at java.lang.reflect.VMReflection.invokeMethod(VMReflection.java)
Test: testInstantiate_NullInstanceClass: org.apache.harmony.beans.tests.java.beans.DefaultPersistenceDelegateTestjava.lang.NoClassDefFoundError: java/beans/Encoder
	at org.apache.harmony.beans.tests.java.beans.DefaultPersistenceDelegateTest.testInstantiate_NullInstance(DefaultPersistenceDelegateTest.java:127)
	at java.lang.reflect.VMReflection.invokeMethod(VMReflection.java)
Test: testInstantiate_NullPropertyClass: org.apache.harmony.beans.tests.java.beans.DefaultPersistenceDelegateTestjava.lang.NoClassDefFoundError: java/beans/Encoder
	at org.apache.harmony.beans.tests.java.beans.DefaultPersistenceDelegateTest.testInstantiate_NullProperty(DefaultPersistenceDelegateTest.java:161)
	at java.lang.reflect.VMReflection.invokeMethod(VMReflection.java)
Test: testInstantiate_NoPropertyClass: org.apache.harmony.beans.tests.java.beans.DefaultPersistenceDelegateTestjava.lang.NoClassDefFoundError: java/beans/Encoder
	at org.apache.harmony.beans.tests.java.beans.DefaultPersistenceDelegateTest.testInstantiate_NoProperty(DefaultPersistenceDelegateTest.java:188)
	at java.lang.reflect.VMReflection.invokeMethod(VMReflection.java)
Test: testInstantiate_NonExistingGetterClass: org.apache.harmony.beans.tests.java.beans.DefaultPersistenceDelegateTestjava.lang.NoClassDefFoundError: java/beans/Encoder
	at org.apache.harmony.beans.tests.java.beans.DefaultPersistenceDelegateTest.testInstantiate_NonExistingGetter(DefaultPersistenceDelegateTest.java:204)
	at java.lang.reflect.VMReflection.invokeMethod(VMReflection.java)
Test: testInstantiate_InvalidGetterClass: org.apache.harmony.beans.tests.java.beans.DefaultPersistenceDelegateTestjava.lang.NoClassDefFoundError: java/beans/Encoder
	at org.apache.harmony.beans.tests.java.beans.DefaultPersistenceDelegateTest.testInstantiate_InvalidGetter(DefaultPersistenceDelegateTest.java:257)
	at java.lang.reflect.VMReflection.invokeMethod(VMReflection.java)
Test: testInstantiate_ExceptionalGetterClass: org.apache.harmony.beans.tests.java.beans.DefaultPersistenceDelegateTestjava.lang.NoClassDefFoundError: java/beans/Encoder
	at org.apache.harmony.beans.tests.java.beans.DefaultPersistenceDelegateTest.testInstantiate_ExceptionalGetter(DefaultPersistenceDelegateTest.java:275)
	at java.lang.reflect.VMReflection.invokeMethod(VMReflection.java)
Test: testInstantiate_ErrorGetterClass: org.apache.harmony.beans.tests.java.beans.DefaultPersistenceDelegateTestjava.lang.NoClassDefFoundError: java/beans/Encoder
	at org.apache.harmony.beans.tests.java.beans.DefaultPersistenceDelegateTest.testInstantiate_ErrorGetter(DefaultPersistenceDelegateTest.java:293)
	at java.lang.reflect.VMReflection.invokeMethod(VMReflection.java)
Test: testInstantiate_PrivateGetterClass: org.apache.harmony.beans.tests.java.beans.DefaultPersistenceDelegateTestjava.lang.NoClassDefFoundError: java/beans/Encoder
	at org.apache.harmony.beans.tests.java.beans.DefaultPersistenceDelegateTest.testInstantiate_PrivateGetter(DefaultPersistenceDelegateTest.java:311)
	at java.lang.reflect.VMReflection.invokeMethod(VMReflection.java)
Test: testInstantiate_InitialUpperCasePropNameClass: org.apache.harmony.beans.tests.java.beans.DefaultPersistenceDelegateTestjava.lang.NoClassDefFoundError: java/beans/Encoder
	at org.apache.harmony.beans.tests.java.beans.DefaultPersistenceDelegateTest.testInstantiate_InitialUpperCasePropName(DefaultPersistenceDelegateTest.java:329)
	at java.lang.reflect.VMReflection.invokeMethod(VMReflection.java)
Test: testInstantiate_NoGetterClass: org.apache.harmony.beans.tests.java.beans.DefaultPersistenceDelegateTestjava.lang.NoClassDefFoundError: java/beans/Encoder
	at org.apache.harmony.beans.tests.java.beans.DefaultPersistenceDelegateTest.testInstantiate_NoGetter(DefaultPersistenceDelegateTest.java:342)
	at java.lang.reflect.VMReflection.invokeMethod(VMReflection.java)
Test: testInstantiate_NotRegularGetterClass: org.apache.harmony.beans.tests.java.beans.DefaultPersistenceDelegateTestjava.lang.NoClassDefFoundError: java/beans/Encoder
	at org.apache.harmony.beans.tests.java.beans.DefaultPersistenceDelegateTest.testInstantiate_NotRegularGetter(DefaultPersistenceDelegateTest.java:368)
	at java.lang.reflect.VMReflection.invokeMethod(VMReflection.java)
Test: test_initializeClass: org.apache.harmony.beans.tests.java.beans.DefaultPersistenceDelegateTestjava.lang.NoClassDefFoundError: java/beans/Encoder
	at org.apache.harmony.beans.tests.java.beans.DefaultPersistenceDelegateTest.test_initialize(DefaultPersistenceDelegateTest.java:503)
	at java.lang.reflect.VMReflection.invokeMethod(VMReflection.java)
Test: testInitialize_NormalClass: org.apache.harmony.beans.tests.java.beans.DefaultPersistenceDelegateTestjava.lang.NoClassDefFoundError: java/beans/Encoder
	at org.apache.harmony.beans.tests.java.beans.DefaultPersistenceDelegateTest.testInitialize_Normal(DefaultPersistenceDelegateTest.java:595)
	at java.lang.reflect.VMReflection.invokeMethod(VMReflection.java)
Test: testInitialize_NormalBeanInfoClass: org.apache.harmony.beans.tests.java.beans.DefaultPersistenceDelegateTestjava.lang.NoClassDefFoundError: org/apache/harmony/beans/tests/java/beans/DefaultPersistenceDelegateTest$CollectingEncoder
	at org.apache.harmony.beans.tests.java.beans.DefaultPersistenceDelegateTest.testInitialize_NormalBeanInfo(DefaultPersistenceDelegateTest.java:624)
	at java.lang.reflect.VMReflection.invokeMethod(VMReflection.java)
Test: testInitialize_TransientPropertyClass: org.apache.harmony.beans.tests.java.beans.DefaultPersistenceDelegateTestjava.lang.NoClassDefFoundError: org/apache/harmony/beans/tests/java/beans/DefaultPersistenceDelegateTest$CollectingEncoder
	at org.apache.harmony.beans.tests.java.beans.DefaultPersistenceDelegateTest.testInitialize_TransientProperty(DefaultPersistenceDelegateTest.java:666)
	at java.lang.reflect.VMReflection.invokeMethod(VMReflection.java)
Test: testInitialize_NoSetterClass: org.apache.harmony.beans.tests.java.beans.DefaultPersistenceDelegateTestjava.lang.NoClassDefFoundError: org/apache/harmony/beans/tests/java/beans/DefaultPersistenceDelegateTest$MockEncoder
	at org.apache.harmony.beans.tests.java.beans.DefaultPersistenceDelegateTest.testInitialize_NoSetter(DefaultPersistenceDelegateTest.java:688)
	at java.lang.reflect.VMReflection.invokeMethod(VMReflection.java)
Test: testInitialize_NoGetterClass: org.apache.harmony.beans.tests.java.beans.DefaultPersistenceDelegateTestjava.lang.NoClassDefFoundError: org/apache/harmony/beans/tests/java/beans/DefaultPersistenceDelegateTest$MockEncoder
	at org.apache.harmony.beans.tests.java.beans.DefaultPersistenceDelegateTest.testInitialize_NoGetter(DefaultPersistenceDelegateTest.java:715)
	at java.lang.reflect.VMReflection.invokeMethod(VMReflection.java)
Test: testInitialize_NullClassClass: org.apache.harmony.beans.tests.java.beans.DefaultPersistenceDelegateTestjava.lang.NoClassDefFoundError: java/beans/Encoder
	at org.apache.harmony.beans.tests.java.beans.DefaultPersistenceDelegateTest.testInitialize_NullClass(DefaultPersistenceDelegateTest.java:739)
	at java.lang.reflect.VMReflection.invokeMethod(VMReflection.java)
Test: testInitialize_NullInstancesClass: org.apache.harmony.beans.tests.java.beans.DefaultPersistenceDelegateTestjava.lang.NoClassDefFoundError: java/beans/Encoder
	at org.apache.harmony.beans.tests.java.beans.DefaultPersistenceDelegateTest.testInitialize_NullInstances(DefaultPersistenceDelegateTest.java:763)
	at java.lang.reflect.VMReflection.invokeMethod(VMReflection.java)
Test: testArrayPD_NormalClass: org.apache.harmony.beans.tests.java.beans.DefaultPersistenceDelegateTestjava.lang.NoClassDefFoundError: org/apache/harmony/beans/tests/java/beans/DefaultPersistenceDelegateTest$MockEncoder
	at org.apache.harmony.beans.tests.java.beans.DefaultPersistenceDelegateTest.testArrayPD_Normal(DefaultPersistenceDelegateTest.java:803)
	at java.lang.reflect.VMReflection.invokeMethod(VMReflection.java)
Test: testGetExceptionListenerClass: org.apache.harmony.beans.tests.java.beans.EncoderTestjava.lang.NoClassDefFoundError: java/beans/Encoder
	at org.apache.harmony.beans.tests.java.beans.EncoderTest.testGetExceptionListener(EncoderTest.java:228)
	at java.lang.reflect.VMReflection.invokeMethod(VMReflection.java)
Test: testSetExceptionListener_NullClass: org.apache.harmony.beans.tests.java.beans.EncoderTestjava.lang.NoClassDefFoundError: org/apache/harmony/beans/tests/java/beans/EncoderTest$MockEncoder
	at org.apache.harmony.beans.tests.java.beans.EncoderTest.testSetExceptionListener_Null(EncoderTest.java:240)
	at java.lang.reflect.VMReflection.invokeMethod(VMReflection.java)
Test: testSetExceptionListenerClass: org.apache.harmony.beans.tests.java.beans.EncoderTestjava.lang.NoClassDefFoundError: org/apache/harmony/beans/tests/java/beans/EncoderTest$MockEncoder
	at org.apache.harmony.beans.tests.java.beans.EncoderTest.testSetExceptionListener(EncoderTest.java:252)
	at java.lang.reflect.VMReflection.invokeMethod(VMReflection.java)
Test: testWriteExpression_NullClass: org.apache.harmony.beans.tests.java.beans.EncoderTestjava.lang.NoClassDefFoundError: java/beans/Encoder
	at org.apache.harmony.beans.tests.java.beans.EncoderTest.testWriteExpression_Null(EncoderTest.java:268)
	at java.lang.reflect.VMReflection.invokeMethod(VMReflection.java)
Test: testWriteStatement_NullClass: org.apache.harmony.beans.tests.java.beans.EncoderTestjava.lang.NoClassDefFoundError: java/beans/Encoder
	at org.apache.harmony.beans.tests.java.beans.EncoderTest.testWriteStatement_Null(EncoderTest.java:282)
	at java.lang.reflect.VMReflection.invokeMethod(VMReflection.java)
Test: testWriteObject_NullClass: org.apache.harmony.beans.tests.java.beans.EncoderTestjava.lang.NoClassDefFoundError: java/beans/Encoder
	at org.apache.harmony.beans.tests.java.beans.EncoderTest.testWriteObject_Null(EncoderTest.java:293)
	at java.lang.reflect.VMReflection.invokeMethod(VMReflection.java)
Test: testWriteObjectClass: org.apache.harmony.beans.tests.java.beans.EncoderTestjava.lang.NoClassDefFoundError: org/apache/harmony/beans/tests/java/beans/EncoderTest$VerboseEncoder
	at org.apache.harmony.beans.tests.java.beans.EncoderTest.testWriteObject(EncoderTest.java:304)
	at java.lang.reflect.VMReflection.invokeMethod(VMReflection.java)
Test: testGetPersistenceDelegate_NullClass: org.apache.harmony.beans.tests.java.beans.EncoderTestjava.lang.NoClassDefFoundError: java/beans/Encoder
	at org.apache.harmony.beans.tests.java.beans.EncoderTest.testGetPersistenceDelegate_Null(EncoderTest.java:363)
	at java.lang.reflect.VMReflection.invokeMethod(VMReflection.java)
Test: testGetPersistenceDelegate_ArrayClassClass: org.apache.harmony.beans.tests.java.beans.EncoderTestjava.lang.NoClassDefFoundError: java/beans/Encoder
	at org.apache.harmony.beans.tests.java.beans.EncoderTest.testGetPersistenceDelegate_ArrayClass(EncoderTest.java:369)
	at java.lang.reflect.VMReflection.invokeMethod(VMReflection.java)
Test: testGetPersistenceDelegate_ProxyClassClass: org.apache.harmony.beans.tests.java.beans.EncoderTestjava.lang.NoClassDefFoundError: java/beans/Encoder
	at org.apache.harmony.beans.tests.java.beans.EncoderTest.testGetPersistenceDelegate_ProxyClass(EncoderTest.java:375)
	at java.lang.reflect.VMReflection.invokeMethod(VMReflection.java)
Test: testGetPersistenceDelegate_BeanInfoClass: org.apache.harmony.beans.tests.java.beans.EncoderTestjava.lang.NoClassDefFoundError: java/beans/Encoder
	at org.apache.harmony.beans.tests.java.beans.EncoderTest.testGetPersistenceDelegate_BeanInfo(EncoderTest.java:381)
	at java.lang.reflect.VMReflection.invokeMethod(VMReflection.java)
Test: testGetPersistenceDelegate_DefaultClass: org.apache.harmony.beans.tests.java.beans.EncoderTestjava.lang.NoClassDefFoundError: java/beans/Encoder
	at org.apache.harmony.beans.tests.java.beans.EncoderTest.testGetPersistenceDelegate_Default(EncoderTest.java:388)
	at java.lang.reflect.VMReflection.invokeMethod(VMReflection.java)
Test: testSetPersistenceDelegate_NullClass: org.apache.harmony.beans.tests.java.beans.EncoderTestjava.lang.NoClassDefFoundError: java/beans/Encoder
	at org.apache.harmony.beans.tests.java.beans.EncoderTest.testSetPersistenceDelegate_Null(EncoderTest.java:407)
	at java.lang.reflect.VMReflection.invokeMethod(VMReflection.java)
Test: testSetPersistenceDelegateClass: org.apache.harmony.beans.tests.java.beans.EncoderTestjava.lang.NoClassDefFoundError: java/beans/Encoder
	at org.apache.harmony.beans.tests.java.beans.EncoderTest.testSetPersistenceDelegate(EncoderTest.java:426)
	at java.lang.reflect.VMReflection.invokeMethod(VMReflection.java)
Test: testGet_NullParamClass: org.apache.harmony.beans.tests.java.beans.EncoderTestjava.lang.NoClassDefFoundError: java/beans/Encoder
	at org.apache.harmony.beans.tests.java.beans.EncoderTest.testGet_NullParam(EncoderTest.java:438)
	at java.lang.reflect.VMReflection.invokeMethod(VMReflection.java)
Test: testGet_StringClass: org.apache.harmony.beans.tests.java.beans.EncoderTestjava.lang.NoClassDefFoundError: java/beans/Encoder
	at org.apache.harmony.beans.tests.java.beans.EncoderTest.testGet_String(EncoderTest.java:444)
	at java.lang.reflect.VMReflection.invokeMethod(VMReflection.java)
Test: testGet_IntegerClass: org.apache.harmony.beans.tests.java.beans.EncoderTestjava.lang.NoClassDefFoundError: org/apache/harmony/beans/tests/java/beans/EncoderTest$MockEncoder
	at org.apache.harmony.beans.tests.java.beans.EncoderTest.testGet_Integer(EncoderTest.java:451)
	at java.lang.reflect.VMReflection.invokeMethod(VMReflection.java)
Test: testRemove_NullClass: org.apache.harmony.beans.tests.java.beans.EncoderTestjava.lang.NoClassDefFoundError: java/beans/Encoder
	at org.apache.harmony.beans.tests.java.beans.EncoderTest.testRemove_Null(EncoderTest.java:466)
	at java.lang.reflect.VMReflection.invokeMethod(VMReflection.java)
Test: testRemove_StringClass: org.apache.harmony.beans.tests.java.beans.EncoderTestjava.lang.NoClassDefFoundError: org/apache/harmony/beans/tests/java/beans/EncoderTest$MockEncoder
	at org.apache.harmony.beans.tests.java.beans.EncoderTest.testRemove_String(EncoderTest.java:472)
	at java.lang.reflect.VMReflection.invokeMethod(VMReflection.java)
Test: testRemove_IntegerClass: org.apache.harmony.beans.tests.java.beans.EncoderTestjava.lang.NoClassDefFoundError: org/apache/harmony/beans/tests/java/beans/EncoderTest$MockEncoder
	at org.apache.harmony.beans.tests.java.beans.EncoderTest.testRemove_Integer(EncoderTest.java:484)
	at java.lang.reflect.VMReflection.invokeMethod(VMReflection.java)
Test: testWriteObject_NormalMutatesToTrueClass: org.apache.harmony.beans.tests.java.beans.PersistenceDelegateTestjava.lang.NoClassDefFoundError: java/beans/Encoder
	at org.apache.harmony.beans.tests.java.beans.PersistenceDelegateTest.testWriteObject_NormalMutatesToTrue(PersistenceDelegateTest.java:69)
	at java.lang.reflect.VMReflection.invokeMethod(VMReflection.java)
Test: testWriteObject_NormalMutatesToFalseClass: org.apache.harmony.beans.tests.java.beans.PersistenceDelegateTestjava.lang.NoClassDefFoundError: org/apache/harmony/beans/tests/java/beans/PersistenceDelegateTest$MockEncoder2
	at org.apache.harmony.beans.tests.java.beans.PersistenceDelegateTest.testWriteObject_NormalMutatesToFalse(PersistenceDelegateTest.java:84)
	at java.lang.reflect.VMReflection.invokeMethod(VMReflection.java)
Test: testWriteObject_NullObjectClass: org.apache.harmony.beans.tests.java.beans.PersistenceDelegateTestjava.lang.NoClassDefFoundError: java/beans/Encoder
	at org.apache.harmony.beans.tests.java.beans.PersistenceDelegateTest.testWriteObject_NullObject(PersistenceDelegateTest.java:99)
	at java.lang.reflect.VMReflection.invokeMethod(VMReflection.java)
Test: testInitialize_NormalClass: org.apache.harmony.beans.tests.java.beans.PersistenceDelegateTestjava.lang.NoClassDefFoundError: java/beans/Encoder
	at org.apache.harmony.beans.tests.java.beans.PersistenceDelegateTest.testInitialize_Normal(PersistenceDelegateTest.java:129)
	at java.lang.reflect.VMReflection.invokeMethod(VMReflection.java)
Test: testInitialize_NullClassClass: org.apache.harmony.beans.tests.java.beans.PersistenceDelegateTestjava.lang.NoClassDefFoundError: java/beans/Encoder
	at org.apache.harmony.beans.tests.java.beans.PersistenceDelegateTest.testInitialize_NullClass(PersistenceDelegateTest.java:150)
	at java.lang.reflect.VMReflection.invokeMethod(VMReflection.java)
Test: testInitialize_NullInstancesClass: org.apache.harmony.beans.tests.java.beans.PersistenceDelegateTestjava.lang.NoClassDefFoundError: java/beans/Encoder
	at org.apache.harmony.beans.tests.java.beans.PersistenceDelegateTest.testInitialize_NullInstances(PersistenceDelegateTest.java:169)
	at java.lang.reflect.VMReflection.invokeMethod(VMReflection.java)
Test: testInitialize_circularRedundancyClass: org.apache.harmony.beans.tests.java.beans.PersistenceDelegateTestjava.lang.NoClassDefFoundError: java/beans/Encoder
	at org.apache.harmony.beans.tests.java.beans.PersistenceDelegateTest.testInitialize_circularRedundancy(PersistenceDelegateTest.java:195)
	at java.lang.reflect.VMReflection.invokeMethod(VMReflection.java)
Test: test_writeObject_Null_LXMLEncoderClass: org.apache.harmony.beans.tests.java.beans.PersistenceDelegateTestjava.lang.NoClassDefFoundError: java/beans/Encoder
	at org.apache.harmony.beans.tests.java.beans.PersistenceDelegateTest.test_writeObject_Null_LXMLEncoder(PersistenceDelegateTest.java:230)
	at java.lang.reflect.VMReflection.invokeMethod(VMReflection.java)
Test: test_writeObject_java_lang_reflect_FieldClass: org.apache.harmony.beans.tests.java.beans.PersistenceDelegateTestjava.lang.NoClassDefFoundError: java/beans/XMLEncoder
	at org.apache.harmony.beans.tests.java.beans.PersistenceDelegateTest.test_writeObject_java_lang_reflect_Field(PersistenceDelegateTest.java:256)
	at java.lang.reflect.VMReflection.invokeMethod(VMReflection.java)
Test: test_writeObject_java_lang_reflect_MethodClass: org.apache.harmony.beans.tests.java.beans.PersistenceDelegateTestjava.lang.NoClassDefFoundError: java/beans/XMLEncoder
	at org.apache.harmony.beans.tests.java.beans.PersistenceDelegateTest.test_writeObject_java_lang_reflect_Method(PersistenceDelegateTest.java:275)
	at java.lang.reflect.VMReflection.invokeMethod(VMReflection.java)
Test: test_writeObject_java_util_CollectionClass: org.apache.harmony.beans.tests.java.beans.PersistenceDelegateTestjava.lang.NoClassDefFoundError: java/beans/XMLEncoder
	at org.apache.harmony.beans.tests.java.beans.PersistenceDelegateTest.test_writeObject_java_util_Collection(PersistenceDelegateTest.java:293)
	at java.lang.reflect.VMReflection.invokeMethod(VMReflection.java)
Test: test_writeObject_java_awt_ChoiceClass: org.apache.harmony.beans.tests.java.beans.PersistenceDelegateTestjava.lang.NoClassDefFoundError: java/beans/XMLEncoder
	at org.apache.harmony.beans.tests.java.beans.PersistenceDelegateTest.test_writeObject_java_awt_Choice(PersistenceDelegateTest.java:314)
	at java.lang.reflect.VMReflection.invokeMethod(VMReflection.java)
Test: test_writeObject_java_awt_SystemColorClass: org.apache.harmony.beans.tests.java.beans.PersistenceDelegateTestjava.lang.NoClassDefFoundError: java/beans/XMLEncoder
	at org.apache.harmony.beans.tests.java.beans.PersistenceDelegateTest.test_writeObject_java_awt_SystemColor(PersistenceDelegateTest.java:446)
	at java.lang.reflect.VMReflection.invokeMethod(VMReflection.java)
Test: test_writeObject_java_awt_font_TextAttributeClass: org.apache.harmony.beans.tests.java.beans.PersistenceDelegateTestjava.lang.NoClassDefFoundError: java/beans/XMLEncoder
	at org.apache.harmony.beans.tests.java.beans.PersistenceDelegateTest.test_writeObject_java_awt_font_TextAttribute(PersistenceDelegateTest.java:460)
	at java.lang.reflect.VMReflection.invokeMethod(VMReflection.java)
Test: test_writeObject_java_awt_MenuShortcutClass: org.apache.harmony.beans.tests.java.beans.PersistenceDelegateTestjava.lang.NoClassDefFoundError: java/beans/XMLEncoder
	at org.apache.harmony.beans.tests.java.beans.PersistenceDelegateTest.test_writeObject_java_awt_MenuShortcut(PersistenceDelegateTest.java:474)
	at java.lang.reflect.VMReflection.invokeMethod(VMReflection.java)
Test: test_writeObject_java_awt_ComponentClass: org.apache.harmony.beans.tests.java.beans.PersistenceDelegateTestjava.lang.NoClassDefFoundError: java/beans/XMLEncoder
	at org.apache.harmony.beans.tests.java.beans.PersistenceDelegateTest.test_writeObject_java_awt_Component(PersistenceDelegateTest.java:497)
	at java.lang.reflect.VMReflection.invokeMethod(VMReflection.java)
Test: test_writeObject_java_awt_ContainerClass: org.apache.harmony.beans.tests.java.beans.PersistenceDelegateTestjava.lang.NoClassDefFoundError: java/beans/XMLEncoder
	at org.apache.harmony.beans.tests.java.beans.PersistenceDelegateTest.test_writeObject_java_awt_Container(PersistenceDelegateTest.java:533)
	at java.lang.reflect.VMReflection.invokeMethod(VMReflection.java)
Test: test_writeObject_java_awt_MenuClass: org.apache.harmony.beans.tests.java.beans.PersistenceDelegateTestjava.lang.NoClassDefFoundError: java/beans/XMLEncoder
	at org.apache.harmony.beans.tests.java.beans.PersistenceDelegateTest.test_writeObject_java_awt_Menu(PersistenceDelegateTest.java:606)
	at java.lang.reflect.VMReflection.invokeMethod(VMReflection.java)
Test: test_writeObject_java_awt_MenuBarClass: org.apache.harmony.beans.tests.java.beans.PersistenceDelegateTestjava.lang.NoClassDefFoundError: java/beans/XMLEncoder
	at org.apache.harmony.beans.tests.java.beans.PersistenceDelegateTest.test_writeObject_java_awt_MenuBar(PersistenceDelegateTest.java:641)
	at java.lang.reflect.VMReflection.invokeMethod(VMReflection.java)
Test: test_writeObject_java_awt_ListClass: org.apache.harmony.beans.tests.java.beans.PersistenceDelegateTestjava.lang.NoClassDefFoundError: java/beans/XMLEncoder
	at org.apache.harmony.beans.tests.java.beans.PersistenceDelegateTest.test_writeObject_java_awt_List(PersistenceDelegateTest.java:659)
	at java.lang.reflect.VMReflection.invokeMethod(VMReflection.java)
Test: test_writeObject_java_awt_BorderLayoutClass: org.apache.harmony.beans.tests.java.beans.PersistenceDelegateTestjava.lang.NoClassDefFoundError: java/beans/XMLEncoder
	at org.apache.harmony.beans.tests.java.beans.PersistenceDelegateTest.test_writeObject_java_awt_BorderLayout(PersistenceDelegateTest.java:681)
	at java.lang.reflect.VMReflection.invokeMethod(VMReflection.java)
Test: test_writeObject_java_awt_CardLayoutClass: org.apache.harmony.beans.tests.java.beans.PersistenceDelegateTestjava.lang.NoClassDefFoundError: java/beans/XMLEncoder
	at org.apache.harmony.beans.tests.java.beans.PersistenceDelegateTest.test_writeObject_java_awt_CardLayout(PersistenceDelegateTest.java:699)
	at java.lang.reflect.VMReflection.invokeMethod(VMReflection.java)
Test: test_writeObject_java_awt_GridBagLayoutClass: org.apache.harmony.beans.tests.java.beans.PersistenceDelegateTestjava.lang.NoClassDefFoundError: java/beans/XMLEncoder
	at org.apache.harmony.beans.tests.java.beans.PersistenceDelegateTest.test_writeObject_java_awt_GridBagLayout(PersistenceDelegateTest.java:718)
	at java.lang.reflect.VMReflection.invokeMethod(VMReflection.java)
Test: test_writeObject_java_awt_CursorClass: org.apache.harmony.beans.tests.java.beans.PersistenceDelegateTestjava.lang.NoClassDefFoundError: java/beans/XMLEncoder
	at org.apache.harmony.beans.tests.java.beans.PersistenceDelegateTest.test_writeObject_java_awt_Cursor(PersistenceDelegateTest.java:739)
	at java.lang.reflect.VMReflection.invokeMethod(VMReflection.java)
Test: test_writeObject_java_awt_InsetsClass: org.apache.harmony.beans.tests.java.beans.PersistenceDelegateTestjava.lang.NoClassDefFoundError: java/beans/XMLEncoder
	at org.apache.harmony.beans.tests.java.beans.PersistenceDelegateTest.test_writeObject_java_awt_Insets(PersistenceDelegateTest.java:756)
	at java.lang.reflect.VMReflection.invokeMethod(VMReflection.java)
Test: test_writeObject_java_awt_pointClass: org.apache.harmony.beans.tests.java.beans.PersistenceDelegateTestjava.lang.NoClassDefFoundError: java/beans/XMLEncoder
	at org.apache.harmony.beans.tests.java.beans.PersistenceDelegateTest.test_writeObject_java_awt_point(PersistenceDelegateTest.java:772)
	at java.lang.reflect.VMReflection.invokeMethod(VMReflection.java)
Test: test_writeObject_java_awt_ScrollPaneClass: org.apache.harmony.beans.tests.java.beans.PersistenceDelegateTestjava.lang.NoClassDefFoundError: java/beans/XMLEncoder
	at org.apache.harmony.beans.tests.java.beans.PersistenceDelegateTest.test_writeObject_java_awt_ScrollPane(PersistenceDelegateTest.java:788)
	at java.lang.reflect.VMReflection.invokeMethod(VMReflection.java)
Test: test_writeObject_java_util_MapClass: org.apache.harmony.beans.tests.java.beans.PersistenceDelegateTestjava.lang.NoClassDefFoundError: java/beans/XMLEncoder
	at org.apache.harmony.beans.tests.java.beans.PersistenceDelegateTest.test_writeObject_java_util_Map(PersistenceDelegateTest.java:807)
	at java.lang.reflect.VMReflection.invokeMethod(VMReflection.java)
Test: testFontEditorClass: org.apache.harmony.beans.tests.java.beans.PropertyEditorManagerTestjava.lang.NullPointerException
	at org.apache.harmony.beans.tests.java.beans.PropertyEditorManagerTest.testFontEditor(PropertyEditorManagerTest.java:733)
	at java.lang.reflect.VMReflection.invokeMethod(VMReflection.java)
Test: testLoadImageClass: org.apache.harmony.beans.tests.java.beans.SimpleBeanInfoTestjava.lang.NullPointerException
	at java.awt.Toolkit.init(Toolkit.java:565)
	at java.awt.Toolkit.<init>(Toolkit.java:539)
	at java.awt.ToolkitImpl.<init>(ToolkitImpl.java:39)
	at java.awt.Toolkit.getDefaultToolkit(Toolkit.java:471)
	at java.beans.SimpleBeanInfo.loadImage(SimpleBeanInfo.java:36)
	at org.apache.harmony.beans.tests.java.beans.SimpleBeanInfoTest.testLoadImage(SimpleBeanInfoTest.java:84)
	at java.lang.reflect.VMReflection.invokeMethod(VMReflection.java)
Test: testAvoidGuiClass: org.apache.harmony.beans.tests.java.beans.beancontext.BeanContextSupportTestjava.lang.NullPointerException
	at java.awt.Toolkit.init(Toolkit.java:565)
	at java.awt.Toolkit.<init>(Toolkit.java:539)
	at java.awt.ToolkitImpl.<init>(ToolkitImpl.java:39)
	at java.awt.Toolkit.getDefaultToolkit(Toolkit.java:471)
	at java.awt.Component.<init>(Component.java:109)
	at java.awt.Button.<init>(Button.java:141)
	at java.awt.Button.<init>(Button.java:158)
	at org.apache.harmony.beans.tests.java.beans.beancontext.BeanContextSupportTest.testAvoidGui(BeanContextSupportTest.java:2207)
	at java.lang.reflect.VMReflection.invokeMethod(VMReflection.java)

***********************************************************
Modifications since last successful build:	(60)
            
add cc-hdk log20070719190749Lbuild.1 07/19/2007 19:07:49hdk
added leoli  /harmony/enhanced/classlib/trunk/modules/beans/src/main/java/java/beans/UtilMapPersistenceDelegate.java 07/19/2007 13:39:34 Apply patch for HARMONY-4487([classlib][beans] Persistence delegate for j.u.Map is missing).
modified leoli  /harmony/enhanced/classlib/trunk/modules/beans/src/main/java/java/beans/Encoder.java 07/19/2007 13:39:34 Apply patch for HARMONY-4487([classlib][beans] Persistence delegate for j.u.Map is missing).
modified leoli  /harmony/enhanced/classlib/trunk/modules/beans/src/test/java/org/apache/harmony/beans/tests/java/beans/PersistenceDelegateTest.java 07/19/2007 13:39:34 Apply patch for HARMONY-4487([classlib][beans] Persistence delegate for j.u.Map is missing).
modified tonywu  /harmony/enhanced/classlib/trunk/modules/beans/src/main/java/java/beans/EventSetDescriptor.java 07/19/2007 13:30:02 Tidy up compiler warning and format code, no functional change
modified tonywu  /harmony/enhanced/classlib/trunk/modules/beans/src/main/java/java/beans/StandardBeanInfo.java 07/19/2007 13:30:02 Tidy up compiler warning and format code, no functional change
modified tonywu  /harmony/enhanced/classlib/trunk/modules/beans/src/main/java/java/beans/PropertyDescriptor.java 07/19/2007 13:30:02 Tidy up compiler warning and format code, no functional change
modified tonywu  /harmony/enhanced/classlib/trunk/modules/beans/src/main/java/java/beans/DefaultPersistenceDelegate.java 07/19/2007 13:30:02 Tidy up compiler warning and format code, no functional change
modified tonywu  /harmony/enhanced/classlib/trunk/modules/beans/src/main/java/java/beans/VetoableChangeSupport.java 07/19/2007 13:30:02 Tidy up compiler warning and format code, no functional change
modified varlax  /harmony/enhanced/drlvm/trunk/build/make/excludes/exclude.drlvm_smoke.linux.x86_64.jet 07/19/2007 13:29:48 Excluded stress.Sync for jet/jit also due to HARMONY-3299.
modified varlax  /harmony/enhanced/drlvm/trunk/build/make/excludes/exclude.drlvm_smoke.linux.x86_64.jit 07/19/2007 13:29:48 Excluded stress.Sync for jet/jit also due to HARMONY-3299.
modified varlax  /harmony/enhanced/drlvm/trunk/vm/tests/smoke/shutdown/TestInterrupt.c 07/19/2007 13:28:31 Fixed gcc warning: no newline at end of file
modified varlax  /harmony/enhanced/drlvm/trunk/vm/tests/smoke/shutdown/TestFatalError.c 07/19/2007 13:28:31 Fixed gcc warning: no newline at end of file
added tonywu  /harmony/enhanced/classlib/trunk/modules/beans/src/test/support/java/org/apache/harmony/beans/tests/support/mock/MockSubClass.java 07/19/2007 13:17:33 correct the behavior of merging display name
modified tonywu  /harmony/enhanced/classlib/trunk/modules/beans/src/main/java/java/beans/EventSetDescriptor.java 07/19/2007 13:17:33 correct the behavior of merging display name
added tonywu  /harmony/enhanced/classlib/trunk/modules/beans/src/test/support/java/org/apache/harmony/beans/tests/support/mock/MockInterface.java 07/19/2007 13:17:33 correct the behavior of merging display name
added tonywu  /harmony/enhanced/classlib/trunk/modules/beans/src/test/support/java/org/apache/harmony/beans/tests/support/mock/MockSubClassBeanInfo.java 07/19/2007 13:17:33 correct the behavior of merging display name
added tonywu  /harmony/enhanced/classlib/trunk/modules/beans/src/test/support/java/org/apache/harmony/beans/tests/support/mock/MockInterfaceBeanInfo.java 07/19/2007 13:17:33 correct the behavior of merging display name
added tonywu  /harmony/enhanced/classlib/trunk/modules/beans/src/test/support/java/org/apache/harmony/beans/tests/support/mock/MockSuperClass.java 07/19/2007 13:17:33 correct the behavior of merging display name
added tonywu  /harmony/enhanced/classlib/trunk/modules/beans/src/test/support/java/org/apache/harmony/beans/tests/support/mock/MockSuperClassBeanInfo.java 07/19/2007 13:17:33 correct the behavior of merging display name
modified tonywu  /harmony/enhanced/classlib/trunk/modules/beans/src/main/java/java/beans/PropertyDescriptor.java 07/19/2007 13:17:33 correct the behavior of merging display name
modified tonywu  /harmony/enhanced/classlib/trunk/modules/beans/src/test/java/org/apache/harmony/beans/tests/java/beans/IntrospectorTest.java 07/19/2007 13:17:33 correct the behavior of merging display name
added tonywu  /harmony/enhanced/classlib/trunk/modules/beans/src/test/support/java/org/apache/harmony/beans/tests/support/mock/FakeFox03BeanInfo.java 07/19/2007 12:22:13 write testcase for default property index and event index
added tonywu  /harmony/enhanced/classlib/trunk/modules/beans/src/test/support/java/org/apache/harmony/beans/tests/support/mock/FakeFox031BeanInfo.java 07/19/2007 12:22:13 write testcase for default property index and event index
modified tonywu  /harmony/enhanced/classlib/trunk/modules/beans/src/test/java/org/apache/harmony/beans/tests/java/beans/IntrospectorTest.java 07/19/2007 12:22:13 write testcase for default property index and event index
added tonywu  /harmony/enhanced/classlib/trunk/modules/beans/src/test/support/java/org/apache/harmony/beans/tests/support/mock/FakeFox03.java 07/19/2007 12:22:13 write testcase for default property index and event index
added tonywu  /harmony/enhanced/classlib/trunk/modules/beans/src/test/support/java/org/apache/harmony/beans/tests/support/mock/FakeFox031.java 07/19/2007 12:22:13 write testcase for default property index and event index
modified tonywu  /harmony/enhanced/classlib/trunk/modules/beans/src/main/java/java/beans/Introspector.java 07/19/2007 12:10:38 make the default event be the same as RI
modified tonywu  /harmony/enhanced/classlib/trunk/modules/beans/src/main/java/java/beans/StandardBeanInfo.java 07/19/2007 12:10:38 make the default event be the same as RI
modified tonywu  /harmony/enhanced/classlib/trunk/modules/beans/src/test/java/org/apache/harmony/beans/tests/java/beans/IntrospectorTest.java 07/19/2007 12:10:38 make the default event be the same as RI
modified mloenko  /harmony/enhanced/drlvm/trunk/vm/vmcore/src/verifier-3363/Pass1.cpp 07/19/2007 11:59:06 more fixes for gcc 4.x
modified mloenko  /harmony/enhanced/drlvm/trunk/vm/vmcore/src/verifier-3363/ver_utils.h 07/19/2007 10:47:48 fixed compilation on gcc 4.x
modified mloenko  /harmony/enhanced/drlvm/trunk/vm/vmcore/src/verifier-3363/tpool.h 07/19/2007 10:47:48 fixed compilation on gcc 4.x
modified mloenko  /harmony/enhanced/drlvm/trunk/vm/vmcore/src/verifier-3363/context.h 07/19/2007 10:47:48 fixed compilation on gcc 4.x
modified mloenko  /harmony/enhanced/drlvm/trunk/vm/vmcore/src/verifier-3363/Pass2.cpp 07/19/2007 10:34:08 fix HARMONY-2103 (Jitrino/OPT does not reject class which uses incorrect invokespecial instruction) regression
modified tonywu  /harmony/enhanced/classlib/trunk/modules/beans/src/main/java/java/beans/StandardBeanInfo.java 07/19/2007 10:09:07 Tidy up compiler warning and format code, no functional change
modified tonywu  /harmony/enhanced/classlib/trunk/modules/beans/META-INF/MANIFEST.MF 07/19/2007 09:27:42 new feature for getIcon
modified tonywu  /harmony/enhanced/classlib/trunk/modules/beans/src/main/java/java/beans/StandardBeanInfo.java 07/19/2007 09:27:42 new feature for getIcon
modified tonywu  /harmony/enhanced/classlib/trunk/modules/beans/src/test/java/org/apache/harmony/beans/tests/java/beans/IntrospectorTest.java 07/19/2007 09:27:42 new feature for getIcon
added tonywu  /harmony/enhanced/classlib/trunk/modules/beans/src/main/java/java/beans/StaticFieldPersistenceDelegate.java 07/19/2007 07:56:20 Apply Harmony-4478 ([classlib][beans] Current bean implementation does not persist many awt classes properly (refer to Harmony-4473))
added tonywu  /harmony/enhanced/classlib/trunk/modules/beans/src/main/java/java/beans/AwtContainerPersistenceDelegate.java 07/19/2007 07:56:20 Apply Harmony-4478 ([classlib][beans] Current bean implementation does not persist many awt classes properly (refer to Harmony-4473))
added tonywu  /harmony/enhanced/classlib/trunk/modules/beans/src/main/java/java/beans/AwtSystemColorPersistenceDelegate.java 07/19/2007 07:56:20 Apply Harmony-4478 ([classlib][beans] Current bean implementation does not persist many awt classes properly (refer to Harmony-4473))
added tonywu  /harmony/enhanced/classlib/trunk/modules/beans/src/main/java/java/beans/AwtDimensionPersistenceDelegate.java 07/19/2007 07:56:20 Apply Harmony-4478 ([classlib][beans] Current bean implementation does not persist many awt classes properly (refer to Harmony-4473))
added tonywu  /harmony/enhanced/classlib/trunk/modules/beans/src/main/java/java/beans/AwtPointPersistenceDelegate.java 07/19/2007 07:56:20 Apply Harmony-4478 ([classlib][beans] Current bean implementation does not persist many awt classes properly (refer to Harmony-4473))
added tonywu  /harmony/enhanced/classlib/trunk/modules/beans/src/main/java/java/beans/AwtMenuBarPersistenceDelegate.java 07/19/2007 07:56:20 Apply Harmony-4478 ([classlib][beans] Current bean implementation does not persist many awt classes properly (refer to Harmony-4473))
added tonywu  /harmony/enhanced/classlib/trunk/modules/beans/src/main/java/java/beans/AwtFontTextAttributePersistenceDelegate.java 07/19/2007 07:56:20 Apply Harmony-4478 ([classlib][beans] Current bean implementation does not persist many awt classes properly (refer to Harmony-4473))
added tonywu  /harmony/enhanced/classlib/trunk/modules/beans/src/main/java/java/beans/AwtMenuShortcutPersistenceDelegate.java 07/19/2007 07:56:20 Apply Harmony-4478 ([classlib][beans] Current bean implementation does not persist many awt classes properly (refer to Harmony-4473))
added tonywu  /harmony/enhanced/classlib/trunk/modules/beans/src/main/java/java/beans/AwtScrollPanePersistenceDelegate.java 07/19/2007 07:56:20 Apply Harmony-4478 ([classlib][beans] Current bean implementation does not persist many awt classes properly (refer to Harmony-4473))
added tonywu  /harmony/enhanced/classlib/trunk/modules/beans/src/main/java/java/beans/AwtComponentPersistenceDelegate.java 07/19/2007 07:56:20 Apply Harmony-4478 ([classlib][beans] Current bean implementation does not persist many awt classes properly (refer to Harmony-4473))
modified tonywu  /harmony/enhanced/classlib/trunk/modules/beans/src/main/java/java/beans/Encoder.java 07/19/2007 07:56:20 Apply Harmony-4478 ([classlib][beans] Current bean implementation does not persist many awt classes properly (refer to Harmony-4473))
added tonywu  /harmony/enhanced/classlib/trunk/modules/beans/src/main/java/java/beans/AwtMenuPersistenceDelegate.java 07/19/2007 07:56:20 Apply Harmony-4478 ([classlib][beans] Current bean implementation does not persist many awt classes properly (refer to Harmony-4473))
added tonywu  /harmony/enhanced/classlib/trunk/modules/beans/src/main/java/java/beans/AwtInsetsPersistenceDelegate.java 07/19/2007 07:56:20 Apply Harmony-4478 ([classlib][beans] Current bean implementation does not persist many awt classes properly (refer to Harmony-4473))
added tonywu  /harmony/enhanced/classlib/trunk/modules/beans/src/main/java/java/beans/AwtFontPersistenceDelegate.java 07/19/2007 07:56:20 Apply Harmony-4478 ([classlib][beans] Current bean implementation does not persist many awt classes properly (refer to Harmony-4473))
modified tonywu  /harmony/enhanced/classlib/trunk/modules/beans/META-INF/MANIFEST.MF 07/19/2007 07:56:20 Apply Harmony-4478 ([classlib][beans] Current bean implementation does not persist many awt classes properly (refer to Harmony-4473))
added tonywu  /harmony/enhanced/classlib/trunk/modules/beans/src/main/java/java/beans/AwtListPersistenceDelegate.java 07/19/2007 07:56:20 Apply Harmony-4478 ([classlib][beans] Current bean implementation does not persist many awt classes properly (refer to Harmony-4473))
added tonywu  /harmony/enhanced/classlib/trunk/modules/beans/src/main/java/java/beans/AwtCursorPersistenceDelegate.java 07/19/2007 07:56:20 Apply Harmony-4478 ([classlib][beans] Current bean implementation does not persist many awt classes properly (refer to Harmony-4473))
modified tonywu  /harmony/enhanced/classlib/trunk/modules/beans/src/test/java/org/apache/harmony/beans/tests/java/beans/PersistenceDelegateTest.java 07/19/2007 07:56:20 Apply Harmony-4478 ([classlib][beans] Current bean implementation does not persist many awt classes properly (refer to Harmony-4473))
modified ayza  /harmony/enhanced/jdktools/trunk/modules/jpda/make/exclude.windows.x86_64.drl 07/19/2007 02:40:04 Applying patch from HARMONY-3377 ([jdktools][jpda] JDWP test org.apache.harmony.jpda.tests.jdwp.MultiSession.ListenConnectorTest intermittently fails with connection timeout)
modified ayza  /harmony/enhanced/jdktools/trunk/modules/jpda/make/exclude.windows.x86.drl 07/19/2007 02:40:04 Applying patch from HARMONY-3377 ([jdktools][jpda] JDWP test org.apache.harmony.jpda.tests.jdwp.MultiSession.ListenConnectorTest intermittently fails with connection timeout)
modified ayza  /harmony/enhanced/jdktools/trunk/modules/jpda/test/common/unit/org/apache/harmony/jpda/tests/framework/TestOptions.java 07/19/2007 02:40:04 Applying patch from HARMONY-3377 ([jdktools][jpda] JDWP test org.apache.harmony.jpda.tests.jdwp.MultiSession.ListenConnectorTest intermittently fails with connection timeout)

begin 644 execution_log.zip
M4$L#! H    ( '"@\S;IWD31D$$  ("N P 2    97AE8W5T:6]N7VQO9RYH
M=&UL[7UK4^-(LNC]NOLK=$_,B>V)& L]_3HS<P\-= ^[0',P[,Q&1U]"R&6L
M1I:\DDS;$W'_^ZV29&-C/3*-$MN-F('V0TI5965EY3M_'D8C]]>?[_S^[->?
MQP'[]6=+"J.9RW[YV\#WHD;H_,FZ4EOYS__ZVZ]_#29>]Z^2)'WN,Y=%[(MT
M+/YUO'M)U9N:-'!<%DJ#P!])!VPZ]H/H8!*R(#RP;?Y_P_9'(]\[N)LX;O\@
M8.'$C?A7KA6&KG/7B%@8"=@<^E?KT?HBO1?7"9!=*;Y%GH[<E0M6WC0<SXD:
MP_Y#-_\:\8C5KY/7S![ZSRY=_N(7X$\N@&O^7(&D>*X2GVQ@!0X+95FN]IDK
M;VR765Z,U88_B<:3]9FOKV+?"9@=^<&L?/WL(;,?..#P@./\X)L?/'  M_/5
M3"\23[\-F(!4,%!_/$O&R6G"GP0V"PO6,'YN(YR,!=#&5RLHNK@17YV_Y$?B
M:S'Q@1](?39F7C\\$# /9OZ#?WNN-31%:2FJKL0?R/RKJF!Q; :L4H#!R&DX
MH[%;.=!PS.P-@=[9S&V8LK9XL2&<J>5R8OYZJ\DM64G>;0J)"0+C@#H"4/Q&
M_M,9;P#IZX1SG%M=;O/IQ:\WQM$X\!\;7_L/JME0]5;ZP8;0''MB?.6C,F1C
M_OK6N#4VA#::QL 4/D7Q<E-,L2B:)7\;30Y,V7 TRW FD>-6 (RSMT?._!K6
MV&EHLKDIQ#[C%TX:XL1<O(FB 0>IMAOJ&MI6F53(V:\=-;XY7H/#"QO3=O.V
M:12QM8P[BBX/F.6ZLX09BIM*.2;L(D[ST_100+)8?D*$Z1'AVB-!M+9NR,/R
M*;B.AV7GSY\E_M _:NS=BU_;]P:O]C#Z!WT=L_N#KV)2SKWL>M/7>1[_PS][
MK=F-^+EL#UX-F2P(_&"SA^7NR35V@-\DSEV\3_A#)U.9PWL-$N9O!16_VC/C
M!>#OQ;\O>VK12I2P\J6+'0MZ:=%5;!H%%C\<N PQ+I2-T]G,KQ?G.P!NF6A>
M]+T_&G-U;BZ\%URY)-X7#>F>']RQXO XRM1QUI2_QM> B8L=;^#GT\UP)HN+
MY<>1[%DC)OTB]8,"S3,&//+[$[=8<4EG+]X5T&Q\E2#:PZ.CDU[O]/WIV>GU
MOQ+5D84E6A1$@0H?O8SYK[R)MT<)\N-K -,5V GQ\XUO6[LK?FDOW]66DAFG
MMH?(?['FFJ[D@65S/(;.'7\.EQ/O'.]@S4*Q/*2>XXE1<&B2$TH#RPW93Y)S
M[_F!&.:(\6-E=FY-G=%DU'/^9%+(Q4_^33X"QUQOMCBYLJGM3OIL77OGQ[!M
M15^D"U]B4R>Q,"18L+R^Y/F2Q\?+^AR5T^@GJ>^+[ST_&A8^-=DESU<^?CEZ
MZ#L!QSWG&P(L?]-],;(Y5W9]+M+S[YXL!NO$(MX$J45(3$,,D.;9J\M^&Y/A
MFCJP\B:8>'E$3H*R8LM*\E)HHU^DJXGG)=AZM*;RRL3DP_2=RWH1']MU-FDG
M<,27H9AG5U)_DCY8CCOAC*8K*3]))T)Z25Y>.YQ5,M<:AZS//Y#;[0XG<AL"
MU8!#53HZ%&H; ;75AD+5$5 -#0H5@5=%,RF@&F"\MC!X54DPT%J#NLK$_(D]
M; Q2<(W8AEQV=2R'EU[;6#KLJSSK+RX^71]>GWZZ> L'_=-DH:>\27?*>_Q(
MM")'W/<:1_PRO,;B)_<2599^/[RZ.+WX*#D>Q:3#P$[./?'  S^X/[#&%@=S
M,+0"#G>V?&V\6LF%KL7UM:6O3CU!!L*;<+CX\&1JL[%X(7:Y+&[+G:;TSHHD
MOM),,O4?<Z_Z"Y_(GW_^Q%D!&S$ONN"R^8__E7_U_Q4_N5]?S\9\A:P!BV9=
MZ7K(&<R42US\2/0]R1](D?CZ*/;7>(SU0VGBQ<CEISB7NQXY_L6%G!"%,<0/
M1N)E?/G/_X=#BH2J*3VAXM<7T0 7!7U^4(^D=ZKTS0K$F?YC_G[<CMQ8) 4]
M$T<XD<D)D<DID<E/E"3/):Y'2Q9$MOS5%2<O3[RZ]%W'GD%E%L2)W0*++)CC
M"BY<: BHYOHA6 %4#2P&8*#JZQC8\P/[\O+LY/HM'-;)1*$'M;I\4%=Z3H_%
MZ?)FU/ <=KKGF^;JZ+?3?Y[LXZY!12B@]UB*%^@FTPB-7H$]=![9KNVS*D6-
M9(:R\!_+-_P/@>FCU8:KO0@KA0H_\DTH5%U6FB0J>O&!O_R$DRFST6:QR KN
M^7D@7@H#WM<@H5D!76K88[(-T:W.?!>^&%9JP5RR7J:.$V&Q?#'T9R@ P$OX
M^OJ%R19L6%[44.6F; JGVU/(#/!Z\<ZU8C4LP-V&?,AB8)(X-J2#:#0^&,ZB
M\+:I:>UVL3&XINN:KO>1KCO9,4^+0V#(I(]'4M\1 FTD[!&/3I])]_:MU>_?
M?F/6PVW@^]$M/^5ON8H>S-X5&"CJ/5+OD>]DC]1T7=-U3=<U7==TO8MTO1[T
M_GIT/?!]^<X*9,8!\U'$\60??'^+NZR[BIQ8D=F7868L;J=88-T@N$3390T>
M!:$VH7#;LJFOVUAJ%ENSV'UGL;K:+-Z%)[WKFNAKHO_.B'[=!EA(]"^UIINR
MV8(?2P@CO:J7Q-'5.[3>H?NX0W6S...RINN:KO>2KELU7==T7=-U3=<U7==T
M7=-U3=?;H6NC]AC5=/T]TK5>\^N:KK]#NEZ70W+,A^"X84V157BN$-A7)A*1
MP>G-&*@Z.!4;D^!M@C& 27$W"#*Q53@"-,18-0T,%DQ:' -->$PZ)@VM \:L
MVD&@%EZ20%/@8'4#GD2   O?M)@\?WBM!PQB:;;7]U<]X.;ZMWU,JL*F28EI
M0G.DQ%:GRI&:1,/O)4$JR;:VQDZ<<3V5^<:8!*(^C)BD/#451?Z#_[GD@[:=
ML05.ED(P^W8'S#M01PA8C$! S7"8Y@%%<"33+!GK"Z/O<X;8-,&\6)=U1-49
M'7$FMPWP48^IYT-3>0>1UH>12L!$A?'M:V"\HA+Y28H.@(]YC&R>47.@ K;2
M@B\6 @,JF+ 00'42J(I.LUHDY K?!"@!DD27A.MG& 65!*H&UJ,P4%O@$V;[
M!4TTDI(N1&,EX0(DQS;\@$7L5R-#C=Q3LZ[0/!85NYYT.1+-IE*H;] ,FU5[
M0BA53P6NGJM;#RRX8X$?RO](7ZRH73\<LX$U<:,K9KFCVXN)Z_[3<B>L)NN:
MK+\?LN[-PHB-+@-_S()H5M-V3=O?#VT?Q6TS/C@N@P@XB/2RC@$O6XA22L%@
M4:66290'DT0@;Y/(SG#'#@HJ 5 -7K]YVT-%E,7&0%5)#%XJ"09T$JCPL6+L
M:+5.5A_P6PB-.197RT-_Q'Z)(V3X[PW_Y#?^P0<_2$[H26#-JU;S&P3!/!WZ
MXT0R=5B8W"^^U32CH\^OV$"&</U[QY/7GOW#A?\D,5S[[QF7(OKUAJDWS.MN
M&!C]FP3TWTNONEP\,W,7O/0PXA.G$?-4&GLVC4!"(SR!10<#(3N8WT_:<LT*
M]XD5%LH.9X*+<28FRGRC1(?FBUGG\T>72PXYNU '!QCHLF[0,"(:-^C^<&(:
MJ#K8E+,#7E":4(#M1JYLW[T.#[3: :L+#6&1C)7&Z@+/@D"%Q='@%;RU,%$V
M<+RBXHQH8J+ &,"4^X?;WS&6MS9)7)P)=T%@8B-)FARI39K3D.2$,4G8MDG!
MM-0V2;X&B7:N=L!XU14$6 7.7U")9C3"-G@?H%+MX+2%P*R"<'*BFK.]DA:S
M\F;O4HS>GQQ>]/8QQZBD<5/R6EPF9CN>B;D::O4Y0W?,\L+LI*',=0$G1:6I
MT_.E$0E'Z6)E9TJM0W"\B 6>Y2)O*[HZ?KF2CF6H9.E8!:A='LMNYF/-\3K/
MQP(MQO,DK@R[48P4N1>)R5UR_#IAQ/C\CYG+[BU$NV]$#FA'I3E12])C_N"T
MT!5=6#UF1VE/UO_HZKJL_(<4L &GKKYT-^,@@D>67[0S@7+AB^2JR+=]5PK'
MS'8&#@.ZW&X\VYK<#R.)S;O>BH:]A[]?-RZLR'ED)X_,BZZ' ;/Z^5EYL<$P
M[GIZFM)!C)BN=!1W097\,?.DOA..76LF_>UON7#^8D69QL1OD?PM>I#YCIQ,
MY3]Z,4J.%IB3?W;XW;^^6_\B/B4,)3^K#/3 ,_'W=\?K^]\^6';$]]O\B1G?
M)(]L5O+(ZW^L/HB_C\%WM&+P3\O!"<GEN)#_>7Z5O!)8\=BWN./OJ1=&%M]<
M[U:^%3=CP7.4AU$P$1@0T!> ES^/1ZZU,]LD9\&.A[@*+?XDAM/L&  X J?7
MON\^.)%L<PJ.&$?AN_DG"2K;)=2Q!LBR^6$<_J ^@]-JX>#\H,IB:5>AF*:Y
M,>&L;5>9LZQWZY\F!%HPVGR.$(,YYMO8BNPAG">(D.]+/SXA%JVU<3B_9]'2
M1/YGPB9L%7&J"L9_QB1B3&5]GN"J8$T QAQU_6AHMDN$]Y/>=?[A>!@$UBSG
M;)0^')Z>G1R_Q$BB;Z#+%XXWWK8O'R\"OZ6I?H7C+10^8 /.N>BYT%2)K/3D
M9$L_$'_MQ*DFO^>O4P=;+Q&XH1(4PM[7;A8KSCLOZ:#X6BTPU0)3+3 A 'WW
M M/R(95G;,LXI3IE#8P+3ZDUMB]8?0@YHMZ$8+;S9TY]6-2'17U8O+W#HM:N
M-]*N\^RYK8S<K[(T+=RY>C0)(W_D_,GZ+]=AC3S[L98A'QAEY5IP\TA3.E\^
M"2U/QM&RK.!EDZBR1!@.(2=<2^ZS &LV0027=."!6R;"LZ##PT)-A*]>0U0)
MPY38A <L-!'1%7J)T6&3<"!5[I24R>KY(_8I&K) 2-OB]]0;^(*!SG=76@#@
MU.NSZ;L?)=MR7=:791G$X\">>@T38X5:*Y)"<8B(N#QZU=H9!%M6=@C'#U[.
M&3$1C? "5YAPFR9X_> U%!5,GA&&/6KP*&1,V%5)B%BM&=::8:T9YL.N-<-:
M,]PGS=#(.QLR5"J]6:E*-9?V3OH.WVGGEF?=H_4)%1-87V8QWBSNM56,E/K 
MK _,^L#,AUT?F/6!N4\'9I[BEQ5(4Y9[B3LO>\YH[+*YV01K.T7H@&IKRZFX
M.N)4U^ Y31A9P8#W#,)8&#K@+#R,W0F>+(8P6RAE[2DVLX88-(6I2VS%M116
M2V&U%)8/NY;"MA_]I.:>))E!T%6*%N5!KV6B1BU-8J7)#(2NO-EZLFAAIIMX
MQ2G&MOA\^('(IDXH\N;2/#_+$PYIR>//X0>K(*6?I+XOON<'U+ POXXHD_7H
MZE^7UY_V,945F1F:3E1<O\@2C1<%?J\U=L 9GJ($!E&&IQW,QI&_2/$\X,/*
M'5 5:9ZE.'&\K_S\C0D:AAQ5>4WDR//Q;0]+0D/= $W+6*)$DAC>KF!I!VE(
MC(L4*SMPO"R2LAM\QY0G9@,X8G*F%R0:)6A>*>>7?B2T1[G'N+0<_8/->OP=
M-+\(87-H$_2#TS"EY5"Q+F#["*95<[,D4H*FT:8!GKB&:0Z ,3?!H6)"1."M
M'% ENL K#QZK)JLTC1N5LA140+QGEBV3J,DB>*RH^DSPK8JI^P OTH7A*_#B
MDJC>C?!^]235^E"<E62L)#4K#9VB8J,.;RN/*JE&4EV2Q $#[XU=8<#@IB<7
M"1N A_W2; (45))@8CA4%".$-TC'T !%>4U$33T,!FAJZAE@EH7" )@&,$[(
M'(]IOD8EEQH*5E6K==7ILA=KQB1%&:K'/)?RX8YU#)4@)+&M<V!XPS:4<$,S
MUI)]0J,V8FJOD1P\\!K4&#$A ^HKN3N>3#["P 6V^11:Z5Y@]%G8>U(G]NTI
M?Q"4A8'%/;4\FX6&?.%56%5,IQC$6=R"2\\(J"J\SB&*<X$W&T8:@9\(& S 
M$R=1> 7' Z'J^Y(H_#DYGD4<!"GDY+.2>8W0V#-^Y(R'+.B-'2CCP%BWVAG3
M?&U>_?JUCD]'UCT[W4L7\0;5CK7JW4F.0*"SY$]:#*="]_9\E;;N6WP^VS?C
M.,L/WEE5U%($R>F*@1D57'S(,&F^$INB8D$7O>NKF_.3B^LWPH6X_%<]&XJC
M($=<9*4HO+ZT1% 6U"1SX)=-=7ML:%/6D2'^+ 4KQH&!3Y.6;SR."6?@6'<N
MB^-5%Y&"%'[TLEHL&_G1-9I.%!DU(_:;-?[]XOCTK3#%3O6<XJO7=RC88;PL
M8%E,U\A88?X$E\>RMTQ03&_%F.19(WZI'(X=^8J3EOO(^#\3%UR@&&RZTU79
M[)"HZ#2=1&FZ*,+=._!X#TU6X<T9,?Z=LMP ZE@B3!B)5M:"FL9*V4:$I+3@
MQ890GMCMNG<Q3=/@^84D"&@BG&$&T5AI'$PD#0GA$508)R--$U4P5A%#5562
M0!^2DG&(0G2H*+JR(IZ;H0#>Z!$%E607P..R4*GQ1+$^<,0BJ$"!%WE$;002
MH04>EJ,J"!R8+3!JFYA(7?CII2,(08-[]#&\&RX58 )^X-V/46%$\/,;U:B8
M)$H1S@TPH1+PY<) ;<(W&(8APCO?JDU,R@:<):(8+1@)'4QH<4FSP@UE QH4
MP/WM&.KJ@(];U%CAZ@P"K KO!H]!@4JRP1!%:3%",D(VT#$T"X_$PQP*\$K@
MJ,AU>)0]W"NIR!TX:C$MJQ'A-Z@@:Q*!%I[(M'7K!L(.B4H10P@R&%,,W&B*
MVK8D86AEMKT-K2;;S9&CL45CN&%)=-^&;H2+^.52&5:0%H((UVBVBU>NBG&_
M%SXC^/ 1B]DIB0;?</3'3L#B,& DXN&'LBH;RCK![+<W^.SPXF/C_/#B\.,)
M+%IF^]5:\J\KKD20/^G#2X3KU23SO(J@C,8HIMY%) IUJ98"9!;'^.=C4T3A
MQQ.PDOJ 4,321?=D(7:'2G1 O-O9UV03_'-&NA3W,XD<5W;]^WO!-<^2?\__
M$(7**G=WB[9#),FW<#D;97TIEEN.XCI\?>E<X"HIV"A]<Z*A='K<E6Y.CS\;
MVIW1TII&5U7U/FMU.OV[9K?15A3E2]<+HW[@3MUV5ZUTV*JLM6A4&;#NB4I<
M(C&BPS5:3+<HA.L+Y5 #HP!5M9;$"@.W[:#LQV"U"^53W7Z>1<YY"9!JXV#,
MI^-)3JH?SDM3YT+\?.9;?<Z2Q#<'@K$?'/EN6@XU_*$W\^QAX'NB86"/1=(@
M\$?8 S6R@GL6Q2^_BM^ '8AC]<[WHP.7#X*?*<$7Q/A^L\)A)$),?]"W/1Z!
M\X.T#NS!81!8LZI&)(2+?M*%[>#@@04><S?'DWAU&K' XHK-ME'V? E_4+<\
MHNG!DDQW&$6!<S>)V)D35D_MHZGQ]5:7%5F+7Q:/<1,NKF)*%&#.!K@)%7,Z
MEICD(-)2T^ZT[;FT9*NZM:&TA'"-=\KLU-M.Y%5D'>Q30@D(8") .!95@V:L
M%/0*3V+%-"%0.^M;=L_-09\^?CR]^ C,#^!<\#5S!, Y"23)! 2Y!*DB3I%.
M,%](J/5%HRN.6CC+Y=&\O?S.+&4@-<[D&6W^.#_[X <C*XI*3-R0,YC92EN9
MG\$#HV-L> 9C0O5+#^'-W/ Z/#P-95UXQ;;AFQU"+;C(@/$-(CKX4BC_&LJJ
M O=F(\":\#1%N&5)E4U$^!@FD+(-IP.4.Q>^6S'AF7#O.X*\5$094?"*:::)
MX5F&@L "O*8N9CLHZ];;/9=*;R[>2LIJ4R$0P#@UD<B88EG^?L-)-:%4@)BI
MJW1=+O*GN3R6W7/M+2-W+A@"4)OEXQ.U()]$QM^Y^"'L=>?6&.K=0]0<4^4R
MB8M(-H*?M8ILP&T4F$,1GL>(2C<CJ5-+(Q[2!#O"ZRIC- -P$B]FL>!'-T: 
M@0O(J(1C$@S 20"C(9 4($68*C%X+6E8OFEL[C;:>NY2L"><!%!I<7".A4E8
M@0<GHZ+_X9P00UHE<:/+QG5,5"0BE)HBJQW!7G2:P'<*1XC6)HF>@N><ZIAM
M0%,L1 ,?7)A#%LX)$9%8*B(-",,+X7P 4X>B1;(-2(H0$YV'B+$B!JO#2T:@
M]@$%*]";%!P642\8M5Q@20.5'TPB&,-9+ T&4%!)-A<\()%FR]+@U<1H'-O>
M!CL %9X>C0G4!LN:**A-FN7:,L6BU'D:7KA/!+M''):@%:F 2M")4.W(:F?+
MYP$FJ@W1YQ)U'M"P AKB*MX(GR:1Y ]27XG4G\2>DT' V'GR28[_Y27*,**1
M(29MH*RX[_(C3J;,[E84'RZ@2PU[3./[ZE8*-0SL9TT(7@P_N2AQA;T45I^-
M77^V!/+@*XNB6:,I\_45<=ID3Q ^-M+'<$"/+HM$DE]#DTW:9TW& F(ET)?)
M!P L\>NO7Y@$QC4L+VJH<E,VXVC\>#-FCS+S>O'.M28>_R; W89\R&)@4N,X
M=L%RQL(Y8S1+,WN"7[*"_42^PU*D7YP)U$MO3//8-<';?CB?/?LX,W80#$[\
M^> 'O5D8L=%EX(]9$,TJM39K<B>CH%7-76ON6G/7FKN^A+N*J^6A/V*_'$2C
ML?B]X9_\QC\0'&V5VPG.M2FGC!EEO!B7+!@Y8>CXWIFX^G;.VF^?OA 7/P\3
MRI/$P7*O+FL(S0GA#$6TX*-1R'"V&7@99K"IWI3;<'4?5[<-KNB!=6A%AIOJ
M,2Y&1"5Z&ML$ @-*AR"X5^0-D)0YAX=R@6T3:I.J3"H\0@J5>4H2%;!7SA4:
MIQ4-7FGL4S0U$6DZ/<&CN3"N=D175C@K4#59@P<TT52QQ$"%NYII=@*J*B))
MB51X% /"6)U1CJZ*LXOD_%;;<,\=20PF1D#6,G)HJF!<%/%,"*BHDCHD_D!X
M&"HJWH D[@A>>1=S'L!;@*%H@*3= 3P2%W7$D"  'L9!@E:4O$U1T]F QXMN
M'Z_PLG4JQJQ!1%HT4&GJ_%.0ED;4/X$$*,G!#>]:1J0=H:+\JP_B0!620A5W
M+Y$*;=</6?5S@>\]#%BX((8I\*"4-&=??L3A(&*!Q(&RZ-V/W8TG H_?Q)C:
M,+(ZC>4"@W5X RE4MY V#0[@61TDC 2#@19-H"$->^J0M("$R]6H7)&2N@_+
MCZC][;6_O?:WU_[V4G][XB2?([27_'M[S/A2LD_>R=2)&Z57N_7[3F"(\B 1
M*61.)7?\/4BY!RNANJS#A2=,XBI<K\'8C^%Y\:CC;<LG/,8LW8)W'$2IH5MV
MIZ&:2X&7"T5:<+\Z2C6A\?^2F*4I,HTY*T"8NS&->.%)IIBR"S0)S'#5A"BV
M %'PTD!8S\ LQE#D-KSL FK?$ABEN+P'[TT.[R:ARFVX>5K'E A ])C!^'[:
M<-RB>"*)M2:CN'4>#C">5?@F0S6[WG)0C(Y8+PW.$XG.,$R-<YH^ZN"Q8E@7
M/"X(U;'&H/'4T$B(-/N !BJ-VQYA+J^M8+45K+:"U5:P,BM8U;P_XT2I>53-
MHVH>5?.HJBWUAX^<*0DV57.;FMO4W*;F-J3<YC+P^=8)KYC5_SUP(K;&>%ZJ
M-G+J@!O1P%!51 E7FD!?C"N0Q@E4O8JO8EQ+*!4?GJ""*=$$=RI@'"#PU"<-
M002(U%V,70X.%5-2"^[_0&TN"M^UUMRR[QIC]$:DFI-XP5 J+QBOJ*PZ.&EA
M?!1PL#35]>"^*K4IZR4AI9JBM!K\?[4CJ9VN87:5-C]$.]WNZ<6'3UU).DLZ
M"XI6/+WKXY.K*^G1L>*B&2-^I-]9<4]"N1?U^2#XM:CG&*JY>,Z3Q#I%P6CI
M^@)&CZL:HJEAS[<?6'3D>QZS16OL_Q;X%?]US59',ZH]&O@YEA&#G4=GB(-,
M@[,P(D<0V&NEMN0.7)JA29*'IT<KL@G/,-J! )PM^P/AB><B\@*>&T!3?I8F
MZQKENEN'6AM4:H-*;5"I#2HO-:@L.OAY+)(%>THZ-R?RSBF_%G1*@!6>EFR:
M6TYM1+'SZH-15-DD@(H:JX&0%<H:&JX)T$9';FKJRX3P&$8;(X2W%:T-FCHB
MUD^A:8Y'(R$4"[5K&#;CL-Z7K5(,HX5;)1VD*F&BDTT"G4:5VT1F&3!%82H 
MPKOBH4HF$ 30BO)4- V+X,N%T9?AV9@M! X,>$D6'<$$3'@G 4R-"WAZ$?Q<
MT66#IM0+3=T$.#- '"\F/#L=DU:!T,))&!?*[@G?M0A)J G/4T 934@*?<#K
M?IG@0[&-:4.M@<%JF!*;&!./UH1;U5'M<N'N"C#1<FT*D?Z V0N(>B<D#@MX
MBI%H<4U4G 5\UF#R'U0XGT%YF. >;(0\VX(?821:!XTI'=4X&1X:@2$"N- %
MSUKBW$"G22\BZ1_>@7.NK;M:$;EK33!F6WRP< D15;J&IAXB17@$39=CBM*%
M*J<"N",4KMYK<H?(XPZ7.!!;P8"/%<40X8H=0CSJ(!00!$?L9.3:K;R)_(D]
M; Q2< U1=*-;=C6+GU=V;4-8RAN)M^#EE]G^:,R?UQ#ONFM8DCXS>^A_D8[B
MJT24Q/GA]6]2ZGPH@CJ>-9X\7_D7AH]>P_$&?L$EL;^C(=P*)=< 9IDXSZ#3
MC*_.H!S^TEZ^6)BZXYE*8NE"$4E2E3-H9$7#A8<R=R@]QQ,/YT D)Y0&EANR
MGR3GWO/CUH1)H\)S:^J,)J.>\R?CE!NM=6M9>3,.V-@*6(--;7?29VL8^VS[
MGFWQ[7/A2VSJQ+U?TLE;7E_R?,GCXV5]CL)I])/4]\7WGA\-"Y_*=V'>"LVW
MZ]7$\^)@G55OD4"3_-ZY/_4BEK:N 8F!\) *C(4(8R]6X>7@,&GF*MQ&9&!"
M&1&=K3&.+7AM=%SN-ES-P 3*PF4V'3-:1.%]3$0GHAX3AL#@UEV4N1!NYD>5
M!H1KW!CG09EE;\BDCT=2WQ$<,>),U7]T^DRZMV^M?O_V&[,>;@/?CVXY.[YE
M7A3,WOU8M1E'-:L/+T.I%VU,9#^"NR D2PU>:1D5@DY4OAC>UP05MX;8KV#N
MHLD:/,(,$=3+<5L28K9U\1HM-Y_VCMZ"W"RF"96;U66QN5*IV0GM6FI>EYHS
M.D$*5*6=("U;Y*[Q+2+W(H&"P_0]5)I&,+EVAK*_W_O[XO33/FYO/IX8'SF#
MBE^.'OI.P.<:,$L0)W^##NC-W:F>X^=O5+%AQC.!Y?$LUK.UZA7LW &\C \*
M<@"S054ALQ\4XG<[C+!"YL5GM]S%5KRUAY;G,3>4P[$C]Y@;!WU=)I(WF),A
MU"M$^524_;[Z,I^:K"+\Y5NOCH7HZH58+H,FD [>TPK3=J8LE)!&O82[KQ2Y
M"5>M,#-7VO#2:(C%5^$Q#:AJF7#-"@650+/"&5A0IA"2%4-TJL&0K0:/E4"!
M[<!Y%B:@%F%O1#4E)<$M8N^:J 0Y^'9 Y9##"^BB/.5P3H/JG@/O<X, B^@!
MCMN\\/ IE&>?I&L[/' &-UB2L<*W&.;4A8N'*/8%KRN"HBYXXA9JP> '&0H)
M\*;"J"6CX5[P4OBXO4 B*"%"J'8!+%Q.0B4:D-2!1R3QX<#"B_?05&S'[0:"
MNB4XR0.%6Z+1TH!%1!>CP-*<9/!08)S$3 )6@]=M1R$!7ED$)8@C6 U-&C(.
M+!&KH1DM/'0)9?0BL?LAHDNW[E0WX4V>B+)'20Y=%%22&FQPJ"H\9$/5%$Q;
M+HQA$9&,AXG>:<(3?E'8)>ET19/K2A,8#\? ]O<M7.C8/EYI3#,T/(:F>B1"
M,"#);$,E8\+=@1AFB*B3AZE2 -^SF$0.M>1 2 N'.+XG!6PPX7>!^"8\94_5
MY!;<_HJJ$$O@1$99<;:_;^#1B:@6@33%6, 80%E):?J%[GKVTP;A6[='OQU>
M?:<Q7,\CJ5HDD4:W]M *B**IDM6!AE09*F5$5<$\EX?S]N)+TSC210V_)!XK
MX!.3;ZX_'"4O3SS;1\1B8<*FV@C_*"+&'9R6@PG'!VM+J)KP)2<34<00(AT7
MO$"8:<.37##" TW1 [A]"P/5)&DT 1\KRF=9K'@=69X@SH'#6=;$&UGCL77G
M,NEN%C')"@)K)EBJ=--K'/:.3D]!D@TFN0]NQD!UP0!+8:A4(;@@BMA.&MQA
M#T]L4F45/EI,8%"38K2H\(+J D5AI/_QO=I6=*5R:BH).%P?')<DQ/'.1=3!
M@ 6@L54"9$.Z5DOB:6'8/^U]:K3;9J>A@@"-+)??-=H RJ;+"*=;5"P7^##$
ML,42NSGP*+C^T%";[T]>LAZE,#9=C9)(4]!^0$UP<R@;&N:4-DG?J!+3#88T
M7DX8()QA)*MFB=41OJ"D,#8D"40T.(I;8)&63Q)G%7"+ A@;<PNL:)R[I, )
M;@YE0]+0X8&0*&Y! K4D60A.<*!B\"A**;&7@]<X?V05@-CT1,FHJ['?YN7+
MPZ-_:(KR1JS+>O56U[%E/W $4AB7YVL#M2T+/PV1;;EPELNC^?Y-R_-UFIN6
MRU9IU1"=D2N<XC;-%Q8\6IBAY2/?"R/+BRY]?[U-^#+HS8Q=;7A:"2IUB\3<
MARB_@S&H@<>**42&*+Y#$9R/LG=2A-IH)#WS: R^'7BU*!(=XX4F[]T2/1HC
MZX'QTU@<. U1BZ/@TOE9Z%F1\YAY)*Y>+_@Q]%HB0>GJY$/OC8A);0(!(F"#
MD$1(BM<%+"*9=")2_@R7Q[*W)4WB^2T7-1']$M-/+_E?%C ^LQ JJB"Z:73@
MSG-4&EWUW4]4N4,4O$G2A!4>P$O42:/"@#F:  )$&=Z,M@F[=3[C3[S3B^M]
M//&P)PCGO!$\@(M0R18#^:Y/$#Z_I1-DFGX2+\#)U&9C$<T,UG45A+);HI;^
MLOPC]:X/KZZE,]]_F(S/)V[D'/MV/$;1\M5)S[C5>_A/+O PO2MF3 -_XN4'
M:J^.X^3BN+I1;,;,U1:\J3A&\:2(7#/@[<Q0QUGQ6 ^C*'#N)A'KL>B&2T1.
MY BNP&)#E"S+H.&@>NP5:Y?'5L3$/;V9%UE3Y$ PU;M+LFU//,Y^-AD#9E^7
M94_^9H7#Q0)!QA$+MJ+#<YI=L>!*7<GU;<L=^F%TH&JMN%&KVFWJJM3 9&+\
MQ8JR.*/HK!T_]M*U'"_M*3T:N[*=@'[W_//X#->T3KX04^F33*7D20N\)7<N
MH*5O8R =7=MLN)SGL<"SW/@!W[Y]X\>&'_FV[\K#*!K+O_$_3TL@_^QP@+^^
M>_9I/(+F:PS@W/*L>Q;\\/2)L.#*]RQ:O>Y=YFW)0%7C%4<JA@8;5K-%-JJ;
MJ[.EU1+(NKZ^?#:JU6N2$9D;;@'TD.84G3<0PT0/9"[_...Q?#H>'[D.UTSD
M@/U[PAG5NZ=/$I)05=H'M/&+.X=O3\:A?'1SV5N63^:E367AISUF XO+,,O?
MO\N](1Z.T=I\OL7CX<2%'X[:!'# %8$V!9,(<+(;_Y/UW(R+DR?JB"=:\T-.
M7CGRQ+$:"]R'_;[V;OVKY$%:&\#<78N?G/QX$W5KY7^>7R6O!/T[WJ/_P,Y9
M-/3[[U:^$3=B02=P4J#OTG?Q.'6UA$+CE_(@L$9,Z%BRF.*1%3*9RQ7B];O%
M!\F\36-S>.^YPO0<GK;!^*Y8R GB!S7F/X*_/'V80E6:FT(5X[Q,P++^.F!M
M@^D_ <X8:!F]%J#S.2K5,I+,@-6;.-'J6B>?)+*2\A*(Z]!T,'.*^.D?RI;0
M?*WPH2_,I7XL4O+#)WGHWV_XWQB=7'?F#$<\\/EGR6,[<!Z-?ZQK33Q[F/WD
M9@LND."?/.(B9_9S3:. ^G^W F%JZ$K]A*U*,2^<Z]O2-ROT_I9JW/\[%\BE
MRSC92;&)1G(&TLR?2$/KD4F6-TL LB"4TM-?A!'XXI(@-C-Q-AK4JD2M2M2J
M1*U*U*I$K4J\"57BY-\3RPWSE FM7295ULI$K4S4RD2M3% ]>9^5"9"#!)/.
M51*+D78EWLA/@TE7*<D>XCO?=R=B53?S&*'<9\5.PAZ+/@W0:!%^=NT8,_AI
M!+_ZYNH4?O$'KK.$(K@=Y(3\NW_7BZR(77&Z];T-;H'<<<[ZC@6^\((S3?#%
ML<0C<IL. P9_A%@NZ&,NDUV+Q=+Z;;7[L;89U#:#VF90VPQJF\%;LQG4[L?:
M8E!;##:&B+88[/KX:HO&6[%HU*I.K>K4JDZMZM2J3JWJO E5IW:/ULI.K>S4
MRDZM[+P]90?FK30Q?=;@10I0-:01#98PZ7CPFE*H)I$E!05H4O]1W0W@#4TQ
M545)BCX8\!;'%/6I,$,M*:NZ!!53H$LA:1.%*/N%V5'P8AHHQ()1@((*)@),
M^UV:L68PP)4W>U>MX^KDX\D?;Z!:1S+/^/(,FK">5>OHD!7K"-@]F^Y:L0[Q
M:MNMEC*L!?&=2T6C8MS)O;&;"'D5[^U.62%G(GD!?%J83;D-KZM!TSD4U^RW
M^I*6JJS#FZ>"JWIIL@KOXX21PUMM\'JAND""48"2\+ZWH^W\]"T<;'R6UM@!
M'VUBKU.=;2-G<;(=\#'MR.F6?2(U^ #+JS278;?T#.,X62E=)=YSK,F]T.6P
MA569!8D/[H-E1WS>T),-P=_;-*5UMWP4H: 6M^41"W3L!,R.DJ6XY01Z[[)_
MGDMA9 5KI+=\:R^]((81VXT*G-<GT[$PN\?BZ.'QOZ1!X(_*[KE^@IN,AO7S
M[46?[K[R!W2E\]D5WT012]Y_OO$<VPJCA-JNV. S\_IC+L%%W<^?55'1VN2_
MFJRWNV:[J;6^?'D7^])__$D /#W^W#1-G6OU-_REH;7N[BQ#Z:JJWF=MZZYM
MWG4;;451OO ?R0Z8):1$(3,F7*5HN'^?N)+*=7!-X<IUJVL:77X(79[G[:,$
M"S+?-U?SNJ&2*![<BP*_8(D^G%Z<7'4E82'L2LFU[DQ:E![M2U?LG@N\P4RX
MT_/W>'K1?(IEBR#=":.AY'A2Q 7'(+T[_ZX%?(%Z+-::!5BS$Q=BXDE<BH0(
M.1$<?SPZM!^ F..W2_P&R;(?Q*GQ>1%O(?P*G2])^XQ<$FD-!OTON4]*_&J2
MGZ#.X=OX,O"GL\^Q[730_5S 6>4YL9_&UUHV/TMBG4%<D'SSY2=I>3^<>H\"
MQQP)OW$Z=5DPWR"@K1'$D/![(W_RUTF$?\Q";CF!BL/UG[[3+PKY/_8])N<?
M<[G@!=ST&47@KU@T"3S!/5=9B?P<2.4#Y*M(.WG^ -C,.^U6TS1T+;^CW:;C
M2#!*-LTE\-(W)QI*"<G.=Q=7X#F1BZLMH<#S<V7E>S+$)\,JS!':$<Z6M?%+
MV1MKY^_P)Z)Z 5O3R/B:;F;SM4X17^,S[A3SM4VIY8R?T/$?X#[MM-NM5I,/
MV#!T7=/4ZC=LRI1?RC=7P%!M^_)M5J4E*V/+MO9FR_;9_F[93N:6-=3B+=L?
MT&S99$[$LDOR$#"99Y!F>W](4]E;TC2:V:1IEI"F2D.:[WW?99:7T":QY!6O
M!QGT0]&"D58XCA]!MW=?809+#_INF<-=@2:]*?(6B11%6"OF,$NY&%G2S^+K
MZL<N3'^E"?)BI(D)++Z^FU@,)=^V)T' N*HT=%PVUX5&<52KY"R8X'_-':!L
M/@UAILA]XE_B1\9AL^G3,E$BOJI^KTV\R!DQT(H^#?/Y71DCGJ[#)F(4\+$O
MK>K3R)\!(5WCIP.T#'6K%U6%N;EQ6'B.7!:Q KE_^6K7#X4NDWOQC9?8;\7"
M;,V<7-$ID3\7%3<97<V<3*M8LAD8KS,9 SD9/7,R[1*E?[";*Y-)9H92,AE]
M)R=C*)F3T4H$Z/YN3D;+G(Q>,IGVZTQ&1TXF<\\81LED6KNY,ME[II UMP;V
M;C( HY,YF1+6;+\2:T9.QLQF "6LV2;C9LL>TJK@+TLC;.I$A=+(,;\X\.,N
MHR7^\B=?ODA0?=.>?-/$B%[,LEB%GGRUR'-3>_+SL+85(P34DY^0R/?@R3=S
M/%Z@O5%[\D$#K#WY58+?=T^^VMD)\RK?^*7L;8\]^4T=Y<E?S+CVY./XYIOP
MY&O*WFS9/?;D-[.#"O,\^8L9OVE/_CZ1YOYZ\EL&RI._F''MR2^!7GORP5+F
M!IY\3=T;YE![\FM/?NW)KSWY^^#)?Y$Y>><\+)GNHCQ/_L+PN9N>_&9V6$*.
MNVBA].^F(Z^9269YGOS%9';3D]]L8SSY"P%Z-SWYK6RO9(XG?S&9W?3DMS+W
M3)XG?S&9W?3DM[+W3"%KWEE/?BL[+*&$->^H)[^5S0!*6'/MR>=7_GYX=7%Z
M\;$;2Y.Q/K[JT7="*7QPQF,NY=TQVYJ$3!A IS/IG:BN*,>OY=BKJ8MF(>)Z
M822U;)N%H7/G%LA7ZX\^^GCZ*D]>*G  KMTBJMV;&DG=A.*J.&J#+_P]BZ2Q
MJ+)2X.C6&EX?=.'2.,$%<339**NB1U.Z"5,YLZ25X890RTI<;K;J&KB ) 9J
MJWBLBZ@)KJH=W?2N/YU+@F=)[TS^\V-YK$;,A,HUI^7'')]\.+PYNTZ?(T(?
MH,])_*LA(#!FKA$_6BZGO@MK))CCG2-*JEDC%I9QX'R55?P<'*Q&;ARL'%2;
MWZIM?JN^^:W&YK>:F]_:W/S6UN:WMG-O/1*UE@3%Q$0",P6L$5C JB.QIV8J
M:!(KN+6,Q IN+2.Q@EO+2*S@UC(2*[BUC,0*;BTCL8); 226DLF&1)9T3"@G
MLA>XME0RUU8[)U!BH3+UFVK'G OF=ZJI*K$!J%7LVMK-N6:[\9Z,73ES;>[C
M7',"^]HE<S7W<:[9B=9/P3XY<S7V<:XY41)*R5SU?9QKNR0B)&>NVC[.-:>.
MA58RUY(0@YV<:T?)GJM>,M>2H&.($.>%43]PIVX;+\05W%HFQ!7<6B;$%=Q:
M)L05W%HFQ!7<6B;$%=Q:)L05W H0XE(Q;$,A;N)5H2DL!I."P^GA*^I^B_\ 
MU?!7T:O%>#;4J]=NA>O5:[?"]>JU6^%Z]=JM^?MEA]54](H5W I74]$K5G K
M7$W=9,5JK:_6^FJMK];Z]F&N-%I?+0%4*0'LIP"Z[!1/W3DO]2UMXAC3Y8Y1
M[+JM+!2AG5WO!73V[5Q<17RZ%<3O%1UNNS>9[,A*T.FU>Y-I9DX&=#SMWF1*
MR@H5G3^[-YGL6"2067'W)I-=[P5D-]RYR71*(BN+#(-51G%M$H)"TEP&WA$6
M,595 T-%-<(A@:J3M!NE"1B"8P#5;'B]:4^E<6/\$4V*1FJ&1K(EX+V7,1@P
M2#KP-L$19*BQ@F,<44P!W,<*1;Q@O-) 1;4'(XD=;16/]<R_[T4!LT:?HS#Z
MTOU?^?N<KO%@3GO2E3=$S0E[)T<W5Z?7_WH#'0H74TT*JTW&L:,G[CZ801W6
MLWZ%8M,3]2ODY#D)G&CVU+0P'5SNL*IH7%B")$PO1TU_3>10=W0$(,;QA' =
M=R&&8:C]NOB1YP/<)J(<D=J!QI2JOR*JQ!!W!U=@8GK-W>9DES"L#C.KIZ8X
MY-;.!6G^)O@BO1?3$=#%52^>=Y^-77^67INPWA0#M_%JW(K-Q)^T0\.Y=;Q=
M&E&\A79L/#N&HO0T7QO2NG@57Y\G9,4O1P]]A\_@**V*RM]03& Q@L54,IB9
M&+%@2^,XB4Y3.M6Q(_2(5MZ0=6$&"4=I7%%Z2WR5G'"11TN>#UZ^9,'("4/'
M]XY\UTUJOP@%IV)=M5W2<7A3#7C=T)+[B),IL]$T&EG!/8OBEU_%;\#B$TE 
MEQKV^-7X?O<UF0/!P]:W#<6,*IS"<T$$ #!17-<O3.(&&I87-52Y*9L' GY,
ME-DCS;Q>O'.MB<>_"7"W(1^R&)C4.!97RT-_Q'XYB$9C\7O#/_F-?_#!#P[C
M[-TCWXL"P3D"+<D$7 ^46/":A >M\I],*#_T_<O >>1<_)[US\0-MPMJ??KB
M<,&LBFI.;F)9TF6M4\*OB#)HP08E36Z!K50(CJJJ8#[=@4)MRHH"S_9%F%7A
MKI8FB56UA8 *MRDBQJJ:8+QB,-"$6U7!*-#EEDYB5H4G9X,)EB/6 /N%4(@%
MNRQ4#&UUX+;U-@('.IBX:#R9B/52#+#3 C56,%Y-.-2F"7>P8 9K@C<"AK9:
M),Y<%4RQ&"*@<;VKX$V+&BOXG*49*T;+4DGJ7\"W+,HC"*97!"M$G-X8O&HD
M4&D")0CD0E3X!7BU.K(*ES:WSP?@@H8*)@*5JR]PD0"! QU^>(.AJH;<UJN7
MX325KQA)C2&50I)7-)JQ@GDLAAO":S>A]A<8KYC]51)UL2&/A8MP"%FKV:&(
MYT'(6G .(Y0.&BFV11&!IN@DZ@$-Q=*HR2KXG$'%"T*!(O0CA%A$PPII1&,,
MN<+-.JC% C,"Q&KI+;A-@X1<M[\)B!AL"RQQ8_1YN*B%0BR88&FT Y2%&TZP
MF#W;IA'@X.H!1H #$X&* 5M2T7+#]8+'I-.<W32Z 6(?: A1"\$*5(29GX1B
M,:S !#-#Q'+I\+!\E*L'C &45+1EQKT#YRR):@!WH])(FRBH]5#WA6DK<.\9
MAEHS](TZX*D.>*H#GJH(>,+&+MF,X_Z(_[FTHF$<R\L"-8Y?.F8#:^)&U[,Q
MJSKLIZ.1'*XD#EFXZ$YSM*#<D7!-"Y-+"#>/H%:+1"U$B$(H"6O+H@"&"MHT
MSGX:&9-D=\'=\CL0[D!C=B)17N E 1"ZI@:W/V.<D1TP5(0&JRIPJQ.8O:AR
M!^Z+0T51D&3L$\42P1D!360ERJZ-Z/R#XMP4IAP#S+8P_O.RV/(-#40D-ETX
M!DP4WX+[3!3,:$G"7E23IG@%?'^1G(DH=DAQS,"CB3#[H$FRN^!'(BK:@2*Z
M5B6I7Z+2F%]) K<UN': P0!)0#R<$V(00$*L)%' %--7VV >0!-%1&-^W@''
M,<E!N&U?[ Y )5DMFB :N"L6 Q5^:M-X^5&J!DU.#,E824+)-'B4)F:L'8H3
M1H6?6RB!F$;&(L% FR9_AP0#-#)61NG,*J"2C)4FE1$>35AA3<,-H<(#@&DR
MF% IHC1<FT8OI#FW:'8LA>R"J&Y D\V*H@$2#!"=!6#*HLF/1 77;]7X2@)4
MPV"U#==B40(12:+5UNW$&@8L7#$ JW$:5:%KHA1\DI1FN%C\PEBZ"C8M'*J*
MRA/>+MO2:*J=8[QF<(D Y> BHECP8%$4"]X'-/EV*+6;IK,"21E!^)ZEB5>G
MX84TX2DT8T6I7"0"C H_9FFJ\J"LI7NC<,#C,E!L@&2MX%8BJK8M=<A^';)?
MA^S#0_;I26Y!VZ( ZG#&/S%41>VD!5+%'GO*!QC[KF//?HF;K*Q>WTZ_2\LP
MSXF@E_Q[FU6$64K O *5'V0]_B!T[CW6?_^/7F8%\SG#2DKM+_^M5#IMR49.
M(&9126RYM-E#,J+YO:NKV.,3MR(^-C'@BG7Y)OSDIJD701*WCS$_J7#S$RJV
MF"3G%E&I$=-A"Q&OBRD&FX&#E3>OT#>J(;H>(.K7%[8;6=VDY<E94U/IR%$X
ME@5F>I$U&E^Q< S=Q6 :YKN8H%X9ROF+X@TT02 E?(RF/#8F JY-83!3:4IA
MFN"5Q_ #> U !/\NZ\Z]"96V$96\4?$D-*'0-'TG*:"J-'XY>.$0E+>/)&X;
M'O> ,AI7#U65=3A4Q & B-M&,!<#SEY163Q$8?8D1- D"06%%S!&Y-OH!#Y$
M548DL,#[!%"P0807&4-58)QBJC+1%(*EJ:E($ZH&-YG38 #CE"3IRTY5^*[Z
MS.Z.W&Y2Y(L;"D7B)2*T$M/0P82+[S2.:51Q,C *,$HF?'.A'-,D;+M)LF5)
M"M01%8Z@23PE*MM+L[?6=T'N(VYZIQ<?NTE?\D(K5&KE")*Z0'^82N?HZNPT
MNVUM OJ>11>^=\3O=FS+/9E&S!-6^$^GQWS<GS79E+4.UXU_DM*7FO*E"%8)
M(*V=?_?0"F^\U"W!^FN NE(43$"EC#1,[> .1;..%KP>!(;)(ZPIB$/9@ L0
MJ K]-*GE<(\ QAP.KQ*%0*R.**:O8,(9X&!1:2_P&"R$10'1&0P\V'9;[L!Q
M2Q,O56$MTE]_E0+!K\/NYY1CGPA[M&#;W4)N'WL;KM_W1/VW,R>,?KABC_X#
MYYW\O3/@W#-B_ST8#%I,&?!AT<"VE;Y% =MJ:\Q4[O*/B__'T4:'KL+'?OI%
MW")]"NXMS_G3$K[JPNN]B9M_ &,!EL';4-!MTZ3_@O<39JQPDS)1.3<,MX8;
M4U#QS22R?L9RY3[BT]5AO\^!9G5F3R]1IKK"_RC:XI4BP8!_9!X++/?"&K$B
M\);^8O" X1LO>-*F5JWJ#TW5P&0WH[2N/:K( ,\61>GS)%4YX"Y^%&EE,\_B
M^ AD-%/1*9S6I;V,@]%ZMN7QK0@-D$!P2'@O#)29K7K3E2JWX%!1)SI-G !%
MF !\_Z!*2-)PNZV$G6 J8R!*Q2'0J<,3E^%E^#19A2<L8EQ8"+<00IA3,]+*
M7CN^K>":^()&$I+]\LML?S3F8VJ(=_GQ=$?Q5?&)\>GFXEA*P[N+P(YGC44$
M<,'SPT>OX7@#O^"2.*:X(6*C2ZX!3#,#N47SS#L(^4M[^6IAZ(ZG&@=3AWS-
M7YP,L8BY]R=>/\ZSB++/SV0L/<<33^=0)"=,HZ4EY][S S&^$1OYP>S<FCJC
MR:CG_,DX@4<1_R8?8^. C:V -=C4=B?]=0']L^U[7)G^(EWX$IMR15L\)YF]
MY0FV*'E\O+$P,8U^DOJ^^)XSRV'A4V.Z22(\(=23LU^6F4"1M")0NU1P?YI^
M$EI<&F+\W[$CGSM3%ERF!O?*0SRY!$.BCZHT$C!<!\"<X"2YIO"8&53H&/@8
MP[3=0A2N1\5CD:2N41SD94YX&FD+%:!/LI]H:OK EXC&[TR37XG2?BF2-/0F
M3:5+$AJ IZ]OWY^/:(A"$MJ$<2'2U$ZDB6B@X0,T$?1$8UWG+J^DR%%I7_]S
M]A9T+SY+J.8E2I!3:5[_=M^,WO5"1>K?[HH:%066%UIQ>J\\M>0_G#Y4<P+'
MGNBH_AXD.@XF()0F%I"F"X66@8+<9^QD(8FL'5Q=$00.- SL9TGN.U[!X0GL
MRT>ZA(BW5PA"L+_TLH.4_<44$:,VIN#XK=AZYY;C??"#X\!Y9/F%#39+7I$-
M>*I)E<45:31Q!,_3:"*5:>(823H]JO B#"@)G*)C&$)?>F&EHSRHF+P5>,-/
M3)7"9HN&MF@BCFC&2M+O$Y%M9V X#"+Z&#%:#5$8'8,$A*4?0PCPUG&H.#EX
M(#ZNI!Z)<1)N[J(IY(XRSU)P [AM$F-+I[%Z$T&E.&MUN&L&Y:,@"="C"4'=
M6H0%V# 'M*&A+7@3+WYG1>6&O)VUS]U<''TZOSR\SK#2[:XM:]<(#$<WUR=_
M7.^CZ3<-Y\@;E)22P7@F)CN>Q<$TU9MR!?UDVW)?MA/B50$'"37)3-7Y\UL>
MRNO:JBNT+XOI+1F8D_>]2 S[B%]CV1$+3OFO%?D4,3HM>'TG5) .O'8[32$B
M#5/8!5Y?64?@P(17C5,1]G:SK'0WD1T+,?,F(M*6)/4!C$Y5[L =#9A88[AZ
MA7'1(]Q"\ AF%2,)8S: CJC1B:IO11/]16)ZA*, T_F=IB ^?*R8-'IX>VX$
MS<I->*P&ID5,!]&4$V77WEI962*9_8_&Q<E>"NU(*3B9I[A<2GV6B80+OM4:
M.W IND,F14\;'GL2HP_XJ$A%Z2*,P/+QMH<;,;Y%]?/M8@F*G-9KXF9'=#")
MW,;2X+NDO YW^38OU0&G',<K04;B/5\'F2^>8[EI006YUSOKL;C%P'O'ZW-8
M)X]<@(<JA0@YLTW0BE&33;BJB9$O$!5$40[3K40+T!3GP41)D(1=J? *3:@N
MG!1J)J(- JJW)WRY4-(UB29 T\:+J#D8B7\47IH9A0$25R9!(6V4AQB5TT_B
M)*>I4J^1-"J@:"6!J'J."I8E,8G0;%@BJ"1- E\K]N*53 P!LG,-0,'!B,R+
MDJ%?PY#)U\%$A*=ZUCT+/EAVY">%U2J7D@VY29*&5=;<:NM1JHA&*Z@P)XKT
M:YJT1CBS12$@VZI=L'E>7M,HWD7Y^P>S<1"LJD/2UIC&XPA/X$05$*]>NM1D
MW:0)'R>)O2JK@+CUWE<JHD@M9I?3)+"3!,JJ--'=\'PQE+V&A-7#ZV##RQC*
M'9(\O#9!R45<(Q&$^P[#JQ F1@T>(H#J*P:F LPA $8L6.)1-=DDR/;1,496
M>.UZDRN8- 7N2/8!285,1. %26S[RPHGOK9^64'EN-CMU1CX08.-QM&LZ%(N
M=-@L#$LOA%XWF+AN(V#"+;=Z5;(NR3=\=42".1_@2(KX"HB(&U,U1OD.9R$J
MQ?[I!(!PO3G>B_U_3TFUMPG<@V$T<@\<K\^FLGA9X,H?\LLS)[KRYIYYY1<E
MRS6/LIVX1=>^OSD].Y8^')Z>G1RO?%$)+N3IR.VJS4XW1OC =UW_F]"J8A*6
M?-N>! %7Q;X-.2U+;,KL2>R-C(9\/5S'>T:4+W;/6@\LN3)&3C(XHQ4/+F#2
M-_$G)HIDA\GY6+OV(\N=DYHAC1QOPF^48LN?[_57Z>[O_*]TE2R$I*9?K48X
MJWH3$^2<K&IX,)]9XRG*5_K\IS/FRRJN$Y#Y.T V?B; 6TU16ER8Z]RJ':TC
M<TA__:M8QG2=?"\E&^F;$PWYFJTL\-1F8W%-]Z^;KGS!H*V^-8[\X-EXYQ_'
MZ]I65I;UZ.RPUSL[?2_=<*81\W)ISG3EO_Y\8/WZ\\$X8/SOG=^?\7_$9OWU
M_P-02P$"% ,*    " !PH/,VZ=Y$T9!!  " K@, $@              I($ 
K    97AE8W5T:6]N7VQO9RYH=&UL4$L%!@     !  $ 0    ,!!      $! 
end

Mime
View raw message