harmony-alerts mailing list archives

Site index · List index
Message view « Date » · « Thread »
Top « Date » · « Thread »
From nom...@intel.com
Subject [build-test alert] BUILD FAILED Windows 2003 x86: egax48
Date Thu, 19 Jul 2007 12:05:22 GMT
BUILD FAILED:
	Ant Error Message:
C:\cc\cc-EGAx48\scripts\cc-exec-adaptor.xml:101: The following error occurred while executing
this line: C:\cc\cc-EGAx48\adaptors\ega\adaptor.xml:58: EGA scenario failed.

Date of build:	07/19/2007 18:41:28
Time to build:	23 minutes 47 seconds
Last changed:	07/19/2007 18:40:58
Last log entry:	snapshot

***********************************************************
Errors/Warnings:	(214)
            
[exec] Result: 1
[echo]
[echo]
[echo] ========================== EGA.log =======================
[echo]
[echo] --- Automated Eclipse EGA scenario for Eclipse 3.2.1 ---
[echo]
[echo] Eclipse Home = C:\cc\cc-EGAx48/build/libs/eclipse-3.2.1-win-x86/eclipse
[echo] Tested JRE Home = C:\cc\cc-EGAx48/build/checkouts/snapshot/hdk/jdk
[echo] Tested JRE options for Eclipse launching = -showversion -Xmx600M -Xms512M
[echo] Time frame for the scenario run = 48 hours
[echo] Delay factor = 2
[echo] Kill Eclipse if EGA scenario fails = 1
[echo]
[echo] Start:
[echo] 	Run Eclipse
[echo] 	wait Eclipse 'Workspace Launcher' window to appear
[echo] 	window appeared
[echo] 	Select C:\cc\cc-EGAx48\tests\ega\workspace as workspace
[echo] 	Press OK button
[echo] 	Closing window 'Workspace Launcher'
[echo] 	wait 'Java - Eclipse SDK' window to appear
[echo] 	window appeared
[echo]
[echo] Prepare Eclipse environment:
[echo] 	Close Welcome page
[echo] 	Uncheck Project->Build Automatically
[echo] 	Select Window->Preferences
[echo] 	wait 'Preferences' window to appear
[echo] 	window appeared
[echo] 	Select Java->Build Path->Classpath Variables
[echo] 	Create M2_REPO variable
[echo] 	wait 'New Variable Entry' window to appear
[echo] 	window appeared
[echo] 	Set M2_REPO value to C:\cc\cc-EGAx48\tests\ega\project\.m2\repository
[echo] 	Press OK button
[echo] 	Closing window 'New Variable Entry'
[echo] 	Press OK button to apply new preferences
[echo] 	Closing window 'Preferences'
[echo]
[echo] Import Geronimo modules into workspace:
[echo] 	Select File->Import...
[echo] 	wait 'Import' window to appear
[echo] 	window appeared
[echo] 	Select import existing project
[echo] 	Type path to search projects: C:\cc\cc-EGAx48\tests\ega\project\geronimo-1.2-beta\modules
[echo] 	Uncheck all builders
[echo] 	Import
[echo] 	Closing window 'Import'
[echo]
[echo] Import testsupport module into workspace:
[echo] 	Select File->Import...
[echo] 	wait 'Import' window to appear
[echo] 	window appeared
[echo] 	Select import existing project
[echo] 	Type path to search projects: C:\cc\cc-EGAx48\tests\ega\project\geronimo-1.2-beta\testsupport
[echo] 	Import
[echo] 	Closing window 'Import'
[echo] 	Check import result
[echo]
[echo] Start repeatable part:
[echo]
[echo] -------------------- Iteration 1 start ------------------
[echo]
[echo] Clean all Geronimo modules:
[echo] 	Select Project->Clean...
[echo] 	wait 'Clean' window to appear
[echo] 	window appeared
[echo] 	Uncheck start build immediately
[echo] 	Clean
[echo] 	Window 'Cleaning selected projects' appeared
[echo] 	Closing window 'Cleaning selected projects'
[echo] 	Check clean result
[echo]
[echo] Build all Geronimo modules:
[echo] 	Select Project->Build All
[echo] 	wait 'Building Workspace' window to appear
[echo] 	window appeared
[echo] 	Closing window 'Building Workspace'
[echo] 	Check build result
[echo]
[echo] Open Navigator view:
[echo]
[echo] Fix org.apache.geronimo.common.propertyeditor.PropertyEditorsTest:
[echo] 	Select 'Navigate->Open Resource'
[echo] 	wait 'Open Resource' window to appear
[echo] 	window appeared
[echo] 	Type PropertyEditorsTest.java into 'Open Resource' dialog
[echo] 	Closing window 'Open Resource'
[echo] 	wait 'Java - PropertyEditorsTest.java - Eclipse SDK' window to appear
[echo] 	window appeared
[echo] 	Go to line 'protected void setUp() throws Exception {'
[echo] 	wait for window 'Go to Line' to appear,
[echo] 	window appeared
[echo] 	Closing window 'Go to Line'
[echo] 	Add line Class.forName("org.apache.geronimo.common.propertyeditor.PropertyEditors");
to setUp() method
[echo] 	Save PropertyEditorsTest.java
[echo] 	Close PropertyEditorsTest.java
[echo] 	Closing window 'Java - PropertyEditorsTest.java - Eclipse SDK'
[echo]
[echo] Run JUnit tests from geronimo-common module:
[echo] 	Select geronimo-common module
[echo] 	Select Run->Run...
[echo] 	wait 'Run' window to appear
[echo] 	window appeared
[echo] 	Create new JUnit run configuration
[echo] 	Run
[echo] 	Closing window 'Run'
[echo] 	Check run result
[echo]
[echo] Modify GBeanData class from geronimo-kernel module:
[echo] 	Select geronimo-kernel module
[echo] 	Select Navigate->Go Into
[echo] 	Open GBeanData.java
[echo] 	wait 'Java - GBeanData.java - Eclipse SDK' window to appear
[echo] 	window appeared
[echo] 	Select Edit->Find/Replace...
[echo] 	wait 'Find/Replace' window to appear
[echo] 	window appeared
[echo] 	Find getAbstractName() method
[echo] 	Closing window 'Find/Replace'
[echo] 	Add System.out.println("Method getAbstractName() was called!");
[echo] 	Save GBeanData.java
[echo]
[echo] Create JUnit test:
[echo] 	Open geronimo-kernel/src/test/java/org/apache/geronimo/gbean folder
[echo] 	Select File->New->JUnit Test Case
[echo] 	wait 'New JUnit Test Case' window to appear
[echo] 	Enter SimpleGBeanDataTest as test name
[echo] 	Enter org.apache.geronimo.gbean.GBeanData as class under test
[echo] 	Press Next button
[echo] 	Enter getAbstractName() as method under test
[echo] 	Press Finish button
[echo] 	Closing window 'New JUnit Test Case'
[echo] 	Find string fail("Not yet implemented");,
[echo] 	Delete string fail("Not yet implemented");,
[echo] 	Add string System.out.println(new GBeanData().getAbstractName());,
[echo] 	Save SimpleGBeanDataTest.java
[echo] 	Close SimpleGBeanDataTest.java
[echo] 	Closing window 'Java - SimpleGBeanDataTest.java - Eclipse SDK'
[echo]
[echo] Build geronimo-kernel module:
[echo] 	Select Project->Build Project
[echo] 	Check build result
[echo]
[echo] Run SimpleGBeanDataTest:
[echo] 	Select Run->Run As->JUnit Test
[echo] 	Check GBeanTest run result
[echo]
[echo] Set breakpoint in GBeanData.java:
[echo] 	Go to line System.out.println("Method getAbstractName() was called!");
[echo] 	wait for window 'Go to Line' to appear,
[echo] 	window appeared
[echo] 	Closing window 'Go to Line'
[echo] 	Set breakpoint at line 75 System.out.println("Method getAbstractName() was called!");
[echo]
[echo] Debug:
[echo] 	Select Run->Debug...
[echo] 	wait 'Debug' window to appear
[echo] 	window appeared
[echo] 	Select GBeanTest run configuration
[echo] 	Press Debug button
[echo] 	wait 'Confirm Perspective Switch' window to appear
[echo] 	WARNING! Window 'Confirm Perspective Switch' didn't appear during 60c. Add extra delay
for 120c.
[echo] 	ERROR! Window 'Confirm Perspective Switch' didn't appear during additional 120c. STOP.
[echo]
[echo] An ERROR has ocurred!
[echo]
[echo] Print error screen:
[echo] 	Open mspaint to save errror screen
[echo] 	Wait for 'error - Paint' window
[echo] 	Save error screen
[echo] 	Exit mspaint
[echo] 	Switch to Eclipse
[echo]
[echo] Exit Eclipse:
[echo] 	Menu "Java - GBeanData.java - Eclipse SDK->File->Exit" wasn't found
[echo] 	Can't exit Eclipse! Trying to kill ...
[echo] 	Eclipse window was found and killed
[echo] 	Eclipse was found and closed.
[echo]
[echo] EGA FAILED!
[echo]
[echo] ======================= eclipse.log =======================
[echo] Apache Harmony Launcher : (c) Copyright 1991, 2006 The Apache Software Foundation or
its licensors, as applicable.
[echo] java version "1.5.0"
[echo] pre-alpha : not complete or compatible
[echo] svn = r557495, (Jul 19 2007), Windows/ia32/msvc 1310, release build
[echo] http://harmony.apache.org
[echo]
[echo] Install location:
[echo]     file:/C:/cc/cc-EGAx48/build/libs/eclipse-3.2.1-win-x86/eclipse/
[echo] Configuration file:
[echo]     file:/C:/cc/cc-EGAx48/build/libs/eclipse-3.2.1-win-x86/eclipse/configuration/config.ini
loaded
[echo] Configuration location:
[echo]     file:/C:/cc/cc-EGAx48/build/libs/eclipse-3.2.1-win-x86/eclipse/configuration/
[echo] Framework located:
[echo]     file:/C:/cc/cc-EGAx48/build/libs/eclipse-3.2.1-win-x86/eclipse/plugins/org.eclipse.osgi_3.2.1.R32x_v20060919.jar
[echo] Framework classpath:
[echo]     file:/C:/cc/cc-EGAx48/build/libs/eclipse-3.2.1-win-x86/eclipse/plugins/org.eclipse.osgi_3.2.1.R32x_v20060919.jar
[echo] Debug options:
[echo]     file:/C:/cc/cc-EGAx48/tests/ega/.options not found
[echo] The GC did not provide gc_add_weak_root_set_entry()
[echo]
[echo] Time to load bundles: 219
[echo] Starting application: 10187
[echo] Application Started: 25186
[echo]
[echo] ===========================================================
BUILD FAILED
C:\cc\cc-EGAx48\tests\ega\build.xml:464: EGA FAILED!
Total time: 23 minutes 45 seconds
The execution FAILED with the following exception:
The following error occurred while executing this line:
C:\cc\cc-EGAx48\adaptors\ega\adaptor.xml:58: EGA scenario failed.

***********************************************************
Unit Tests: (0)
        
No Tests Run: This project doesn't have any tests

***********************************************************
Modifications since last successful build:	(1)
            
add cc-snapshot log20070719184058Lbuild.5 07/19/2007 18:40:58snapshot

begin 644 execution_log.zip
M4$L#! H    ( *F8\S:$(5/PB L   H]   2    97AE8W5T:6]N7VQO9RYH
M=&UL[5M[;]LX$O^[!?8[L $.3H%8LMVD;;QM@&R2=M-'&B3M]8!F$3 2;:N1
M1$&D_-C]\C<SE!S+L2G9J;NWP!F[A1UQAL.9W[PH\M5 1^'!JQOI3PY>):DX
M>,69TI-0O&[T9*R;*OA3=-G+UK]^;1S\\CC-XNXOCQE^OGWG0_X'^RT+0K\7
MA##H!K\ZXR@LCRC_NL_!?!?>0/[!FOAA%UG,3MX>,N6)F*>!9#)F>B!83X:A
M' 5QGWDR[@7]+.4Z@&=$M9SI9Z&T\-F[BQ/VFAUUKSP/_FO"!./=ERX)[7H#
MX=W*3"M7Q3Q1 ZG=@7_K?O=OE[,]\<(@48+]+B.QE'$8W"A7F)'-9T[':3=A
M <WQR^?%7VW*FIWNLE!&H$6^[CB+;D0*<[=JD('BF0Y(U-V7R\<?BY!/6(][
M6B+GSO*1[X,PG"HAZ-U9J\>#4 %MN^[29@PD$UR9 E.G4]XASV)O@&9_S9I@
MF]%0I(KL_I]H_+S5^HA?U%Z[\W'U*0!EOKC)^H!YD0#_"FBN^;$I@J#G\$S+
M0'>K!^+W&L-R<-4?Z>1*K4$QC)Q<A_;!,DH@+C@:5.]X(5?SPW/MCH7W!SM,
M.#!GO_,TDO&$?2"3 [:[;-M[RHYD,DF#_D"S]OY^>X=U6JWG[#.,S\DN94^/
M>"K8&YG%OG$.L&Z@%0L#@*62J=IA7#&>)/ '?@-B+9<%_\(*C&VUG3VGM;48
M&#0<@F:3A\F @["QU+3N4&B!$N!W$ ?F6TZOAC$ +]W;>[&[O[?#MM]E(2P3
MU_CBZ0[[&L2^'"DWX,\Z;J2&'FL_:[=V6"I"P<$Y*,PL9S[0.NFZ[L#HU>&D
M+T>F_5IF)M?XH<8F5SH"T6/TY\+#R^'<<>X;YYLO4*<4GX1&6C](!0:IR7SD
MO2*57&'DO5H8>8N_7I6FO0*E3)U!JG[P=\O@R50X$+4Q:/_=LF0)>-7?(H6C
MA$;.JGKR[H^:T_QR@CBP0=[H9,9<1 2<%R#_6Q;_&210,XP3'OL667GJ#::R
M7AZ_OY/W6<<!%BR(M5QYG:LO(XS'%@>^$)$<SCKP2*:W"F*+>+#S8@"!5?3Y
MU92G)9"D@A._5*@LA&A_QW>1'.Q;= LC<CHH!^#',D/D'$D2#,6M%^W]Z];S
MW?9R:2XU3W6I<%T^]IRB]PY30BRI'',!7!# +0G@PC GE'TJ8'RAL=I:G@ N
MB$UWOAB;E>7DXN+3Q9,\T[#&$2(@C=@Y9, $M!D,(<&. NT-&J P/VYH3*."
MP^19BLKGOA^@WW#(6YV6Y[#+SY_.'1OF$J#3#M:)3B24XOWY0F56O.5/+(]>
M+_VP0GW+GJ\C"78MAU#"102KPBM*/<QL14O.243K3+:1QF-V@IEBV3K'.EW3
MSZCUL<OII1S_!=;8.:K9+@@;(#:06:HL2EZ_#RI;?7$O5,_0%% LGO&(&N4J
M:SX:\4!/!6Q\G8;JHLANL)%Q?<@LN6?;N)FQ9B!8TC+T$L*]I^N$>*S-:\3[
M1^<0%17[]![*7JUE;!EY%$J%,,K%7;3L*I4UWF$CT)RJ#M+QIE1E212I2+"S
M*800\3!(91R)V(H,7+Y@7T7HH0,G$&%M@GZ)R95A,OD=+-8\H%V=(J)!PQ2&
MDVH[FP32/ "1>R(5L2<6YZ59%<^,W30,T9K%RLZY'C0/CK!/@?YLP/X-SHI=
MH4U@4S2PCYWKBY/S3VR8DU0N\4R,IOS92:S3R097JF?D"S/!%A2+=^Z7&'-?
M.5$'ZIT$' 9+IXVXWP(EU)\GUU,X83&P26K!:UZ 6:"MXX>G42*ANGLKP/F"
M2+)(^AG@Q=3CT]#5K8'#-] G-P\,OX55ZAQ^S,A->T=@UB?&@:**.L>&A?#S
M),'( MX#(BF!G4M!I>Y7U?=1U\]5V6P[G>8-U+%7N4YK!"H(2&;G ZH#RW"C
MNA50DNOZ 0"A=68)?3?K^3]$?B!$9M3[4^W^Z(APEZO ]&9KEW1 #TK7% L3
M+/'6[3GN?=CI].5 FRF:JVHWNMYDM&5';C<? >O@>5I7$)LZB*:!&P-T$4:,
MABB0@&DCX0>0X:VE#LEE>3YMHHLM3D4: '$*W#=J23@/4 N_2M!Z9#N#V;60
M9FJF!QL_+RK#L-+Z-!)7.ZW:-P:%>44OF+I2P09 ZP>%3XF(V1D?!GV.W>8P
M$*/U0L*;8,QPVS;?YB_"IP--0"1C!R"3B%1/ .<PCW.>_SRAGPH[\SKV;.22
M0H8BP2^$@E[:KB=CUO+P35F4DLZ"M=&K,Y.,YR4!OP]E?P64K+CPO)%<*M1/
MZ3$?O97(,@QBP1H !6WBR% &/D05_279?LKT()4CQ4[&GJ#-&?97Y>)PBZ50
MBYGA \S0N)-^9P7Q5S#!S%P6JD/?-RNF7L\!8<]X)+:WUO:2K:>_FF+&*"P2
M>B!M8E_RH06-E1W\NI2SFEH-?>O$'=R'>O<E#O+RE_52&;%I\6;TFJ>,.A%F
M,64U'8C1/(!_ZA08,&QS.<7L%&"S:K2"NX[E=YSV3;T5C(OKJ$Q0./_ZZ>FC
M](/>A+W]#<J(8RA;&;W?G3/RK4AC$:YCY!)E-=U=]H$(< K1W$)"87HJ-Z&]
M;JPN4_VD")TO$3VT>? &Z-P+D810@]1!].SXC4F(DX#I].&-TBGW-$73(@RN
M$I1*TE8$\,N)TB)R9*8=>G,4QMM;'\V,]T49<<5PPU+X3S!65X7F.3NOU1L9
M=[\+@%;X$R;GP.^JU'.1TD4"%Y*3:Y*36PQT^S=8Q/<D;GG4W4 X$Z/F@1$+
MHST[XM7O"6BG;HYF-32=Q-"#LLL 3\%,M4N\P#*X2!;CJYE*#HM2-&G!N8M$
M:&L*1ED,>C'<*_<5S\18%SN+E5+<!QC,F<-]E4D![X$:U)AVT<[IO#VJ'!3D
M11;X\FE[ZTQJ-A&T?1,*?&\@?' ,:U5&[^G%@]F@[^8\%K@PIL>I);>?.O<T
M7<&=W'<!S&I65NM2+JBLEK)Z>&5E>N;UL^Q<\YW_M*[QA[2T6!$N4$L=D8LJ
MCAVJV>A5*3)-1#[RL'('7Z+<0$B_320 %1K&N1QA7<-,C_6 K/7/[KGF%,BU
MT<>+O<VH9/F38SR^6!MR-+I.H44#-UT#EM%<NWDPR88DK'Y)EV^U6L[[K++&
MKX<79Z=G;Q]PD.@Y'A["I $).N7,-T<P .MTK,B6JG_"":9ZD#N,S7$J-@#T
M2B]+P=I/UF%TCO[!1)K"\I67"F&[-F&*RD@E'(EP>P)S(Q#?4=L,5X24AIFN
MR<Z13V']JA0LZLUR,H99<A%M+,E.N(;*@RW+G]!<.;W5_S^*.&-;-5H^;,>P
MI$;.6QB:$$0]/&UN"Y\<1XD989ZPS^D$$0?KN\5S0_9X,SU>:8"-$9'F9!S^
M1WIK])Y2E\@\K'[\M<"-)YO>')Y^.#FV0'J-4WFL.'RZWK&\_Y&[ R0+(:?6
MW0$:_H"[ T2_J;L#Q+SFW8%ZV#F-E<8W2*'T2,>6:(8?NE'F'G5=SW-7/]KH
M6IKU4B:E:38J22ESNW<GRT$1W+>Y;UG0GZ.VLK"6]TQXN!)/-!BYA+]9L9(P
MZP>Q<N=O:%S3<.?B66=\/42_;NVW]R%X6S9([B3WBL-?_QC9356W^#9./:EI
M=YY.E!>7>BCJ5.0Q#)9OC[!RHM%)*H>!+UC?NX:ZZ7H$A?YU*J6^5D)?"SS:
MM?UTG0A!QW:Q>0+'@- 4^_1^N=/>M[1J^/Z>"C@3F\E#6+O5?OG"EBZF8PT#
M@"_K[+7GKTF45+IR3JOS*3,M__KMR^F'XSS;EI\L/S8SO8#;W7V^VUV>KLN_
M/DL(S'0U%-3PC$5!G %+MKO'E(" X,\=L*)B:>96P6.$!]XUR$BC9D*H6/#0
M3^G.KBA>*G:)9.8!%9#2,]4R&PT NP5'+)4&@:(.$B _OW;N\P1?9M'R\Q^D
M@+V7W?L'L:'L>?S+XU<N/WCETE5GUUQ[=ND.]'\!4$L! A0#"@    @ J9CS
M-H0A4_"("P  "CT  !(              *2!     &5X96-U=&EO;E]L;V<N
::'1M;%!+!08      0 ! $    "X"P     ! 
end

Mime
View raw message