harmony-alerts mailing list archives

Site index · List index
Message view « Date » · « Thread »
Top « Date » · « Thread »
From nom...@intel.com
Subject [build-test alert] BUILD FAILED LINUX SUSE 9 x86: jdktools_test
Date Wed, 18 Jul 2007 05:49:07 GMT
BUILD FAILED:
	Ant Error Message:
/export/cruise_hdk/cc/projects/trunk/working_jdktools/build.xml:242: The following error occurred
while executing this line: /export/cruise_hdk/cc/projects/trunk/working_jdktools/make/build-test.xml:97:
There were test errors.

Date of build:	07/18/2007 12:23:54
Time to build:	24 minutes 41 seconds
Last changed:	07/18/2007 11:06:27
Last log entry:	add the BeanInfo wrapper class

***********************************************************
Execution log (errors/warnings messages):	
Result: 1

========================================
Testing jdktools binaries...
========================================
Compiling JPDA tests
Since fork is false, ignoring memoryMaximumSize setting
----------
1. WARNING in /export/cruise_hdk/cc/projects/trunk/working_jdktools/modules/jpda/test/common/unit/org/apache/harmony/jpda/tests/framework/DebuggeeRegister.java
 (at line 57)
	registered.add(debuggee); 
	^^^^^^^^^^^^^^^^^^^^^^^^
Type safety: The method add(Object) belongs to the raw type LinkedList. References to generic
type LinkedList<E> should be parameterized
----------
----------
2. WARNING in /export/cruise_hdk/cc/projects/trunk/working_jdktools/modules/jpda/test/common/unit/org/apache/harmony/jpda/tests/framework/TestOptions.java
 (at line 28)
	import java.io.File;
	       ^^^^^^^^^^^^
The import java.io.File is never used
----------
----------
3. WARNING in /export/cruise_hdk/cc/projects/trunk/working_jdktools/modules/jpda/test/common/unit/org/apache/harmony/jpda/tests/framework/jdwp/PacketDispatcher.java
 (at line 113)
	eventQueue.add(eventPacket);
	^^^^^^^^^^^^^^^^^^^^^^^^^^^
Type safety: The method add(Object) belongs to the raw type List. References to generic type
List<E> should be parameterized
----------
4. WARNING in /export/cruise_hdk/cc/projects/trunk/working_jdktools/modules/jpda/test/common/unit/org/apache/harmony/jpda/tests/framework/jdwp/PacketDispatcher.java
 (at line 248)
	replies.put(new Integer(replyPacket.getId()),
                                replyPacket);
	^^^^^^^^^^^^^^^^^^^^^^^^^^^^^^^^^^^^^^^^^^^^^^^^^^^^^^^^^^^^^^^^^^^^^^^^^^^^^^^^^^^^^^^^^^
Type safety: The method put(Object, Object) belongs to the raw type Hashtable. References
to generic type Hashtable<K,V> should be parameterized
----------
5. WARNING in /export/cruise_hdk/cc/projects/trunk/working_jdktools/modules/jpda/test/common/unit/org/apache/harmony/jpda/tests/framework/jdwp/PacketDispatcher.java
 (at line 283)
	commands.put(Id, command);
	^^^^^^^^^^^^^^^^^^^^^^^^^
Type safety: The method put(Object, Object) belongs to the raw type Hashtable. References
to generic type Hashtable<K,V> should be parameterized
----------
6. WARNING in /export/cruise_hdk/cc/projects/trunk/working_jdktools/modules/jpda/test/common/unit/org/apache/harmony/jpda/tests/framework/jdwp/PacketDispatcher.java
 (at line 354)
	commands.put(Id, command);
	^^^^^^^^^^^^^^^^^^^^^^^^^
Type safety: The method put(Object, Object) belongs to the raw type Hashtable. References
to generic type Hashtable<K,V> should be parameterized
----------
----------
7. WARNING in /export/cruise_hdk/cc/projects/trunk/working_jdktools/modules/jpda/test/common/unit/org/apache/harmony/jpda/tests/framework/jdwp/VmMirror.java
 (at line 1829)
	frames.add(frame);
	^^^^^^^^^^^^^^^^^
Type safety: The method add(Object) belongs to the raw type ArrayList. References to generic
type ArrayList<E> should be parameterized
----------
8. WARNING in /export/cruise_hdk/cc/projects/trunk/working_jdktools/modules/jpda/test/common/unit/org/apache/harmony/jpda/tests/framework/jdwp/VmMirror.java
 (at line 1897)
	vars.add(var);
	^^^^^^^^^^^^^
Type safety: The method add(Object) belongs to the raw type ArrayList. References to generic
type ArrayList<E> should be parameterized
----------
9. WARNING in /export/cruise_hdk/cc/projects/trunk/working_jdktools/modules/jpda/test/common/unit/org/apache/harmony/jpda/tests/framework/jdwp/VmMirror.java
 (at line 2117)
	fields.add(superClassFields.toArray()[i]);
	^^^^^^^^^^^^^^^^^^^^^^^^^^^^^^^^^^^^^^^^^
Type safety: The method add(Object) belongs to the raw type ArrayList. References to generic
type ArrayList<E> should be parameterized
----------
10. WARNING in /export/cruise_hdk/cc/projects/trunk/working_jdktools/modules/jpda/test/common/unit/org/apache/harmony/jpda/tests/framework/jdwp/VmMirror.java
 (at line 2127)
	fields.add(field);
	^^^^^^^^^^^^^^^^^
Type safety: The method add(Object) belongs to the raw type ArrayList. References to generic
type ArrayList<E> should be parameterized
----------
----------
11. WARNING in /export/cruise_hdk/cc/projects/trunk/working_jdktools/modules/jpda/test/common/unit/org/apache/harmony/jpda/tests/jdwp/Events/ExceptionTest.java
 (at line 187)
	long frameID = reply.getNextValueAsFrameID();
	     ^^^^^^^
The local variable frameID is never read
----------
----------
12. WARNING in /export/cruise_hdk/cc/projects/trunk/working_jdktools/modules/jpda/test/common/unit/org/apache/harmony/jpda/tests/jdwp/ThreadReference/FramesTest.java
 (at line 449)
	frames.add(new FrameStruct(frameID, loc));
	^^^^^^^^^^^^^^^^^^^^^^^^^^^^^^^^^^^^^^^^^
Type safety: The method add(Object) belongs to the raw type Vector. References to generic
type Vector<E> should be parameterized
----------
12 problems (12 warnings)
JPDA exclude list: /export/cruise_hdk/cc/projects/trunk/working_classlib/deploy/build/jdktools.jpda.exclude
Running JPDA tests
  Debugger JVM=/export/cruise_hdk/cc/projects/trunk/target/hdk/jdk/jre/bin/java
  Debuggee JVM=/export/cruise_hdk/cc/projects/trunk/target/hdk/jdk/jre/bin/java
The GC did not provide gc_add_weak_root_set_entry()
SAMSA exclude list: /export/cruise_hdk/cc/projects/trunk/working_classlib/deploy/build/jdktools.samsa.exclude
Running SAMSA tests
test.jre.home=/export/cruise_hdk/cc/projects/trunk/target/hdk/jdk/jre
Run jdk/bin/java -version in /export/cruise_hdk/cc/projects/trunk/working_jdktools/build/test_report
java version "1.5.0" 
pre-alpha : not complete or compatible
svn = r557132, (Jul 18 2007), Linux/ia32/gcc 3.3.3, release build
http://harmony.apache.org
Run jdk/bin/javac -version in /export/cruise_hdk/cc/projects/trunk/working_jdktools/build/test_report
Run jdk/bin/javah in /export/cruise_hdk/cc/projects/trunk/working_jdktools/build/test_report
Run jdk/bin/jarsigner in /export/cruise_hdk/cc/projects/trunk/working_jdktools/build/test_report
Run jdk/bin/keytool -help in /export/cruise_hdk/cc/projects/trunk/working_jdktools/build/test_report
Compiling TOOLS tests
Since fork is false, ignoring memoryMaximumSize setting
----------
1. WARNING in /export/cruise_hdk/cc/projects/trunk/working_jdktools/modules/tools/src/test/java/org/apache/harmony/tests/tools/javah/Test/Test01.java
 (at line 23)
	private static final long xxx2 = 1;
	                          ^^^^
The field Test01.xxx2 is never read locally
----------
1 problem (1 warning)
TOOLS exclude list: /export/cruise_hdk/cc/projects/trunk/working_classlib/deploy/build/jdktools.tools.exclude
Running TOOLS tests
test.jre.home=/export/cruise_hdk/cc/projects/trunk/target/hdk/jdk/jre
The GC did not provide gc_add_weak_root_set_entry()
The test report is in /export/cruise_hdk/cc/projects/trunk/working_jdktools/build/test_report/html/index.html

***********************************************************
Unit Tests: (135)
        
error: testStatus002 org.apache.harmony.jpda.tests.jdwp.ThreadReference.StatusTest
Unit Test Error Details:	(1)
                
Test: testStatus002Class: org.apache.harmony.jpda.tests.jdwp.ThreadReference.StatusTestorg.apache.harmony.jpda.tests.framework.TestErrorException:
Debuggee process did not finish during timeout
	at org.apache.harmony.jpda.tests.jdwp.share.JDWPUnitDebuggeeWrapper.WaitForProcessExit(JDWPUnitDebuggeeWrapper.java:212)
	at org.apache.harmony.jpda.tests.jdwp.share.JDWPUnitDebuggeeWrapper.stop(JDWPUnitDebuggeeWrapper.java:131)
	at org.apache.harmony.jpda.tests.jdwp.share.JDWPTestCase.internalTearDown(JDWPTestCase.java:84)
	at org.apache.harmony.jpda.tests.jdwp.share.JDWPSyncTestCase.internalTearDown(JDWPSyncTestCase.java:75)
	at org.apache.harmony.jpda.tests.jdwp.share.JDWPRawTestCase.tearDown(JDWPRawTestCase.java:110)
Caused by: java.lang.IllegalThreadStateException: process has not exited
	at java.lang.Runtime$SubProcess.exitValue(Runtime.java:357)
	at org.apache.harmony.jpda.tests.jdwp.share.JDWPUnitDebuggeeWrapper.WaitForProcessExit(JDWPUnitDebuggeeWrapper.java:207)
	at org.apache.harmony.jpda.tests.jdwp.share.JDWPUnitDebuggeeWrapper.stop(JDWPUnitDebuggeeWrapper.java:131)
	... 13 more


***********************************************************
Modifications since last successful build:	(14)
            
added tonywu  /harmony/enhanced/classlib/trunk/modules/beans/src/main/java/java/beans/StandardBeanInfo.java
07/18/2007 11:06:27 add the BeanInfo wrapper class
modified pyang  /harmony/enhanced/classlib/trunk/modules/beans/src/main/java/org/apache/harmony/beans/editors/FontEditor.java
07/18/2007 11:03:44 Add test to FontEditor and ColorEditor against RI's behavior, fix bugs;
Also fix some trivial bugs in PropertyEditorManager, add cache mechanism to the findEditor
modified pyang  /harmony/enhanced/classlib/trunk/modules/beans/src/test/java/org/apache/harmony/beans/tests/java/beans/PropertyEditorManagerTest.java
07/18/2007 11:03:44 Add test to FontEditor and ColorEditor against RI's behavior, fix bugs;
Also fix some trivial bugs in PropertyEditorManager, add cache mechanism to the findEditor
modified pyang  /harmony/enhanced/classlib/trunk/modules/beans/src/main/java/org/apache/harmony/beans/editors/ColorEditor.java
07/18/2007 11:03:44 Add test to FontEditor and ColorEditor against RI's behavior, fix bugs;
Also fix some trivial bugs in PropertyEditorManager, add cache mechanism to the findEditor
modified pyang  /harmony/enhanced/classlib/trunk/modules/beans/src/main/java/java/beans/PropertyEditorManager.java
07/18/2007 11:03:44 Add test to FontEditor and ColorEditor against RI's behavior, fix bugs;
Also fix some trivial bugs in PropertyEditorManager, add cache mechanism to the findEditor
modified tonywu  /harmony/enhanced/classlib/trunk/modules/beans/src/main/java/java/beans/FeatureDescriptor.java
07/18/2007 11:01:20 refactor Introspector, make it easier to understand1, correct some testcases2,
combine BeanInfoData and BeanInfoWrapper to one class3, add method merge() in FeatureDescripter
and its sub classes
modified tonywu  /harmony/enhanced/classlib/trunk/modules/beans/src/main/java/java/beans/Introspector.java
07/18/2007 11:01:20 refactor Introspector, make it easier to understand1, correct some testcases2,
combine BeanInfoData and BeanInfoWrapper to one class3, add method merge() in FeatureDescripter
and its sub classes
modified tonywu  /harmony/enhanced/classlib/trunk/modules/beans/src/main/java/java/beans/EventSetDescriptor.java
07/18/2007 11:01:20 refactor Introspector, make it easier to understand1, correct some testcases2,
combine BeanInfoData and BeanInfoWrapper to one class3, add method merge() in FeatureDescripter
and its sub classes
modified tonywu  /harmony/enhanced/classlib/trunk/modules/beans/src/main/java/java/beans/MethodDescriptor.java
07/18/2007 11:01:20 refactor Introspector, make it easier to understand1, correct some testcases2,
combine BeanInfoData and BeanInfoWrapper to one class3, add method merge() in FeatureDescripter
and its sub classes
modified tonywu  /harmony/enhanced/classlib/trunk/modules/beans/src/main/java/java/beans/PropertyDescriptor.java
07/18/2007 11:01:20 refactor Introspector, make it easier to understand1, correct some testcases2,
combine BeanInfoData and BeanInfoWrapper to one class3, add method merge() in FeatureDescripter
and its sub classes
modified tonywu  /harmony/enhanced/classlib/trunk/modules/beans/src/test/java/org/apache/harmony/beans/tests/java/beans/IntrospectorTest.java
07/18/2007 11:01:20 refactor Introspector, make it easier to understand1, correct some testcases2,
combine BeanInfoData and BeanInfoWrapper to one class3, add method merge() in FeatureDescripter
and its sub classes
modified mloenko  /harmony/enhanced/drlvm/trunk/vm/vmcore/src/verifier-3363/tpool.cpp 07/18/2007
10:48:34 fix dacapo.jython in debug mode
modified tonywu  /harmony/enhanced/classlib/trunk/modules/beans/src/test/java/org/apache/harmony/beans/tests/java/beans/PropertyEditorManagerTest.java
07/18/2007 09:55:26 restore the default search path when tear down in order to make sure there
is no dependency between testcases
modified tonywu  /harmony/enhanced/classlib/trunk/modules/beans/src/test/java/org/apache/harmony/beans/tests/java/beans/PropertyEditorManagerRegressionTest.java
07/18/2007 09:55:26 restore the default search path when tear down in order to make sure there
is no dependency between testcases

Mime
View raw message