harmony-alerts mailing list archives

Site index · List index
Message view « Date » · « Thread »
Top « Date » · « Thread »
From nom...@intel.com
Subject [build-test alert] BUILD FAILED Windows 2003 x86_64 msvc debug: drlvm regression tests
Date Tue, 17 Jul 2007 20:51:46 GMT
BUILD FAILED:
	Ant Error Message:
C:\cruise\cc\projects\drlvm\trunk\build\make\build.xml:472: The following error occurred while
executing this line: C:\cruise\cc\projects\drlvm\trunk\build\make\targets\reg.test.run.xml:122:
There were test failures

Date of build:	07/18/2007 02:14:04
Time to build:	97 minutes 26 seconds
Last changed:	07/17/2007 22:12:13
Last log entry:	Cosmetic fixes (UNUSED markers) for
HARMONY-3855
HARMONY-4004
HARMONY-4047
HARMONY-4048

+ removal of deprecated parameter in ControlFlowGraph.cpp.



***********************************************************
Execution log (errors/warnings messages):	
cl : Command line warning D9035 : option 'GZ' has been deprecated and will be removed in a
future release
cl : Command line warning D9035 : option 'GZ' has been deprecated and will be removed in a
future release
cl : Command line warning D9036 : use 'RTC1' instead of 'GZ'
cl : Command line warning D9035 : option 'GZ' has been deprecated and will be removed in a
future release
cl : Command line warning D9036 : use 'RTC1' instead of 'GZ'
cl : Command line warning D9035 : option 'GZ' has been deprecated and will be removed in a
future release
cl : Command line warning D9036 : use 'RTC1' instead of 'GZ'
cl : Command line warning D9035 : option 'GZ' has been deprecated and will be removed in a
future release
cl : Command line warning D9036 : use 'RTC1' instead of 'GZ'
cl : Command line warning D9035 : option 'GZ' has been deprecated and will be removed in a
future release
cl : Command line warning D9036 : use 'RTC1' instead of 'GZ'
cl : Command line warning D9035 : option 'GZ' has been deprecated and will be removed in a
future release
cl : Command line warning D9036 : use 'RTC1' instead of 'GZ'
cl : Command line warning D9035 : option 'GZ' has been deprecated and will be removed in a
future release
cl : Command line warning D9036 : use 'RTC1' instead of 'GZ'
cl : Command line warning D9035 : option 'GZ' has been deprecated and will be removed in a
future release
cl : Command line warning D9036 : use 'RTC1' instead of 'GZ'
cl : Command line warning D9035 : option 'GZ' has been deprecated and will be removed in a
future release
cl : Command line warning D9036 : use 'RTC1' instead of 'GZ'
cl : Command line warning D9035 : option 'GZ' has been deprecated and will be removed in a
future release
cl : Command line warning D9036 : use 'RTC1' instead of 'GZ'
cl : Command line warning D9035 : option 'GZ' has been deprecated and will be removed in a
future release
cl : Command line warning D9036 : use 'RTC1' instead of 'GZ'
cl : Command line warning D9035 : option 'GZ' has been deprecated and will be removed in a
future release
cl : Command line warning D9036 : use 'RTC1' instead of 'GZ'
cl : Command line warning D9035 : option 'GZ' has been deprecated and will be removed in a
future release
cl : Command line warning D9036 : use 'RTC1' instead of 'GZ'
cl : Command line warning D9035 : option 'GZ' has been deprecated and will be removed in a
future release
cl : Command line warning D9036 : use 'RTC1' instead of 'GZ'
cl : Command line warning D9035 : option 'GZ' has been deprecated and will be removed in a
future release
cl : Command line warning D9036 : use 'RTC1' instead of 'GZ'
Test org.apache.harmony.drlvm.tests.regression.h2103.Test FAILED
Test org.apache.harmony.drlvm.tests.regression.h3225.PositiveJsrTest FAILED
Configuration:
     Hosting Java = 1.5.0_10 (Sun Microsystems Inc.)
    classlib root = C:\cruise\cc\projects\classlib\trunk
               os = Windows
             arch = em64t
              cxx = msvc
              cfg = debug
     svn revision = ${svn.revision}
       components = deploy
Adding manifest to C:\cruise\cc\projects\drlvm\trunk\build\win_em64t_msvc_debug\semis\reg.tests\native/H0000/DirectByteBufferTest.dll
Adding manifest to C:\cruise\cc\projects\drlvm\trunk\build\win_em64t_msvc_debug\semis\reg.tests\native/H2151/VMInit1.dll
Adding manifest to C:\cruise\cc\projects\drlvm\trunk\build\win_em64t_msvc_debug\semis\reg.tests\native/H2899/ManyArgs.dll
Adding manifest to C:\cruise\cc\projects\drlvm\trunk\build\win_em64t_msvc_debug\semis\reg.tests\native/H2926/test.dll
Adding manifest to C:\cruise\cc\projects\drlvm\trunk\build\win_em64t_msvc_debug\semis\reg.tests\native/H3027/AgentLib.dll
Adding manifest to C:\cruise\cc\projects\drlvm\trunk\build\win_em64t_msvc_debug\semis\reg.tests\native/H3074/natives.dll
Adding manifest to C:\cruise\cc\projects\drlvm\trunk\build\win_em64t_msvc_debug\semis\reg.tests\native/H3130/CallNativeTest.dll
Adding manifest to C:\cruise\cc\projects\drlvm\trunk\build\win_em64t_msvc_debug\semis\reg.tests\native/H3317/GetFieldDeclaringClassTest.dll
Adding manifest to C:\cruise\cc\projects\drlvm\trunk\build\win_em64t_msvc_debug\semis\reg.tests\native/H3404/H3404.dll
Adding manifest to C:\cruise\cc\projects\drlvm\trunk\build\win_em64t_msvc_debug\semis\reg.tests\native/H3505/GetFieldModifiersTest.dll
Adding manifest to C:\cruise\cc\projects\drlvm\trunk\build\win_em64t_msvc_debug\semis\reg.tests\native/H3698/ExceptionLocation.dll
Adding manifest to C:\cruise\cc\projects\drlvm\trunk\build\win_em64t_msvc_debug\semis\reg.tests\native/H3730/StepM2N.dll
Adding manifest to C:\cruise\cc\projects\drlvm\trunk\build\win_em64t_msvc_debug\semis\reg.tests\native/H3784/check.dll
Adding manifest to C:\cruise\cc\projects\drlvm\trunk\build\win_em64t_msvc_debug\semis\reg.tests\native/H3894/ThreadGroupChildren.dll
Adding manifest to C:\cruise\cc\projects\drlvm\trunk\build\win_em64t_msvc_debug\semis\reg.tests\native/H3909/FinalizerThreadGroup.dll
Adding manifest to C:\cruise\cc\projects\drlvm\trunk\build\win_em64t_msvc_debug\semis\reg.tests\native/H3982/EmptyStackTrace.dll

=====================================
DRLVM Regression Testing on platform: windows.x86_64
=====================================
        
The GC did not provide gc_add_weak_root_set_entry()
Running on JET
Running on OPT
Running on interpreter
The GC did not provide gc_add_weak_root_set_entry()
Running on OPT
Running on OPT
The GC did not provide gc_add_weak_root_set_entry()
========================================
Regression testing report was stored in:
========================================
C:\cruise\cc\projects\drlvm\trunk\build\win_em64t_msvc_debug\semis\reg.tests/reports/html
========================================

***********************************************************
Unit Tests: (80)
        
error: test org.apache.harmony.drlvm.tests.regression.h2103.Test
Unit Test Error Details:	(2)
                
Test: testClass: org.apache.harmony.drlvm.tests.regression.h2103.Testjava.lang.NoSuchMethodError:
org/apache/harmony/drlvm/tests/regression/h2103/SubClass.mth()I while resolving constant pool
entry at index 9 in class org/apache/harmony/drlvm/tests/regression/h2103/SupClass
	at org.apache.harmony.drlvm.tests.regression.h2103.Test.test(Test.java:20)
	at java.lang.reflect.VMReflection.invokeMethod(VMReflection.java)


***********************************************************
Modifications since last successful build:	(10)
            
modified mfursov  /harmony/enhanced/drlvm/trunk/vm/jitrino/src/shared/ControlFlowGraph.cpp
07/17/2007 22:12:13 Cosmetic fixes (UNUSED markers) forHARMONY-3855HARMONY-4004HARMONY-4047HARMONY-4048+
removal of deprecated parameter in ControlFlowGraph.cpp.
modified mfursov  /harmony/enhanced/drlvm/trunk/vm/jitrino/src/jet/jet.cpp 07/17/2007 22:12:13
Cosmetic fixes (UNUSED markers) forHARMONY-3855HARMONY-4004HARMONY-4047HARMONY-4048+ removal
of deprecated parameter in ControlFlowGraph.cpp.
modified mfursov  /harmony/enhanced/drlvm/trunk/vm/jitrino/src/shared/ControlFlowGraph.h 07/17/2007
22:12:13 Cosmetic fixes (UNUSED markers) forHARMONY-3855HARMONY-4004HARMONY-4047HARMONY-4048+
removal of deprecated parameter in ControlFlowGraph.cpp.
modified mfursov  /harmony/enhanced/drlvm/trunk/vm/jitrino/src/shared/HashTable.h 07/17/2007
22:12:13 Cosmetic fixes (UNUSED markers) forHARMONY-3855HARMONY-4004HARMONY-4047HARMONY-4048+
removal of deprecated parameter in ControlFlowGraph.cpp.
modified mfursov  /harmony/enhanced/drlvm/trunk/vm/jitrino/src/jet/rt.cpp 07/17/2007 22:12:13
Cosmetic fixes (UNUSED markers) forHARMONY-3855HARMONY-4004HARMONY-4047HARMONY-4048+ removal
of deprecated parameter in ControlFlowGraph.cpp.
modified mfursov  /harmony/enhanced/drlvm/trunk/vm/jitrino/src/jet/cg.cpp 07/17/2007 22:12:13
Cosmetic fixes (UNUSED markers) forHARMONY-3855HARMONY-4004HARMONY-4047HARMONY-4048+ removal
of deprecated parameter in ControlFlowGraph.cpp.
modified mfursov  /harmony/enhanced/drlvm/trunk/build/custom/msvc_2003/vmcore/vmcore.vcproj
07/17/2007 19:56:49 Update to MSVC2003 project files: jthread project was merged into vmcore
modified mfursov  /harmony/enhanced/drlvm/trunk/build/custom/msvc_2003/drlvm.sln 07/17/2007
19:56:49 Update to MSVC2003 project files: jthread project was merged into vmcore
deleted mfursov  /harmony/enhanced/drlvm/trunk/build/custom/msvc_2003/jthread 07/17/2007 19:56:49
Update to MSVC2003 project files: jthread project was merged into vmcore
modified varlax  /harmony/enhanced/drlvm/trunk/build/make/win.properties 07/17/2007 16:18:07
changed https -> http for antlr url to fix connectivity complaints

Mime
View raw message