harmony-alerts mailing list archives

Site index · List index
Message view « Date » · « Thread »
Top « Date » · « Thread »
From nom...@intel.com
Subject [build-test alert] BUILD FAILED Windows XP SP2 msvc debug: drlvm tests
Date Tue, 17 Jul 2007 10:02:26 GMT
BUILD FAILED:
	Ant Error Message:
C:\cruise\trunk\cc\projects\drlvm\trunk\build\make\build.xml:398: The following error occurred while executing this line: C:\cruise\trunk\cc\projects\drlvm\trunk\build\make\build_component.xml:73: The following error occurred while executing this line: C:\cruise\trunk\cc\projects\drlvm\trunk\build\win_ia32_msvc_debug\semis\build\targets\test.xml:6: Some tests failed

Date of build:	07/17/2007 09:50:42
Time to build:	431 minutes 6 seconds
Last changed:	07/17/2007 08:26:29
Last log entry:	optimize for multi-threads

***********************************************************
Execution log (errors/warnings messages):	
Java Result: 1
Java Result: 130
Timeout: killed the sub-process
	at org.apache.tools.ant.taskdefs.Java.fork(Java.java:754)
	at org.apache.tools.ant.taskdefs.Java.executeJava(Java.java:171)
	at org.apache.tools.ant.taskdefs.Java.execute(Java.java:84)
	at org.apache.tools.ant.UnknownElement.execute(UnknownElement.java:275)
	at org.apache.tools.ant.Task.perform(Task.java:364)
	at org.apache.tools.ant.taskdefs.Sequential.execute(Sequential.java:64)
	at net.sf.antcontrib.logic.IfTask.execute(IfTask.java:197)
	at sun.reflect.GeneratedMethodAccessor57.invoke(Unknown Source)
	at sun.reflect.DelegatingMethodAccessorImpl.invoke(DelegatingMethodAccessorImpl.java:25)
	at java.lang.reflect.Method.invoke(Method.java:585)
	at org.apache.tools.ant.TaskAdapter.execute(TaskAdapter.java:123)
	at org.apache.tools.ant.UnknownElement.execute(UnknownElement.java:275)
	at org.apache.tools.ant.Task.perform(Task.java:364)
	at org.apache.tools.ant.taskdefs.Sequential.execute(Sequential.java:64)
	at org.apache.tools.ant.UnknownElement.execute(UnknownElement.java:275)
	at org.apache.tools.ant.Task.perform(Task.java:364)
	at org.apache.tools.ant.taskdefs.MacroInstance.execute(MacroInstance.java:378)
	at net.sf.antcontrib.logic.ForDelegate.doSequentialIteration(ForDelegate.java:228)
	at net.sf.antcontrib.logic.ForDelegate.doTheTasks(ForDelegate.java:281)
	at net.sf.antcontrib.logic.ForDelegate.execute(ForDelegate.java:213)
	at net.sf.antcontrib.logic.For.execute(For.java:166)
	at org.apache.tools.ant.UnknownElement.execute(UnknownElement.java:275)
	at org.apache.tools.ant.Task.perform(Task.java:364)
	at org.apache.tools.ant.Target.execute(Target.java:341)
	at org.apache.tools.ant.Target.performTasks(Target.java:369)
	at org.apache.tools.ant.Project.executeSortedTargets(Project.java:1216)
	at org.apache.tools.ant.helper.SingleCheckExecutor.executeTargets(SingleCheckExecutor.java:37)
	at org.apache.tools.ant.Project.executeTargets(Project.java:1068)
	at org.apache.tools.ant.taskdefs.Ant.execute(Ant.java:382)
	at org.apache.tools.ant.taskdefs.CallTarget.execute(CallTarget.java:107)
	at org.apache.tools.ant.UnknownElement.execute(UnknownElement.java:275)
	at org.apache.tools.ant.Task.perform(Task.java:364)
	at org.apache.tools.ant.taskdefs.Sequential.execute(Sequential.java:64)
	at org.apache.tools.ant.UnknownElement.execute(UnknownElement.java:275)
	at org.apache.tools.ant.Task.perform(Task.java:364)
	at org.apache.tools.ant.taskdefs.MacroInstance.execute(MacroInstance.java:378)
	at net.sf.antcontrib.logic.ForDelegate.doSequentialIteration(ForDelegate.java:228)
	at net.sf.antcontrib.logic.ForDelegate.doTheTasks(ForDelegate.java:253)
	at net.sf.antcontrib.logic.ForDelegate.execute(ForDelegate.java:213)
	at net.sf.antcontrib.logic.For.execute(For.java:166)
	at org.apache.tools.ant.UnknownElement.execute(UnknownElement.java:275)
	at org.apache.tools.ant.Task.perform(Task.java:364)
	at org.apache.tools.ant.Target.execute(Target.java:341)
	at org.apache.tools.ant.Target.performTasks(Target.java:369)
	at org.apache.tools.ant.Project.executeSortedTargets(Project.java:1216)
	at org.apache.tools.ant.Project.executeTarget(Project.java:1185)
	at net.sf.antcontrib.logic.AntFetch.execute(AntFetch.java:345)
	at org.apache.tools.ant.UnknownElement.execute(UnknownElement.java:275)
	at org.apache.tools.ant.Task.perform(Task.java:364)
	at org.apache.tools.ant.Target.execute(Target.java:341)
	at org.apache.tools.ant.Target.performTasks(Target.java:369)
	at org.apache.tools.ant.Project.executeSortedTargets(Project.java:1216)
	at org.apache.tools.ant.helper.SingleCheckExecutor.executeTargets(SingleCheckExecutor.java:37)
	at org.apache.tools.ant.Project.executeTargets(Project.java:1068)
	at org.apache.tools.ant.taskdefs.Ant.execute(Ant.java:382)
	at org.apache.tools.ant.UnknownElement.execute(UnknownElement.java:275)
	at org.apache.tools.ant.Task.perform(Task.java:364)
	at org.apache.tools.ant.Target.execute(Target.java:341)
	at org.apache.tools.ant.Target.performTasks(Target.java:369)
	at org.apache.tools.ant.Project.executeSortedTargets(Project.java:1216)
	at org.apache.tools.ant.helper.SingleCheckExecutor.executeTargets(SingleCheckExecutor.java:37)
	at org.apache.tools.ant.Project.executeTargets(Project.java:1068)
	at org.apache.tools.ant.taskdefs.Ant.execute(Ant.java:382)
	at org.apache.tools.ant.taskdefs.SubAnt.execute(SubAnt.java:277)
	at org.apache.tools.ant.taskdefs.SubAnt.execute(SubAnt.java:201)
	at org.apache.tools.ant.UnknownElement.execute(UnknownElement.java:275)
	at org.apache.tools.ant.Task.perform(Task.java:364)
	at org.apache.tools.ant.Target.execute(Target.java:341)
	at org.apache.tools.ant.Target.performTasks(Target.java:369)
	at org.apache.tools.ant.Project.executeSortedTargets(Project.java:1216)
	at org.apache.tools.ant.Project.executeTarget(Project.java:1185)
	at org.apache.tools.ant.helper.DefaultExecutor.executeTargets(DefaultExecutor.java:40)
	at org.apache.tools.ant.Project.executeTargets(Project.java:1068)
	at org.apache.tools.ant.Main.runBuild(Main.java:668)
	at org.apache.tools.ant.Main.startAnt(Main.java:187)
	at org.apache.tools.ant.launch.Launcher.run(Launcher.java:246)
	at org.apache.tools.ant.launch.Launcher.main(Launcher.java:67)
Java Result: 1
Java Result: 1
Java Result: 130
Timeout: killed the sub-process
	at org.apache.tools.ant.taskdefs.Java.fork(Java.java:754)
	at org.apache.tools.ant.taskdefs.Java.executeJava(Java.java:171)
	at org.apache.tools.ant.taskdefs.Java.execute(Java.java:84)
	at org.apache.tools.ant.UnknownElement.execute(UnknownElement.java:275)
	at org.apache.tools.ant.Task.perform(Task.java:364)
	at org.apache.tools.ant.taskdefs.Sequential.execute(Sequential.java:64)
	at net.sf.antcontrib.logic.IfTask.execute(IfTask.java:197)
	at sun.reflect.GeneratedMethodAccessor57.invoke(Unknown Source)
	at sun.reflect.DelegatingMethodAccessorImpl.invoke(DelegatingMethodAccessorImpl.java:25)
	at java.lang.reflect.Method.invoke(Method.java:585)
	at org.apache.tools.ant.TaskAdapter.execute(TaskAdapter.java:123)
	at org.apache.tools.ant.UnknownElement.execute(UnknownElement.java:275)
	at org.apache.tools.ant.Task.perform(Task.java:364)
	at org.apache.tools.ant.taskdefs.Sequential.execute(Sequential.java:64)
	at org.apache.tools.ant.UnknownElement.execute(UnknownElement.java:275)
	at org.apache.tools.ant.Task.perform(Task.java:364)
	at org.apache.tools.ant.taskdefs.MacroInstance.execute(MacroInstance.java:378)
	at net.sf.antcontrib.logic.ForDelegate.doSequentialIteration(ForDelegate.java:228)
	at net.sf.antcontrib.logic.ForDelegate.doTheTasks(ForDelegate.java:281)
	at net.sf.antcontrib.logic.ForDelegate.execute(ForDelegate.java:213)
	at net.sf.antcontrib.logic.For.execute(For.java:166)
	at org.apache.tools.ant.UnknownElement.execute(UnknownElement.java:275)
	at org.apache.tools.ant.Task.perform(Task.java:364)
	at org.apache.tools.ant.Target.execute(Target.java:341)
	at org.apache.tools.ant.Target.performTasks(Target.java:369)
	at org.apache.tools.ant.Project.executeSortedTargets(Project.java:1216)
	at org.apache.tools.ant.helper.SingleCheckExecutor.executeTargets(SingleCheckExecutor.java:37)
	at org.apache.tools.ant.Project.executeTargets(Project.java:1068)
	at org.apache.tools.ant.taskdefs.Ant.execute(Ant.java:382)
	at org.apache.tools.ant.taskdefs.CallTarget.execute(CallTarget.java:107)
	at org.apache.tools.ant.UnknownElement.execute(UnknownElement.java:275)
	at org.apache.tools.ant.Task.perform(Task.java:364)
	at org.apache.tools.ant.taskdefs.Sequential.execute(Sequential.java:64)
	at org.apache.tools.ant.UnknownElement.execute(UnknownElement.java:275)
	at org.apache.tools.ant.Task.perform(Task.java:364)
	at org.apache.tools.ant.taskdefs.MacroInstance.execute(MacroInstance.java:378)
	at net.sf.antcontrib.logic.ForDelegate.doSequentialIteration(ForDelegate.java:228)
	at net.sf.antcontrib.logic.ForDelegate.doTheTasks(ForDelegate.java:253)
	at net.sf.antcontrib.logic.ForDelegate.execute(ForDelegate.java:213)
	at net.sf.antcontrib.logic.For.execute(For.java:166)
	at org.apache.tools.ant.UnknownElement.execute(UnknownElement.java:275)
	at org.apache.tools.ant.Task.perform(Task.java:364)
	at org.apache.tools.ant.Target.execute(Target.java:341)
	at org.apache.tools.ant.Target.performTasks(Target.java:369)
	at org.apache.tools.ant.Project.executeSortedTargets(Project.java:1216)
	at org.apache.tools.ant.Project.executeTarget(Project.java:1185)
	at net.sf.antcontrib.logic.AntFetch.execute(AntFetch.java:345)
	at org.apache.tools.ant.UnknownElement.execute(UnknownElement.java:275)
	at org.apache.tools.ant.Task.perform(Task.java:364)
	at org.apache.tools.ant.Target.execute(Target.java:341)
	at org.apache.tools.ant.Target.performTasks(Target.java:369)
	at org.apache.tools.ant.Project.executeSortedTargets(Project.java:1216)
	at org.apache.tools.ant.helper.SingleCheckExecutor.executeTargets(SingleCheckExecutor.java:37)
	at org.apache.tools.ant.Project.executeTargets(Project.java:1068)
	at org.apache.tools.ant.taskdefs.Ant.execute(Ant.java:382)
	at org.apache.tools.ant.UnknownElement.execute(UnknownElement.java:275)
	at org.apache.tools.ant.Task.perform(Task.java:364)
	at org.apache.tools.ant.Target.execute(Target.java:341)
	at org.apache.tools.ant.Target.performTasks(Target.java:369)
	at org.apache.tools.ant.Project.executeSortedTargets(Project.java:1216)
	at org.apache.tools.ant.helper.SingleCheckExecutor.executeTargets(SingleCheckExecutor.java:37)
	at org.apache.tools.ant.Project.executeTargets(Project.java:1068)
	at org.apache.tools.ant.taskdefs.Ant.execute(Ant.java:382)
	at org.apache.tools.ant.taskdefs.SubAnt.execute(SubAnt.java:277)
	at org.apache.tools.ant.taskdefs.SubAnt.execute(SubAnt.java:201)
	at org.apache.tools.ant.UnknownElement.execute(UnknownElement.java:275)
	at org.apache.tools.ant.Task.perform(Task.java:364)
	at org.apache.tools.ant.Target.execute(Target.java:341)
	at org.apache.tools.ant.Target.performTasks(Target.java:369)
	at org.apache.tools.ant.Project.executeSortedTargets(Project.java:1216)
	at org.apache.tools.ant.Project.executeTarget(Project.java:1185)
	at org.apache.tools.ant.helper.DefaultExecutor.executeTargets(DefaultExecutor.java:40)
	at org.apache.tools.ant.Project.executeTargets(Project.java:1068)
	at org.apache.tools.ant.Main.runBuild(Main.java:668)
	at org.apache.tools.ant.Main.startAnt(Main.java:187)
	at org.apache.tools.ant.launch.Launcher.run(Launcher.java:246)
	at org.apache.tools.ant.launch.Launcher.main(Launcher.java:67)
Java Result: 1
Java Result: 1
Java Result: 130
Timeout: killed the sub-process
	at org.apache.tools.ant.taskdefs.Java.fork(Java.java:754)
	at org.apache.tools.ant.taskdefs.Java.executeJava(Java.java:171)
	at org.apache.tools.ant.taskdefs.Java.execute(Java.java:84)
	at org.apache.tools.ant.UnknownElement.execute(UnknownElement.java:275)
	at org.apache.tools.ant.Task.perform(Task.java:364)
	at org.apache.tools.ant.taskdefs.Sequential.execute(Sequential.java:64)
	at net.sf.antcontrib.logic.IfTask.execute(IfTask.java:197)
	at sun.reflect.GeneratedMethodAccessor57.invoke(Unknown Source)
	at sun.reflect.DelegatingMethodAccessorImpl.invoke(DelegatingMethodAccessorImpl.java:25)
	at java.lang.reflect.Method.invoke(Method.java:585)
	at org.apache.tools.ant.TaskAdapter.execute(TaskAdapter.java:123)
	at org.apache.tools.ant.UnknownElement.execute(UnknownElement.java:275)
	at org.apache.tools.ant.Task.perform(Task.java:364)
	at org.apache.tools.ant.taskdefs.Sequential.execute(Sequential.java:64)
	at org.apache.tools.ant.UnknownElement.execute(UnknownElement.java:275)
	at org.apache.tools.ant.Task.perform(Task.java:364)
	at org.apache.tools.ant.taskdefs.MacroInstance.execute(MacroInstance.java:378)
	at net.sf.antcontrib.logic.ForDelegate.doSequentialIteration(ForDelegate.java:228)
	at net.sf.antcontrib.logic.ForDelegate.doTheTasks(ForDelegate.java:281)
	at net.sf.antcontrib.logic.ForDelegate.execute(ForDelegate.java:213)
	at net.sf.antcontrib.logic.For.execute(For.java:166)
	at org.apache.tools.ant.UnknownElement.execute(UnknownElement.java:275)
	at org.apache.tools.ant.Task.perform(Task.java:364)
	at org.apache.tools.ant.Target.execute(Target.java:341)
	at org.apache.tools.ant.Target.performTasks(Target.java:369)
	at org.apache.tools.ant.Project.executeSortedTargets(Project.java:1216)
	at org.apache.tools.ant.helper.SingleCheckExecutor.executeTargets(SingleCheckExecutor.java:37)
	at org.apache.tools.ant.Project.executeTargets(Project.java:1068)
	at org.apache.tools.ant.taskdefs.Ant.execute(Ant.java:382)
	at org.apache.tools.ant.taskdefs.CallTarget.execute(CallTarget.java:107)
	at org.apache.tools.ant.UnknownElement.execute(UnknownElement.java:275)
	at org.apache.tools.ant.Task.perform(Task.java:364)
	at org.apache.tools.ant.taskdefs.Sequential.execute(Sequential.java:64)
	at org.apache.tools.ant.UnknownElement.execute(UnknownElement.java:275)
	at org.apache.tools.ant.Task.perform(Task.java:364)
	at org.apache.tools.ant.taskdefs.MacroInstance.execute(MacroInstance.java:378)
	at net.sf.antcontrib.logic.ForDelegate.doSequentialIteration(ForDelegate.java:228)
	at net.sf.antcontrib.logic.ForDelegate.doTheTasks(ForDelegate.java:253)
	at net.sf.antcontrib.logic.ForDelegate.execute(ForDelegate.java:213)
	at net.sf.antcontrib.logic.For.execute(For.java:166)
	at org.apache.tools.ant.UnknownElement.execute(UnknownElement.java:275)
	at org.apache.tools.ant.Task.perform(Task.java:364)
	at org.apache.tools.ant.Target.execute(Target.java:341)
	at org.apache.tools.ant.Target.performTasks(Target.java:369)
	at org.apache.tools.ant.Project.executeSortedTargets(Project.java:1216)
	at org.apache.tools.ant.Project.executeTarget(Project.java:1185)
	at net.sf.antcontrib.logic.AntFetch.execute(AntFetch.java:345)
	at org.apache.tools.ant.UnknownElement.execute(UnknownElement.java:275)
	at org.apache.tools.ant.Task.perform(Task.java:364)
	at org.apache.tools.ant.Target.execute(Target.java:341)
	at org.apache.tools.ant.Target.performTasks(Target.java:369)
	at org.apache.tools.ant.Project.executeSortedTargets(Project.java:1216)
	at org.apache.tools.ant.helper.SingleCheckExecutor.executeTargets(SingleCheckExecutor.java:37)
	at org.apache.tools.ant.Project.executeTargets(Project.java:1068)
	at org.apache.tools.ant.taskdefs.Ant.execute(Ant.java:382)
	at org.apache.tools.ant.UnknownElement.execute(UnknownElement.java:275)
	at org.apache.tools.ant.Task.perform(Task.java:364)
	at org.apache.tools.ant.Target.execute(Target.java:341)
	at org.apache.tools.ant.Target.performTasks(Target.java:369)
	at org.apache.tools.ant.Project.executeSortedTargets(Project.java:1216)
	at org.apache.tools.ant.helper.SingleCheckExecutor.executeTargets(SingleCheckExecutor.java:37)
	at org.apache.tools.ant.Project.executeTargets(Project.java:1068)
	at org.apache.tools.ant.taskdefs.Ant.execute(Ant.java:382)
	at org.apache.tools.ant.taskdefs.SubAnt.execute(SubAnt.java:277)
	at org.apache.tools.ant.taskdefs.SubAnt.execute(SubAnt.java:201)
	at org.apache.tools.ant.UnknownElement.execute(UnknownElement.java:275)
	at org.apache.tools.ant.Task.perform(Task.java:364)
	at org.apache.tools.ant.Target.execute(Target.java:341)
	at org.apache.tools.ant.Target.performTasks(Target.java:369)
	at org.apache.tools.ant.Project.executeSortedTargets(Project.java:1216)
	at org.apache.tools.ant.Project.executeTarget(Project.java:1185)
	at org.apache.tools.ant.helper.DefaultExecutor.executeTargets(DefaultExecutor.java:40)
	at org.apache.tools.ant.Project.executeTargets(Project.java:1068)
	at org.apache.tools.ant.Main.runBuild(Main.java:668)
	at org.apache.tools.ant.Main.startAnt(Main.java:187)
	at org.apache.tools.ant.launch.Launcher.run(Launcher.java:246)
	at org.apache.tools.ant.launch.Launcher.main(Launcher.java:67)
Java Result: 1
Java Result: 1
Java Result: 130
Timeout: killed the sub-process
	at org.apache.tools.ant.taskdefs.Java.fork(Java.java:754)
	at org.apache.tools.ant.taskdefs.Java.executeJava(Java.java:171)
	at org.apache.tools.ant.taskdefs.Java.execute(Java.java:84)
	at org.apache.tools.ant.UnknownElement.execute(UnknownElement.java:275)
	at org.apache.tools.ant.Task.perform(Task.java:364)
	at org.apache.tools.ant.taskdefs.Sequential.execute(Sequential.java:64)
	at net.sf.antcontrib.logic.IfTask.execute(IfTask.java:197)
	at sun.reflect.GeneratedMethodAccessor57.invoke(Unknown Source)
	at sun.reflect.DelegatingMethodAccessorImpl.invoke(DelegatingMethodAccessorImpl.java:25)
	at java.lang.reflect.Method.invoke(Method.java:585)
	at org.apache.tools.ant.TaskAdapter.execute(TaskAdapter.java:123)
	at org.apache.tools.ant.UnknownElement.execute(UnknownElement.java:275)
	at org.apache.tools.ant.Task.perform(Task.java:364)
	at org.apache.tools.ant.taskdefs.Sequential.execute(Sequential.java:64)
	at org.apache.tools.ant.UnknownElement.execute(UnknownElement.java:275)
	at org.apache.tools.ant.Task.perform(Task.java:364)
	at org.apache.tools.ant.taskdefs.MacroInstance.execute(MacroInstance.java:378)
	at net.sf.antcontrib.logic.ForDelegate.doSequentialIteration(ForDelegate.java:228)
	at net.sf.antcontrib.logic.ForDelegate.doTheTasks(ForDelegate.java:281)
	at net.sf.antcontrib.logic.ForDelegate.execute(ForDelegate.java:213)
	at net.sf.antcontrib.logic.For.execute(For.java:166)
	at org.apache.tools.ant.UnknownElement.execute(UnknownElement.java:275)
	at org.apache.tools.ant.Task.perform(Task.java:364)
	at org.apache.tools.ant.Target.execute(Target.java:341)
	at org.apache.tools.ant.Target.performTasks(Target.java:369)
	at org.apache.tools.ant.Project.executeSortedTargets(Project.java:1216)
	at org.apache.tools.ant.helper.SingleCheckExecutor.executeTargets(SingleCheckExecutor.java:37)
	at org.apache.tools.ant.Project.executeTargets(Project.java:1068)
	at org.apache.tools.ant.taskdefs.Ant.execute(Ant.java:382)
	at org.apache.tools.ant.taskdefs.CallTarget.execute(CallTarget.java:107)
	at org.apache.tools.ant.UnknownElement.execute(UnknownElement.java:275)
	at org.apache.tools.ant.Task.perform(Task.java:364)
	at org.apache.tools.ant.taskdefs.Sequential.execute(Sequential.java:64)
	at org.apache.tools.ant.UnknownElement.execute(UnknownElement.java:275)
	at org.apache.tools.ant.Task.perform(Task.java:364)
	at org.apache.tools.ant.taskdefs.MacroInstance.execute(MacroInstance.java:378)
	at net.sf.antcontrib.logic.ForDelegate.doSequentialIteration(ForDelegate.java:228)
	at net.sf.antcontrib.logic.ForDelegate.doTheTasks(ForDelegate.java:253)
	at net.sf.antcontrib.logic.ForDelegate.execute(ForDelegate.java:213)
	at net.sf.antcontrib.logic.For.execute(For.java:166)
	at org.apache.tools.ant.UnknownElement.execute(UnknownElement.java:275)
	at org.apache.tools.ant.Task.perform(Task.java:364)
	at org.apache.tools.ant.Target.execute(Target.java:341)
	at org.apache.tools.ant.Target.performTasks(Target.java:369)
	at org.apache.tools.ant.Project.executeSortedTargets(Project.java:1216)
	at org.apache.tools.ant.Project.executeTarget(Project.java:1185)
	at net.sf.antcontrib.logic.AntFetch.execute(AntFetch.java:345)
	at org.apache.tools.ant.UnknownElement.execute(UnknownElement.java:275)
	at org.apache.tools.ant.Task.perform(Task.java:364)
	at org.apache.tools.ant.Target.execute(Target.java:341)
	at org.apache.tools.ant.Target.performTasks(Target.java:369)
	at org.apache.tools.ant.Project.executeSortedTargets(Project.java:1216)
	at org.apache.tools.ant.helper.SingleCheckExecutor.executeTargets(SingleCheckExecutor.java:37)
	at org.apache.tools.ant.Project.executeTargets(Project.java:1068)
	at org.apache.tools.ant.taskdefs.Ant.execute(Ant.java:382)
	at org.apache.tools.ant.UnknownElement.execute(UnknownElement.java:275)
	at org.apache.tools.ant.Task.perform(Task.java:364)
	at org.apache.tools.ant.Target.execute(Target.java:341)
	at org.apache.tools.ant.Target.performTasks(Target.java:369)
	at org.apache.tools.ant.Project.executeSortedTargets(Project.java:1216)
	at org.apache.tools.ant.helper.SingleCheckExecutor.executeTargets(SingleCheckExecutor.java:37)
	at org.apache.tools.ant.Project.executeTargets(Project.java:1068)
	at org.apache.tools.ant.taskdefs.Ant.execute(Ant.java:382)
	at org.apache.tools.ant.taskdefs.SubAnt.execute(SubAnt.java:277)
	at org.apache.tools.ant.taskdefs.SubAnt.execute(SubAnt.java:201)
	at org.apache.tools.ant.UnknownElement.execute(UnknownElement.java:275)
	at org.apache.tools.ant.Task.perform(Task.java:364)
	at org.apache.tools.ant.Target.execute(Target.java:341)
	at org.apache.tools.ant.Target.performTasks(Target.java:369)
	at org.apache.tools.ant.Project.executeSortedTargets(Project.java:1216)
	at org.apache.tools.ant.Project.executeTarget(Project.java:1185)
	at org.apache.tools.ant.helper.DefaultExecutor.executeTargets(DefaultExecutor.java:40)
	at org.apache.tools.ant.Project.executeTargets(Project.java:1068)
	at org.apache.tools.ant.Main.runBuild(Main.java:668)
	at org.apache.tools.ant.Main.startAnt(Main.java:187)
	at org.apache.tools.ant.launch.Launcher.run(Launcher.java:246)
	at org.apache.tools.ant.launch.Launcher.main(Launcher.java:67)
Java Result: 1
Java Result: 1
Java Result: 130
Java Result: 1
 Using CLASSLIB = C:\cruise\trunk\cc\projects\classlib\trunk
jars: true
using proxy settings: proxy.ims.intel.com port:911
Configuration:
     Hosting Java = 1.5.0_08 (Sun Microsystems Inc.)
    classlib root = C:\cruise\trunk\cc\projects\classlib\trunk
               os = Windows
             arch = ia32
              cxx = msvc
              cfg = debug
     svn revision = 556788
       components = deploy
## Compiling JVMTI natives in: C:\cruise\trunk\cc\projects\drlvm\trunk\vm\tests\jvmti\Breakpoint1
## Compiling JVMTI natives in: C:\cruise\trunk\cc\projects\drlvm\trunk\vm\tests\jvmti\PopFrame1
## Compiling JVMTI natives in: C:\cruise\trunk\cc\projects\drlvm\trunk\vm\tests\jvmti\SingleStep1
## Compiling JVMTI natives in: C:\cruise\trunk\cc\projects\drlvm\trunk\vm\tests\jvmti\VMInit1

        ==================================
        Run JVMTI tests using interpreter
        ==================================
        
Running Breakpoint1
Running PopFrame1
Running SingleStep1
Running VMInit1

        ==================================
        Run JVMTI tests using jitrino.JET
        ==================================
        
Running Breakpoint1
Running PopFrame1
Running SingleStep1
Running VMInit1

        ==================================
        Run JVMTI tests using Client mode JIT (default)
        ==================================
        
Running Breakpoint1
Running PopFrame1
Running SingleStep1
Running VMInit1

        ==================================
        Run JVMTI tests using jitrino.OPT
        ==================================
        

Using exclude file = C:\cruise\trunk\cc\projects\drlvm\trunk\build\make\excludes\exclude.drlvm_jvmti.windows.x86.opt   
        
Breakpoint1/Breakpoint1.java
SingleStep1/SingleStep1.java
VMInit1/VMInit1.java
PopFrame1/PopFrame1.java

                  
Running Breakpoint1
Running PopFrame1
Running SingleStep1
Running VMInit1

        ==================================
        Run JVMTI tests using Server mode JIT
        ==================================
        

Using exclude file = C:\cruise\trunk\cc\projects\drlvm\trunk\build\make\excludes\exclude.drlvm_jvmti.windows.x86.srv   
        
Breakpoint1/Breakpoint1.java
SingleStep1/SingleStep1.java
VMInit1/VMInit1.java
PopFrame1/PopFrame1.java

                  
Running Breakpoint1
Running PopFrame1
Running SingleStep1
Running VMInit1
## Compiling framework...
## Compiling C unit tests
## Linking C unit test: test_java_attrs
## Linking C unit test: test_java_basic
## Linking C unit test: test_java_identify
## Linking C unit test: test_java_interrupt
## Linking C unit test: test_java_monitors
## Linking C unit test: test_java_park
## Linking C unit test: test_java_ptr_conv
## Linking C unit test: test_java_suspend
## Linking C unit test: test_native_basic
## Linking C unit test: test_native_fat_monitor
## Linking C unit test: test_native_suspend
## Linking C unit test: test_native_thin_monitor
## Linking C unit test: test_ti_instrum
## Linking C unit test: test_ti_local_storage
## Linking C unit test: test_ti_monitor_info
## Linking C unit test: test_ti_peak_count
## Linking C unit test: test_ti_raw_monitors
## Linking C unit test: test_ti_state
## Linking C unit test: test_ti_timing
## Executing C unit test: test_java_attrs
INFO: TEST test_jthread_get_priority start
INFO: TEST test_jthread_get_priority: PASSED
INFO: TEST test_jthread_set_priority start
INFO: TEST test_jthread_set_priority: PASSED
## TEST PASSED
## Executing C unit test: test_java_basic
INFO: TEST test_jthread_attach start
INFO: TEST test_jthread_attach: PASSED
INFO: TEST test_jthread_detach start
INFO: TEST test_jthread_detach: PASSED
INFO: TEST test_hythread_create start
INFO: TEST test_hythread_create: PASSED
INFO: TEST test_hythread_create_with_function start
INFO: TEST test_hythread_create_with_function: PASSED
INFO: TEST test_jthread_get_JNI_env start
INFO: TEST test_jthread_get_JNI_env: PASSED
INFO: TEST test_jthread_join start
INFO: TEST test_jthread_join: PASSED
INFO: TEST test_jthread_timed_join start
-------- status = 00011177 (70007) 100
-------- status = 00011177 (70007) 100
-------- status = 00011177 (70007) 100
-------- status = 00011177 (70007) 100
-------- status = 00000000 (0) 50000
-------- status = 00000000 (0) 50000
-------- status = 00000000 (0) 50000
-------- status = 00000000 (0) 50000
INFO: TEST test_jthread_timed_join: PASSED
INFO: TEST test_jthread_exception_stop start
INFO: TEST test_jthread_exception_stop: PASSED
INFO: TEST test_jthread_stop start
INFO: TEST test_jthread_stop: PASSED
INFO: TEST test_jthread_sleep start
INFO: TEST test_jthread_sleep: PASSED
INFO: TEST test_hythread_yield start
INFO: TEST test_hythread_yield: PASSED
## TEST PASSED
## Executing C unit test: test_java_identify
INFO: TEST test_jthread_self start
INFO: TEST test_jthread_self: PASSED
INFO: TEST test_jthread_get_id start
INFO: TEST test_jthread_get_id: PASSED
INFO: TEST test_jthread_get_thread start
INFO: TEST test_jthread_get_thread: PASSED
## TEST PASSED
## Executing C unit test: test_java_interrupt
INFO: TEST test_jthread_interrupt start
INFO: TEST test_jthread_interrupt: PASSED
INFO: TEST test_jthread_is_interrupted start
INFO: TEST test_jthread_is_interrupted: PASSED
INFO: TEST test_jthread_clear_interrupted start
INFO: TEST test_jthread_clear_interrupted: PASSED
## TEST PASSED
## Executing C unit test: test_java_monitors
INFO: TEST test_jthread_monitor_init start
INFO: TEST test_jthread_monitor_init: PASSED
INFO: TEST test_jthread_monitor_enter start
INFO: TEST test_jthread_monitor_enter: PASSED
INFO: TEST test_jthread_monitor_try_enter start
INFO: TEST test_jthread_monitor_try_enter: PASSED
INFO: TEST test_jthread_monitor_exit start
INFO: TEST test_jthread_monitor_exit: PASSED
INFO: TEST test_jthread_monitor_notify_all start
INFO: TEST test_jthread_monitor_notify_all: PASSED
INFO: TEST test_jthread_monitor_wait start
INFO: TEST test_jthread_monitor_wait: PASSED
INFO: TEST test_jthread_monitor_timed_wait start
INFO: TEST test_jthread_monitor_timed_wait: PASSED
INFO: TEST test_jthread_monitor_timed_wait_timeout start
INFO: TEST test_jthread_monitor_timed_wait_timeout: PASSED
## TEST PASSED
## Executing C unit test: test_java_park
INFO: TEST test_jthread_park_unpark start
INFO: TEST test_jthread_park_unpark: PASSED
INFO: TEST test_jthread_park_interrupt start
INFO: TEST test_jthread_park_interrupt: PASSED
INFO: TEST test_jthread_timed_park start
INFO: TEST test_jthread_timed_park: PASSED
## TEST PASSED
## Executing C unit test: test_java_ptr_conv
INFO: TEST test_jthread_get_java_thread start
INFO: TEST test_jthread_get_java_thread: PASSED
INFO: TEST test_jthread_get_native_thread start
INFO: TEST test_jthread_get_native_thread: PASSED
## TEST PASSED
## Executing C unit test: test_java_suspend
INFO: TEST test_jthread_suspend_resume start
INFO: TEST test_jthread_suspend_resume: PASSED
INFO: TEST test_jthread_suspend_all_resume_all start
INFO: TEST test_jthread_suspend_all_resume_all: PASSED
## TEST PASSED
## Executing C unit test: test_native_basic
INFO: TEST test_hythread_self_base start
INFO: TEST test_hythread_self_base: PASSED
INFO: TEST test_hythread_create start
INFO: TEST test_hythread_create: PASSED
INFO: TEST test_hythread_create_many start
INFO: TEST test_hythread_create_many: PASSED
INFO: TEST test_hythread_iterator start
iterator size: 100
INFO: TEST test_hythread_iterator: PASSED
INFO: TEST test_hythread_iterator_default start
default group iterator: 104
INFO: TEST test_hythread_iterator_default: PASSED
## TEST PASSED
## Executing C unit test: test_native_fat_monitor
INFO: TEST test_wait_signal start
INFO: TEST test_wait_signal: PASSED
## TEST PASSED
## Executing C unit test: test_native_suspend
INFO: TEST test_hythread_thread_suspend start
INFO: TEST test_hythread_thread_suspend: PASSED
INFO: TEST test_hythread_thread_suspend_all start
INFO: TEST test_hythread_thread_suspend_all: PASSED
## TEST PASSED
## Executing C unit test: test_native_thin_monitor
INFO: TEST test_hythread_thin_monitor_enter start
INFO: TEST test_hythread_thin_monitor_enter: PASSED
INFO: TEST test_hythread_thin_monitor_try_enter start
INFO: TEST test_hythread_thin_monitor_try_enter: PASSED
INFO: TEST test_hythread_thin_monitor_wait_timed_illegal start
INFO: TEST test_hythread_thin_monitor_wait_timed_illegal: PASSED
INFO: TEST test_hythread_thin_monitor_wait_timed start
INFO: TEST test_hythread_thin_monitor_wait_timed: PASSED
INFO: TEST test_hythread_thin_monitor_fat_unlock start
status: 70007
INFO: TEST test_hythread_thin_monitor_fat_unlock: PASSED
INFO: TEST test_hythread_thin_monitor_enter_contended start
INFO: TEST test_hythread_thin_monitor_enter_contended: PASSED
## TEST PASSED
## Executing C unit test: test_ti_instrum
INFO: TEST test_jthread_get_all_threads start
INFO: TEST test_jthread_get_all_threads: PASSED
INFO: TEST test_jthread_get_thread_count start
INFO: TEST test_jthread_get_thread_count: PASSED
INFO: TEST test_jthread_get_blocked_count start
INFO: TEST test_jthread_get_blocked_count: PASSED
## TEST PASSED
## Executing C unit test: test_ti_local_storage
INFO: TEST test_jthread_set_and_get_local_storage start
INFO: TEST test_jthread_set_and_get_local_storage: PASSED
## TEST PASSED
## Executing C unit test: test_ti_monitor_info
INFO: TEST test_jthread_get_contended_monitor start
INFO: TEST test_jthread_get_contended_monitor: PASSED
INFO: TEST test_jthread_holds_lock start
INFO: TEST test_jthread_holds_lock: PASSED
INFO: TEST test_jthread_get_lock_owner start
INFO: TEST test_jthread_get_lock_owner: PASSED
INFO: TEST test_jthread_get_owned_monitors start
INFO: TEST test_jthread_get_owned_monitors: PASSED
## TEST PASSED
## Executing C unit test: test_ti_peak_count
## TEST PASSED
## Executing C unit test: test_ti_raw_monitors
INFO: TEST test_jthread_raw_monitor_create start
INFO: TEST test_jthread_raw_monitor_create: PASSED
INFO: TEST test_jthread_raw_monitor_destroy start
INFO: TEST test_jthread_raw_monitor_destroy: PASSED
INFO: TEST test_jthread_raw_monitor_enter start
INFO: TEST test_jthread_raw_monitor_enter: PASSED
INFO: TEST test_jthread_raw_monitor_try_enter start
INFO: TEST test_jthread_raw_monitor_try_enter: PASSED
INFO: TEST test_jthread_raw_monitor_exit start
INFO: TEST test_jthread_raw_monitor_exit: PASSED
## TEST PASSED
## Executing C unit test: test_ti_state
INFO: TEST test_jthread_get_jvmti_state_6 start
state = 00000002 (00000002)
state = 00000002 (00000002)
state = 00000002 (00000002)
state = 00000002 (00000002)
state = 00000002 (00000002)
INFO: TEST test_jthread_get_jvmti_state_6: PASSED
## TEST PASSED
## Executing C unit test: test_ti_timing
## TEST PASSED
## Please find tests and results at C:\cruise\trunk\cc\projects\drlvm\trunk\build\win_ia32_msvc_debug\semis/vm/_cunit.tests/
Note: C:\cruise\trunk\cc\projects\drlvm\trunk\vm\tests\smoke\gc\RunFinalizersOnExitTest.java uses or overrides a deprecated API.
Note: Recompile with -Xlint:deprecation for details.
Note: Some input files use unchecked or unsafe operations.
Note: Recompile with -Xlint:unchecked for details.
Compiling C:\cruise\trunk\cc\projects\drlvm\trunk\build\win_ia32_msvc_debug\semis\vm\_smoke.tests\natives/shutdown/TestDaemonOnWait
Compiling C:\cruise\trunk\cc\projects\drlvm\trunk\build\win_ia32_msvc_debug\semis\vm\_smoke.tests\natives/shutdown/TestFatalError
Compiling C:\cruise\trunk\cc\projects\drlvm\trunk\build\win_ia32_msvc_debug\semis\vm\_smoke.tests\natives/shutdown/TestInterrupt

        ==================================
        Smoke tests on interpreter
        ==================================
        

Using exclude file = C:\cruise\trunk\cc\projects\drlvm\trunk\build\make\excludes\exclude.drlvm_smoke.windows.x86.int   
        
Check.java
PerfCheck.java

# slow
gc/Mark.java

# HARMONY-2977
io/Integers.java

# HARMONY-3917
gc/PhantomReferenceTest.java
gc/WeakReferenceTest.java

# This stress test is very slow on interpreter
stress/Intern.java


                  
Running test : Hi
 PASSED : Hi
Running test : StackTest
 PASSED : StackTest
Running test : classloader.ClassTestGetDeclaringClass
 PASSED : classloader.ClassTestGetDeclaringClass
Running test : classloader.ExceptionInInitializerTest
 PASSED : classloader.ExceptionInInitializerTest
Running test : classloader.LogLoader
 PASSED : classloader.LogLoader
Running test : classloader.NotFound
 PASSED : classloader.NotFound
Running test : classloader.StressLoader
 PASSED : classloader.StressLoader
Running test : exception.ExceptionStackTest
 PASSED : exception.ExceptionStackTest
Running test : exception.FinalizeStackTest
 PASSED : exception.FinalizeStackTest
Running test : exception.NPE
 PASSED : exception.NPE
Running test : gc.FinAlloc
 PASSED : gc.FinAlloc
Running test : gc.Finalizer
 PASSED : gc.Finalizer
Running test : gc.Force
 PASSED : gc.Force
Running test : gc.Fragment
 PASSED : gc.Fragment
Running test : gc.Free
 PASSED : gc.Free
Running test : gc.LOS
 PASSED : gc.LOS
Running test : gc.List
 PASSED : gc.List
Running test : gc.MultiThreads
 PASSED : gc.MultiThreads
Running test : gc.NPE
 PASSED : gc.NPE
Running test : gc.PhantomReferenceQueueTest
 PASSED : gc.PhantomReferenceQueueTest
Running test : gc.RefRemove
 PASSED : gc.RefRemove
Running test : gc.RunFinalizersOnExitTest
 PASSED : gc.RunFinalizersOnExitTest
Running test : gc.StressRef
 PASSED : gc.StressRef
Running test : gc.SynchronizedFinalizersTest
 PASSED : gc.SynchronizedFinalizersTest
Running test : gc.ThreadSuspension
 PASSED : gc.ThreadSuspension
Running test : init.ErrorInInitializer
 PASSED : init.ErrorInInitializer
Running test : init.Other
 PASSED : init.Other
Running test : io.ArrayList
 PASSED : io.ArrayList
Running test : jni.LoadLibrary
 PASSED : jni.LoadLibrary
Running test : outofmemory.Double
 PASSED : outofmemory.Double
Running test : outofmemory.Int
 PASSED : outofmemory.Int
Running test : outofmemory.Plain
 PASSED : outofmemory.Plain
Running test : outofmemory.Ref
 PASSED : outofmemory.Ref
Running test : outofmemory.Throw
 PASSED : outofmemory.Throw
Running test : outofmemory.Vector
 PASSED : outofmemory.Vector
Running test : outofmemory.VectorDouble
 PASSED : outofmemory.VectorDouble
Running test : outofmemory.VectorInt
 PASSED : outofmemory.VectorInt
Running test : outofmemory.VectorRef
 PASSED : outofmemory.VectorRef
Running test : perf.CreateManyExceptions
 PASSED : perf.CreateManyExceptions
Running test : perf.CreateManyExceptions_depth
 PASSED : perf.CreateManyExceptions_depth
Running test : perf.MultiThreadsSimple
 PASSED : perf.MultiThreadsSimple
Running test : perf.SeveralThreads
 PASSED : perf.SeveralThreads
Running test : perf.StressCornerSize
 PASSED : perf.StressCornerSize
Running test : perf.StressCornerSize_a
 PASSED : perf.StressCornerSize_a
Running test : perf.ThrowMany
 PASSED : perf.ThrowMany
Running test : perf.ThrowManyExceptions
 PASSED : perf.ThrowManyExceptions
Running test : perf.ThrowManyExceptions_depth
 PASSED : perf.ThrowManyExceptions_depth
Running test : perf.ThrowMany_depth
 PASSED : perf.ThrowMany_depth
Running test : reflect.GetMethod
 PASSED : reflect.GetMethod
Running test : shutdown.TestDaemonOnWait
 PASSED : shutdown.TestDaemonOnWait
Running test : shutdown.TestFatalError
 PASSED : shutdown.TestFatalError
Running test : shutdown.TestInterrupt
 PASSED : shutdown.TestInterrupt
Running test : shutdown.TestLock
 PASSED : shutdown.TestLock
Running test : stress.BigStringBuffer
 PASSED : stress.BigStringBuffer
Running test : stress.Finalizer
 PASSED : stress.Finalizer
Running test : stress.Mix
 PASSED : stress.Mix
Running test : stress.Stack
 PASSED : stress.Stack
Running test : stress.Sync
 PASSED : stress.Sync
Running test : stress.Threads
 PASSED : stress.Threads
Running test : stress.Vector
 PASSED : stress.Vector
Running test : stress.WeakHashmapTest
 PASSED : stress.WeakHashmapTest
Running test : thread.ExitShutdownHook
 PASSED : thread.ExitShutdownHook
Running test : thread.InfiniteFinalizer
 PASSED : thread.InfiniteFinalizer
Running test : thread.InterruptWait
 PASSED : thread.InterruptWait
Running test : thread.ManyThreadsTest
*** FAILED **** : thread.ManyThreadsTest (0 res code)
Running test : thread.Sleep
 PASSED : thread.Sleep
Running test : thread.ThreadInterrupt
 PASSED : thread.ThreadInterrupt
Running test : thread.ThreadOOM
 PASSED : thread.ThreadOOM
Running test : util.Date
 PASSED : util.Date
Running test : util.DoPriveleged
 PASSED : util.DoPriveleged
Running test : util.Prop
 PASSED : util.Prop
Running test : util.StringIntern
 PASSED : util.StringIntern
Please find test classes and results at C:\cruise\trunk\cc\projects\drlvm\trunk\build\win_ia32_msvc_debug\semis/vm/_smoke.tests/

        ==================================
        Smoke tests on jitrino.JET
        ==================================
        

Using exclude file = C:\cruise\trunk\cc\projects\drlvm\trunk\build\make\excludes\exclude.drlvm_smoke.windows.x86.jet   
        
Check.java
PerfCheck.java

# HARMONY-2977
io/Integers.java

# HARMONY-3917
gc/PhantomReferenceTest.java
gc/WeakReferenceTest.java

                  
Running test : Hi
 PASSED : Hi
Running test : StackTest
 PASSED : StackTest
Running test : classloader.ClassTestGetDeclaringClass
 PASSED : classloader.ClassTestGetDeclaringClass
Running test : classloader.ExceptionInInitializerTest
 PASSED : classloader.ExceptionInInitializerTest
Running test : classloader.LogLoader
 PASSED : classloader.LogLoader
Running test : classloader.NotFound
 PASSED : classloader.NotFound
Running test : classloader.StressLoader
 PASSED : classloader.StressLoader
Running test : exception.ExceptionStackTest
 PASSED : exception.ExceptionStackTest
Running test : exception.FinalizeStackTest
 PASSED : exception.FinalizeStackTest
Running test : exception.NPE
 PASSED : exception.NPE
Running test : gc.FinAlloc
 PASSED : gc.FinAlloc
Running test : gc.Finalizer
 PASSED : gc.Finalizer
Running test : gc.Force
 PASSED : gc.Force
Running test : gc.Fragment
 PASSED : gc.Fragment
Running test : gc.Free
 PASSED : gc.Free
Running test : gc.LOS
 PASSED : gc.LOS
Running test : gc.List
 PASSED : gc.List
Running test : gc.Mark
 PASSED : gc.Mark
Running test : gc.MultiThreads
 PASSED : gc.MultiThreads
Running test : gc.NPE
 PASSED : gc.NPE
Running test : gc.PhantomReferenceQueueTest
 PASSED : gc.PhantomReferenceQueueTest
Running test : gc.RefRemove
 PASSED : gc.RefRemove
Running test : gc.RunFinalizersOnExitTest
 PASSED : gc.RunFinalizersOnExitTest
Running test : gc.StressRef
 PASSED : gc.StressRef
Running test : gc.SynchronizedFinalizersTest
 PASSED : gc.SynchronizedFinalizersTest
Running test : gc.ThreadSuspension
 PASSED : gc.ThreadSuspension
Running test : init.ErrorInInitializer
 PASSED : init.ErrorInInitializer
Running test : init.Other
 PASSED : init.Other
Running test : io.ArrayList
 PASSED : io.ArrayList
Running test : jni.LoadLibrary
 PASSED : jni.LoadLibrary
Running test : outofmemory.Double
 PASSED : outofmemory.Double
Running test : outofmemory.Int
 PASSED : outofmemory.Int
Running test : outofmemory.Plain
 PASSED : outofmemory.Plain
Running test : outofmemory.Ref
 PASSED : outofmemory.Ref
Running test : outofmemory.Throw
 PASSED : outofmemory.Throw
Running test : outofmemory.Vector
 PASSED : outofmemory.Vector
Running test : outofmemory.VectorDouble
 PASSED : outofmemory.VectorDouble
Running test : outofmemory.VectorInt
 PASSED : outofmemory.VectorInt
Running test : outofmemory.VectorRef
 PASSED : outofmemory.VectorRef
Running test : perf.CreateManyExceptions
 PASSED : perf.CreateManyExceptions
Running test : perf.CreateManyExceptions_depth
 PASSED : perf.CreateManyExceptions_depth
Running test : perf.MultiThreadsSimple
 PASSED : perf.MultiThreadsSimple
Running test : perf.SeveralThreads
 PASSED : perf.SeveralThreads
Running test : perf.StressCornerSize
 PASSED : perf.StressCornerSize
Running test : perf.StressCornerSize_a
 PASSED : perf.StressCornerSize_a
Running test : perf.ThrowMany
 PASSED : perf.ThrowMany
Running test : perf.ThrowManyExceptions
 PASSED : perf.ThrowManyExceptions
Running test : perf.ThrowManyExceptions_depth
 PASSED : perf.ThrowManyExceptions_depth
Running test : perf.ThrowMany_depth
 PASSED : perf.ThrowMany_depth
Running test : reflect.GetMethod
 PASSED : reflect.GetMethod
Running test : shutdown.TestDaemonOnWait
 PASSED : shutdown.TestDaemonOnWait
Running test : shutdown.TestFatalError
 PASSED : shutdown.TestFatalError
Running test : shutdown.TestInterrupt
 PASSED : shutdown.TestInterrupt
Running test : shutdown.TestLock
 PASSED : shutdown.TestLock
Running test : stress.BigStringBuffer
 PASSED : stress.BigStringBuffer
Running test : stress.Finalizer
 PASSED : stress.Finalizer
Running test : stress.Intern
 PASSED : stress.Intern
Running test : stress.Mix
 PASSED : stress.Mix
Running test : stress.Stack
 PASSED : stress.Stack
Running test : stress.Sync
 PASSED : stress.Sync
Running test : stress.Threads
 PASSED : stress.Threads
Running test : stress.Vector
 PASSED : stress.Vector
Running test : stress.WeakHashmapTest
 PASSED : stress.WeakHashmapTest
Running test : thread.ExitShutdownHook
 PASSED : thread.ExitShutdownHook
Running test : thread.InfiniteFinalizer
 PASSED : thread.InfiniteFinalizer
Running test : thread.InterruptWait
 PASSED : thread.InterruptWait
Running test : thread.ManyThreadsTest
*** FAILED **** : thread.ManyThreadsTest (0 res code)
Running test : thread.Sleep
 PASSED : thread.Sleep
Running test : thread.ThreadInterrupt
 PASSED : thread.ThreadInterrupt
Running test : thread.ThreadOOM
 PASSED : thread.ThreadOOM
Running test : util.Date
 PASSED : util.Date
Running test : util.DoPriveleged
 PASSED : util.DoPriveleged
Running test : util.Prop
 PASSED : util.Prop
Running test : util.StringIntern
 PASSED : util.StringIntern
Please find test classes and results at C:\cruise\trunk\cc\projects\drlvm\trunk\build\win_ia32_msvc_debug\semis/vm/_smoke.tests/

        ==================================
        Smoke tests on Client mode JIT (default)
        ==================================
        

Using exclude file = C:\cruise\trunk\cc\projects\drlvm\trunk\build\make\excludes\exclude.drlvm_smoke.windows.x86.jit   
        
Check.java
PerfCheck.java

# HARMONY-2977
io/Integers.java

# HARMONY-3917
gc/PhantomReferenceTest.java
gc/WeakReferenceTest.java

                  
Running test : Hi
 PASSED : Hi
Running test : StackTest
 PASSED : StackTest
Running test : classloader.ClassTestGetDeclaringClass
 PASSED : classloader.ClassTestGetDeclaringClass
Running test : classloader.ExceptionInInitializerTest
 PASSED : classloader.ExceptionInInitializerTest
Running test : classloader.LogLoader
 PASSED : classloader.LogLoader
Running test : classloader.NotFound
 PASSED : classloader.NotFound
Running test : classloader.StressLoader
 PASSED : classloader.StressLoader
Running test : exception.ExceptionStackTest
 PASSED : exception.ExceptionStackTest
Running test : exception.FinalizeStackTest
 PASSED : exception.FinalizeStackTest
Running test : exception.NPE
 PASSED : exception.NPE
Running test : gc.FinAlloc
 PASSED : gc.FinAlloc
Running test : gc.Finalizer
 PASSED : gc.Finalizer
Running test : gc.Force
 PASSED : gc.Force
Running test : gc.Fragment
 PASSED : gc.Fragment
Running test : gc.Free
 PASSED : gc.Free
Running test : gc.LOS
 PASSED : gc.LOS
Running test : gc.List
 PASSED : gc.List
Running test : gc.Mark
 PASSED : gc.Mark
Running test : gc.MultiThreads
 PASSED : gc.MultiThreads
Running test : gc.NPE
 PASSED : gc.NPE
Running test : gc.PhantomReferenceQueueTest
 PASSED : gc.PhantomReferenceQueueTest
Running test : gc.RefRemove
 PASSED : gc.RefRemove
Running test : gc.RunFinalizersOnExitTest
 PASSED : gc.RunFinalizersOnExitTest
Running test : gc.StressRef
 PASSED : gc.StressRef
Running test : gc.SynchronizedFinalizersTest
 PASSED : gc.SynchronizedFinalizersTest
Running test : gc.ThreadSuspension
 PASSED : gc.ThreadSuspension
Running test : init.ErrorInInitializer
 PASSED : init.ErrorInInitializer
Running test : init.Other
 PASSED : init.Other
Running test : io.ArrayList
 PASSED : io.ArrayList
Running test : jni.LoadLibrary
 PASSED : jni.LoadLibrary
Running test : outofmemory.Double
 PASSED : outofmemory.Double
Running test : outofmemory.Int
 PASSED : outofmemory.Int
Running test : outofmemory.Plain
 PASSED : outofmemory.Plain
Running test : outofmemory.Ref
 PASSED : outofmemory.Ref
Running test : outofmemory.Throw
 PASSED : outofmemory.Throw
Running test : outofmemory.Vector
 PASSED : outofmemory.Vector
Running test : outofmemory.VectorDouble
 PASSED : outofmemory.VectorDouble
Running test : outofmemory.VectorInt
 PASSED : outofmemory.VectorInt
Running test : outofmemory.VectorRef
 PASSED : outofmemory.VectorRef
Running test : perf.CreateManyExceptions
 PASSED : perf.CreateManyExceptions
Running test : perf.CreateManyExceptions_depth
 PASSED : perf.CreateManyExceptions_depth
Running test : perf.MultiThreadsSimple
 PASSED : perf.MultiThreadsSimple
Running test : perf.SeveralThreads
 PASSED : perf.SeveralThreads
Running test : perf.StressCornerSize
 PASSED : perf.StressCornerSize
Running test : perf.StressCornerSize_a
 PASSED : perf.StressCornerSize_a
Running test : perf.ThrowMany
 PASSED : perf.ThrowMany
Running test : perf.ThrowManyExceptions
 PASSED : perf.ThrowManyExceptions
Running test : perf.ThrowManyExceptions_depth
 PASSED : perf.ThrowManyExceptions_depth
Running test : perf.ThrowMany_depth
 PASSED : perf.ThrowMany_depth
Running test : reflect.GetMethod
 PASSED : reflect.GetMethod
Running test : shutdown.TestDaemonOnWait
 PASSED : shutdown.TestDaemonOnWait
Running test : shutdown.TestFatalError
 PASSED : shutdown.TestFatalError
Running test : shutdown.TestInterrupt
 PASSED : shutdown.TestInterrupt
Running test : shutdown.TestLock
 PASSED : shutdown.TestLock
Running test : stress.BigStringBuffer
 PASSED : stress.BigStringBuffer
Running test : stress.Finalizer
 PASSED : stress.Finalizer
Running test : stress.Intern
 PASSED : stress.Intern
Running test : stress.Mix
 PASSED : stress.Mix
Running test : stress.Stack
 PASSED : stress.Stack
Running test : stress.Sync
 PASSED : stress.Sync
Running test : stress.Threads
 PASSED : stress.Threads
Running test : stress.Vector
 PASSED : stress.Vector
Running test : stress.WeakHashmapTest
 PASSED : stress.WeakHashmapTest
Running test : thread.ExitShutdownHook
 PASSED : thread.ExitShutdownHook
Running test : thread.InfiniteFinalizer
 PASSED : thread.InfiniteFinalizer
Running test : thread.InterruptWait
 PASSED : thread.InterruptWait
Running test : thread.ManyThreadsTest
*** FAILED **** : thread.ManyThreadsTest (0 res code)
Running test : thread.Sleep
 PASSED : thread.Sleep
Running test : thread.ThreadInterrupt
 PASSED : thread.ThreadInterrupt
Running test : thread.ThreadOOM
 PASSED : thread.ThreadOOM
Running test : util.Date
 PASSED : util.Date
Running test : util.DoPriveleged
 PASSED : util.DoPriveleged
Running test : util.Prop
 PASSED : util.Prop
Running test : util.StringIntern
 PASSED : util.StringIntern
Please find test classes and results at C:\cruise\trunk\cc\projects\drlvm\trunk\build\win_ia32_msvc_debug\semis/vm/_smoke.tests/

        ==================================
        Smoke tests on jitrino.OPT
        ==================================
        

Using exclude file = C:\cruise\trunk\cc\projects\drlvm\trunk\build\make\excludes\exclude.drlvm_smoke.windows.x86.opt   
        
Check.java
PerfCheck.java

# HARMONY-2977
io/Integers.java

# HARMONY-3917
gc/PhantomReferenceTest.java
gc/WeakReferenceTest.java

                  
Running test : Hi
 PASSED : Hi
Running test : StackTest
 PASSED : StackTest
Running test : classloader.ClassTestGetDeclaringClass
 PASSED : classloader.ClassTestGetDeclaringClass
Running test : classloader.ExceptionInInitializerTest
 PASSED : classloader.ExceptionInInitializerTest
Running test : classloader.LogLoader
 PASSED : classloader.LogLoader
Running test : classloader.NotFound
 PASSED : classloader.NotFound
Running test : classloader.StressLoader
 PASSED : classloader.StressLoader
Running test : exception.ExceptionStackTest
 PASSED : exception.ExceptionStackTest
Running test : exception.FinalizeStackTest
 PASSED : exception.FinalizeStackTest
Running test : exception.NPE
 PASSED : exception.NPE
Running test : gc.FinAlloc
 PASSED : gc.FinAlloc
Running test : gc.Finalizer
 PASSED : gc.Finalizer
Running test : gc.Force
 PASSED : gc.Force
Running test : gc.Fragment
 PASSED : gc.Fragment
Running test : gc.Free
 PASSED : gc.Free
Running test : gc.LOS
 PASSED : gc.LOS
Running test : gc.List
 PASSED : gc.List
Running test : gc.Mark
 PASSED : gc.Mark
Running test : gc.MultiThreads
 PASSED : gc.MultiThreads
Running test : gc.NPE
 PASSED : gc.NPE
Running test : gc.PhantomReferenceQueueTest
 PASSED : gc.PhantomReferenceQueueTest
Running test : gc.RefRemove
 PASSED : gc.RefRemove
Running test : gc.RunFinalizersOnExitTest
 PASSED : gc.RunFinalizersOnExitTest
Running test : gc.StressRef
 PASSED : gc.StressRef
Running test : gc.SynchronizedFinalizersTest
 PASSED : gc.SynchronizedFinalizersTest
Running test : gc.ThreadSuspension
 PASSED : gc.ThreadSuspension
Running test : init.ErrorInInitializer
 PASSED : init.ErrorInInitializer
Running test : init.Other
 PASSED : init.Other
Running test : io.ArrayList
 PASSED : io.ArrayList
Running test : jni.LoadLibrary
 PASSED : jni.LoadLibrary
Running test : outofmemory.Double
 PASSED : outofmemory.Double
Running test : outofmemory.Int
 PASSED : outofmemory.Int
Running test : outofmemory.Plain
 PASSED : outofmemory.Plain
Running test : outofmemory.Ref
 PASSED : outofmemory.Ref
Running test : outofmemory.Throw
 PASSED : outofmemory.Throw
Running test : outofmemory.Vector
 PASSED : outofmemory.Vector
Running test : outofmemory.VectorDouble
 PASSED : outofmemory.VectorDouble
Running test : outofmemory.VectorInt
 PASSED : outofmemory.VectorInt
Running test : outofmemory.VectorRef
 PASSED : outofmemory.VectorRef
Running test : perf.CreateManyExceptions
 PASSED : perf.CreateManyExceptions
Running test : perf.CreateManyExceptions_depth
 PASSED : perf.CreateManyExceptions_depth
Running test : perf.MultiThreadsSimple
 PASSED : perf.MultiThreadsSimple
Running test : perf.SeveralThreads
 PASSED : perf.SeveralThreads
Running test : perf.StressCornerSize
 PASSED : perf.StressCornerSize
Running test : perf.StressCornerSize_a
 PASSED : perf.StressCornerSize_a
Running test : perf.ThrowMany
 PASSED : perf.ThrowMany
Running test : perf.ThrowManyExceptions
 PASSED : perf.ThrowManyExceptions
Running test : perf.ThrowManyExceptions_depth
 PASSED : perf.ThrowManyExceptions_depth
Running test : perf.ThrowMany_depth
 PASSED : perf.ThrowMany_depth
Running test : reflect.GetMethod
 PASSED : reflect.GetMethod
Running test : shutdown.TestDaemonOnWait
 PASSED : shutdown.TestDaemonOnWait
Running test : shutdown.TestFatalError
 PASSED : shutdown.TestFatalError
Running test : shutdown.TestInterrupt
 PASSED : shutdown.TestInterrupt
Running test : shutdown.TestLock
 PASSED : shutdown.TestLock
Running test : stress.BigStringBuffer
 PASSED : stress.BigStringBuffer
Running test : stress.Finalizer
 PASSED : stress.Finalizer
Running test : stress.Intern
 PASSED : stress.Intern
Running test : stress.Mix
 PASSED : stress.Mix
Running test : stress.Stack
 PASSED : stress.Stack
Running test : stress.Sync
 PASSED : stress.Sync
Running test : stress.Threads
 PASSED : stress.Threads
Running test : stress.Vector
 PASSED : stress.Vector
Running test : stress.WeakHashmapTest
 PASSED : stress.WeakHashmapTest
Running test : thread.ExitShutdownHook
 PASSED : thread.ExitShutdownHook
Running test : thread.InfiniteFinalizer
 PASSED : thread.InfiniteFinalizer
Running test : thread.InterruptWait
 PASSED : thread.InterruptWait
Running test : thread.ManyThreadsTest
*** FAILED **** : thread.ManyThreadsTest (0 res code)
Running test : thread.Sleep
 PASSED : thread.Sleep
Running test : thread.ThreadInterrupt
 PASSED : thread.ThreadInterrupt
Running test : thread.ThreadOOM
 PASSED : thread.ThreadOOM
Running test : util.Date
 PASSED : util.Date
Running test : util.DoPriveleged
 PASSED : util.DoPriveleged
Running test : util.Prop
 PASSED : util.Prop
Running test : util.StringIntern
 PASSED : util.StringIntern
Please find test classes and results at C:\cruise\trunk\cc\projects\drlvm\trunk\build\win_ia32_msvc_debug\semis/vm/_smoke.tests/

        ==================================
        Smoke tests on Server mode JIT
        ==================================
        

Using exclude file = C:\cruise\trunk\cc\projects\drlvm\trunk\build\make\excludes\exclude.drlvm_smoke.windows.x86.srv   
        
Check.java
PerfCheck.java

# HARMONY-2977
io/Integers.java

# HARMONY-3731
StackTest.java

# HARMONY-3917
gc/PhantomReferenceTest.java
gc/WeakReferenceTest.java

                  
Running test : Hi
 PASSED : Hi
Running test : classloader.ClassTestGetDeclaringClass
 PASSED : classloader.ClassTestGetDeclaringClass
Running test : classloader.ExceptionInInitializerTest
 PASSED : classloader.ExceptionInInitializerTest
Running test : classloader.LogLoader
 PASSED : classloader.LogLoader
Running test : classloader.NotFound
 PASSED : classloader.NotFound
Running test : classloader.StressLoader
 PASSED : classloader.StressLoader
Running test : exception.ExceptionStackTest
 PASSED : exception.ExceptionStackTest
Running test : exception.FinalizeStackTest
 PASSED : exception.FinalizeStackTest
Running test : exception.NPE
 PASSED : exception.NPE
Running test : gc.FinAlloc
 PASSED : gc.FinAlloc
Running test : gc.Finalizer
 PASSED : gc.Finalizer
Running test : gc.Force
 PASSED : gc.Force
Running test : gc.Fragment
 PASSED : gc.Fragment
Running test : gc.Free
 PASSED : gc.Free
Running test : gc.LOS
 PASSED : gc.LOS
Running test : gc.List
 PASSED : gc.List
Running test : gc.Mark
 PASSED : gc.Mark
Running test : gc.MultiThreads
 PASSED : gc.MultiThreads
Running test : gc.NPE
 PASSED : gc.NPE
Running test : gc.PhantomReferenceQueueTest
 PASSED : gc.PhantomReferenceQueueTest
Running test : gc.RefRemove
 PASSED : gc.RefRemove
Running test : gc.RunFinalizersOnExitTest
 PASSED : gc.RunFinalizersOnExitTest
Running test : gc.StressRef
 PASSED : gc.StressRef
Running test : gc.SynchronizedFinalizersTest
 PASSED : gc.SynchronizedFinalizersTest
Running test : gc.ThreadSuspension
 PASSED : gc.ThreadSuspension
Running test : init.ErrorInInitializer
 PASSED : init.ErrorInInitializer
Running test : init.Other
 PASSED : init.Other
Running test : io.ArrayList
 PASSED : io.ArrayList
Running test : jni.LoadLibrary
 PASSED : jni.LoadLibrary
Running test : outofmemory.Double
 PASSED : outofmemory.Double
Running test : outofmemory.Int
 PASSED : outofmemory.Int
Running test : outofmemory.Plain
 PASSED : outofmemory.Plain
Running test : outofmemory.Ref
 PASSED : outofmemory.Ref
Running test : outofmemory.Throw
 PASSED : outofmemory.Throw
Running test : outofmemory.Vector
 PASSED : outofmemory.Vector
Running test : outofmemory.VectorDouble
 PASSED : outofmemory.VectorDouble
Running test : outofmemory.VectorInt
 PASSED : outofmemory.VectorInt
Running test : outofmemory.VectorRef
 PASSED : outofmemory.VectorRef
Running test : perf.CreateManyExceptions
 PASSED : perf.CreateManyExceptions
Running test : perf.CreateManyExceptions_depth
 PASSED : perf.CreateManyExceptions_depth
Running test : perf.MultiThreadsSimple
 PASSED : perf.MultiThreadsSimple
Running test : perf.SeveralThreads
 PASSED : perf.SeveralThreads
Running test : perf.StressCornerSize
 PASSED : perf.StressCornerSize
Running test : perf.StressCornerSize_a
 PASSED : perf.StressCornerSize_a
Running test : perf.ThrowMany
 PASSED : perf.ThrowMany
Running test : perf.ThrowManyExceptions
 PASSED : perf.ThrowManyExceptions
Running test : perf.ThrowManyExceptions_depth
 PASSED : perf.ThrowManyExceptions_depth
Running test : perf.ThrowMany_depth
 PASSED : perf.ThrowMany_depth
Running test : reflect.GetMethod
 PASSED : reflect.GetMethod
Running test : shutdown.TestDaemonOnWait
 PASSED : shutdown.TestDaemonOnWait
Running test : shutdown.TestFatalError
 PASSED : shutdown.TestFatalError
Running test : shutdown.TestInterrupt
 PASSED : shutdown.TestInterrupt
Running test : shutdown.TestLock
 PASSED : shutdown.TestLock
Running test : stress.BigStringBuffer
 PASSED : stress.BigStringBuffer
Running test : stress.Finalizer
 PASSED : stress.Finalizer
Running test : stress.Intern
 PASSED : stress.Intern
Running test : stress.Mix
 PASSED : stress.Mix
Running test : stress.Stack
 PASSED : stress.Stack
Running test : stress.Sync
 PASSED : stress.Sync
Running test : stress.Threads
 PASSED : stress.Threads
Running test : stress.Vector
 PASSED : stress.Vector
Running test : stress.WeakHashmapTest
 PASSED : stress.WeakHashmapTest
Running test : thread.ExitShutdownHook
 PASSED : thread.ExitShutdownHook
Running test : thread.InfiniteFinalizer
 PASSED : thread.InfiniteFinalizer
Running test : thread.InterruptWait
 PASSED : thread.InterruptWait
Running test : thread.ManyThreadsTest
*** FAILED **** : thread.ManyThreadsTest (1 res code)
Running test : thread.Sleep
 PASSED : thread.Sleep
Running test : thread.ThreadInterrupt
 PASSED : thread.ThreadInterrupt
Running test : thread.ThreadOOM
 PASSED : thread.ThreadOOM
Running test : util.Date
 PASSED : util.Date
Running test : util.DoPriveleged
 PASSED : util.DoPriveleged
Running test : util.Prop
 PASSED : util.Prop
Running test : util.StringIntern
 PASSED : util.StringIntern
Please find test classes and results at C:\cruise\trunk\cc\projects\drlvm\trunk\build\win_ia32_msvc_debug\semis/vm/_smoke.tests/
The test report is in C:\cruise\trunk\cc\projects\drlvm\trunk\build\win_ia32_msvc_debug\semis\vm\_smoke.tests\reports\html\index.html
Note: Some input files use or override a deprecated API.
Note: Recompile with -Xlint:deprecation for details.
Note: C:\cruise\trunk\cc\projects\drlvm\trunk\vm\tests\kernel\java\lang\ClassAnnotationsTest.java uses unchecked or unsafe operations.
Note: Recompile with -Xlint:unchecked for details.

        ==================================
        Run kernel tests using interpreter
        ==================================
        

Using exclude file = C:\cruise\trunk\cc\projects\drlvm\trunk\build\make\excludes\exclude.drlvm_kernel.windows.x86.int   
        
## These tests are too slow
java/lang/RuntimeAdditionalTest*.java

## These tests are unstable and hang often
java/lang/RuntimeAdditionalTest11.java
java/lang/RuntimeAdditionalTest34.java
java/lang/RuntimeAdditionalTest39.java
java/lang/RuntimeAdditionalTest40.java
java/lang/RuntimeAdditionalTest41.java
java/lang/RuntimeAdditionalTest42.java

                  
The GC did not provide gc_add_weak_root_set_entry()

        ==================================
        Run kernel tests using jitrino.JET
        ==================================
        

Using exclude file = C:\cruise\trunk\cc\projects\drlvm\trunk\build\make\excludes\exclude.drlvm_kernel.windows.x86.jet   
        
## These tests are too slow
java/lang/RuntimeAdditionalTest*.java

## These tests are unstable and hang often
java/lang/RuntimeAdditionalTest11.java
java/lang/RuntimeAdditionalTest34.java
java/lang/RuntimeAdditionalTest39.java
java/lang/RuntimeAdditionalTest40.java
java/lang/RuntimeAdditionalTest41.java
java/lang/RuntimeAdditionalTest42.java

                  
The GC did not provide gc_add_weak_root_set_entry()

        ==================================
        Run kernel tests using Client mode JIT (default)
        ==================================
        

Using exclude file = C:\cruise\trunk\cc\projects\drlvm\trunk\build\make\excludes\exclude.drlvm_kernel.windows.x86.jit   
        
## These tests are too slow
java/lang/RuntimeAdditionalTest*.java

## These tests are unstable and hang often
java/lang/RuntimeAdditionalTest11.java
java/lang/RuntimeAdditionalTest34.java
java/lang/RuntimeAdditionalTest39.java
java/lang/RuntimeAdditionalTest40.java
java/lang/RuntimeAdditionalTest41.java
java/lang/RuntimeAdditionalTest42.java

# HARMONY-2453 
java/lang/SystemTest.java

                  
The GC did not provide gc_add_weak_root_set_entry()

        ==================================
        Run kernel tests using jitrino.OPT
        ==================================
        

Using exclude file = C:\cruise\trunk\cc\projects\drlvm\trunk\build\make\excludes\exclude.drlvm_kernel.windows.x86.opt   
        
## These tests are too slow
java/lang/RuntimeAdditionalTest*.java

## These tests are unstable and hang often
java/lang/RuntimeAdditionalTest11.java
java/lang/RuntimeAdditionalTest34.java
java/lang/RuntimeAdditionalTest39.java
java/lang/RuntimeAdditionalTest40.java
java/lang/RuntimeAdditionalTest41.java
java/lang/RuntimeAdditionalTest42.java

                  
The GC did not provide gc_add_weak_root_set_entry()

        ==================================
        Run kernel tests using Server mode JIT
        ==================================
        

Using exclude file = C:\cruise\trunk\cc\projects\drlvm\trunk\build\make\excludes\exclude.drlvm_kernel.windows.x86.srv   
        
## These tests are too slow
java/lang/RuntimeAdditionalTest*.java

## These tests are unstable and hang often
java/lang/RuntimeAdditionalTest11.java
java/lang/RuntimeAdditionalTest34.java
java/lang/RuntimeAdditionalTest39.java
java/lang/RuntimeAdditionalTest40.java
java/lang/RuntimeAdditionalTest41.java
java/lang/RuntimeAdditionalTest42.java

# HARMONY-2453 
java/lang/SystemTest.java

                  
The GC did not provide gc_add_weak_root_set_entry()
  ***************************
  *** Kernel tests status ***
  ***************************
      interpreter PASSED
      jitrino.JET PASSED
      Client mode JIT (default) PASSED
      jitrino.OPT PASSED
      Server mode JIT PASSED
Please find detailed results under C:\cruise\trunk\cc\projects\drlvm\trunk\build\win_ia32_msvc_debug\semis\kernel.tests/reports directory.

***********************************************************
Unit Tests: (4338)
        
error: test thread.ManyThreadsTest_int
error: test thread.ManyThreadsTest_jet
error: test thread.ManyThreadsTest_jit
error: test thread.ManyThreadsTest_opt
error: test thread.ManyThreadsTest_srv
Unit Test Error Details:	(5)
                
Test: testClass: thread.ManyThreadsTest_int
Test: testClass: thread.ManyThreadsTest_jet
Test: testClass: thread.ManyThreadsTest_jit
Test: testClass: thread.ManyThreadsTest_opt
Test: testClass: thread.ManyThreadsTest_srv

***********************************************************
Modifications since last successful build:	(113)
            
modified tonywu  /harmony/enhanced/classlib/trunk/modules/beans/src/main/java/java/beans/Introspector.java 07/17/2007 08:26:29 optimize for multi-threads
modified tonywu  /harmony/enhanced/classlib/trunk/modules/beans/src/main/java/java/beans/PropertyEditorManager.java 07/17/2007 08:26:29 optimize for multi-threads
modified tonywu  /harmony/enhanced/classlib/trunk/modules/beans/src/main/java/java/beans/Beans.java 07/17/2007 08:26:29 optimize for multi-threads
deleted wjwashburn  /harmony/enhanced/drlvm/trunk/vm/thread/src/thread_helpers_ipf.c 07/17/2007 02:32:35 Harmony-3985:  this is general cleanup of thread data structs andis a precursor to fixing thread lifecycle
deleted wjwashburn  /harmony/enhanced/drlvm/trunk/vm/thread/src/thread_ti_others.c 07/17/2007 02:32:35 Harmony-3985:  this is general cleanup of thread data structs andis a precursor to fixing thread lifecycle
modified wjwashburn  /harmony/enhanced/drlvm/trunk/vm/thread/src/thread_native_condvar.c 07/17/2007 02:32:35 Harmony-3985:  this is general cleanup of thread data structs andis a precursor to fixing thread lifecycle
modified wjwashburn  /harmony/enhanced/drlvm/trunk/vm/port/src/lil/em64t/pim/m2n_em64t.cpp 07/17/2007 02:32:35 Harmony-3985:  this is general cleanup of thread data structs andis a precursor to fixing thread lifecycle
modified wjwashburn  /harmony/enhanced/drlvm/trunk/vm/vmcore/src/jvmti/jvmti_thread.cpp 07/17/2007 02:32:35 Harmony-3985:  this is general cleanup of thread data structs andis a precursor to fixing thread lifecycle
modified wjwashburn  /harmony/enhanced/drlvm/trunk/vm/vmcore/src/jvmti/jvmti_pop_frame.cpp 07/17/2007 02:32:35 Harmony-3985:  this is general cleanup of thread data structs andis a precursor to fixing thread lifecycle
modified wjwashburn  /harmony/enhanced/drlvm/trunk/vm/vmcore/include/native_stack.h 07/17/2007 02:32:35 Harmony-3985:  this is general cleanup of thread data structs andis a precursor to fixing thread lifecycle
modified wjwashburn  /harmony/enhanced/drlvm/trunk/vm/tests/unit/thread/test_ti_local_storage.c 07/17/2007 02:32:35 Harmony-3985:  this is general cleanup of thread data structs andis a precursor to fixing thread lifecycle
added wjwashburn  /harmony/enhanced/drlvm/trunk/vm/vmcore/src/thread/thread_java_basic.cpp 07/17/2007 02:32:35 Harmony-3985:  this is general cleanup of thread data structs andis a precursor to fixing thread lifecycle
modified wjwashburn  /harmony/enhanced/drlvm/trunk/vm/tests/unit/thread/test_java_identify.c 07/17/2007 02:32:35 Harmony-3985:  this is general cleanup of thread data structs andis a precursor to fixing thread lifecycle
modified wjwashburn  /harmony/enhanced/drlvm/trunk/vm/vmcore/src/util/ipf/base/ini_ipf.cpp 07/17/2007 02:32:35 Harmony-3985:  this is general cleanup of thread data structs andis a precursor to fixing thread lifecycle
modified wjwashburn  /harmony/enhanced/drlvm/trunk/vm/vmcore/include/exceptions_type.h 07/17/2007 02:32:35 Harmony-3985:  this is general cleanup of thread data structs andis a precursor to fixing thread lifecycle
modified wjwashburn  /harmony/enhanced/drlvm/trunk/vm/vmcore/src/jvmti/jvmti_event.cpp 07/17/2007 02:32:35 Harmony-3985:  this is general cleanup of thread data structs andis a precursor to fixing thread lifecycle
modified wjwashburn  /harmony/enhanced/drlvm/trunk/vm/thread/src/hythr.exp 07/17/2007 02:32:35 Harmony-3985:  this is general cleanup of thread data structs andis a precursor to fixing thread lifecycle
deleted wjwashburn  /harmony/enhanced/drlvm/trunk/vm/thread/src/thread_java_suspend.c 07/17/2007 02:32:35 Harmony-3985:  this is general cleanup of thread data structs andis a precursor to fixing thread lifecycle
added wjwashburn  /harmony/enhanced/drlvm/trunk/vm/vmcore/src/thread/thread_java_iterator.cpp 07/17/2007 02:32:35 Harmony-3985:  this is general cleanup of thread data structs andis a precursor to fixing thread lifecycle
modified wjwashburn  /harmony/enhanced/drlvm/trunk/build/make/targets/common_vm.xml 07/17/2007 02:32:35 Harmony-3985:  this is general cleanup of thread data structs andis a precursor to fixing thread lifecycle
modified wjwashburn  /harmony/enhanced/drlvm/trunk/vm/thread/src/thread_native_basic.c 07/17/2007 02:32:35 Harmony-3985:  this is general cleanup of thread data structs andis a precursor to fixing thread lifecycle
modified wjwashburn  /harmony/enhanced/drlvm/trunk/vm/vmcore/src/util/linux/signals_ia32.cpp 07/17/2007 02:32:35 Harmony-3985:  this is general cleanup of thread data structs andis a precursor to fixing thread lifecycle
added wjwashburn  /harmony/enhanced/drlvm/trunk/vm/vmcore/src/thread/thread_java_interrupt.cpp 07/17/2007 02:32:35 Harmony-3985:  this is general cleanup of thread data structs andis a precursor to fixing thread lifecycle
added wjwashburn  /harmony/enhanced/drlvm/trunk/vm/vmcore/src/thread/thread_java_park.cpp 07/17/2007 02:32:35 Harmony-3985:  this is general cleanup of thread data structs andis a precursor to fixing thread lifecycle
modified wjwashburn  /harmony/enhanced/drlvm/trunk/vm/tests/unit/thread/test_native_fat_monitor.c 07/17/2007 02:32:35 Harmony-3985:  this is general cleanup of thread data structs andis a precursor to fixing thread lifecycle
deleted wjwashburn  /harmony/enhanced/drlvm/trunk/vm/thread/src/thread_ti_instr.c 07/17/2007 02:32:35 Harmony-3985:  this is general cleanup of thread data structs andis a precursor to fixing thread lifecycle
added wjwashburn  /harmony/enhanced/drlvm/trunk/vm/vmcore/src/thread/helpers/thread_helpers_ipf.cpp 07/17/2007 02:32:35 Harmony-3985:  this is general cleanup of thread data structs andis a precursor to fixing thread lifecycle
deleted wjwashburn  /harmony/enhanced/drlvm/trunk/vm/thread/src/thread_java_attrs.c 07/17/2007 02:32:35 Harmony-3985:  this is general cleanup of thread data structs andis a precursor to fixing thread lifecycle
added wjwashburn  /harmony/enhanced/drlvm/trunk/vm/vmcore/src/thread/helpers/thread_helpers.cpp 07/17/2007 02:32:35 Harmony-3985:  this is general cleanup of thread data structs andis a precursor to fixing thread lifecycle
modified wjwashburn  /harmony/enhanced/drlvm/trunk/vm/vmcore/include/thread_manager.h 07/17/2007 02:32:35 Harmony-3985:  this is general cleanup of thread data structs andis a precursor to fixing thread lifecycle
modified wjwashburn  /harmony/enhanced/drlvm/trunk/vm/tests/unit/thread/test_ti_instrum.c 07/17/2007 02:32:35 Harmony-3985:  this is general cleanup of thread data structs andis a precursor to fixing thread lifecycle
added wjwashburn  /harmony/enhanced/drlvm/trunk/vm/vmcore/src/thread/thread_ti_monitors.cpp 07/17/2007 02:32:35 Harmony-3985:  this is general cleanup of thread data structs andis a precursor to fixing thread lifecycle
deleted wjwashburn  /harmony/enhanced/drlvm/trunk/vm/thread/src/thread_helpers.cpp 07/17/2007 02:32:35 Harmony-3985:  this is general cleanup of thread data structs andis a precursor to fixing thread lifecycle
modified wjwashburn  /harmony/enhanced/drlvm/trunk/vm/vmcore/src/jvmti/jvmti_break_intf.cpp 07/17/2007 02:32:35 Harmony-3985:  this is general cleanup of thread data structs andis a precursor to fixing thread lifecycle
modified wjwashburn  /harmony/enhanced/drlvm/trunk/vm/vmcore/include/Class.h 07/17/2007 02:32:35 Harmony-3985:  this is general cleanup of thread data structs andis a precursor to fixing thread lifecycle
deleted wjwashburn  /harmony/enhanced/drlvm/trunk/vm/thread/src/thread_ti_monitors.c 07/17/2007 02:32:35 Harmony-3985:  this is general cleanup of thread data structs andis a precursor to fixing thread lifecycle
modified wjwashburn  /harmony/enhanced/drlvm/trunk/vm/vmcore/src/thread/thread_generic.cpp 07/17/2007 02:32:35 Harmony-3985:  this is general cleanup of thread data structs andis a precursor to fixing thread lifecycle
modified wjwashburn  /harmony/enhanced/drlvm/trunk/vm/thread/src/thread_native_tls.c 07/17/2007 02:32:35 Harmony-3985:  this is general cleanup of thread data structs andis a precursor to fixing thread lifecycle
modified wjwashburn  /harmony/enhanced/drlvm/trunk/vm/include/open/hythread.h 07/17/2007 02:32:35 Harmony-3985:  this is general cleanup of thread data structs andis a precursor to fixing thread lifecycle
modified wjwashburn  /harmony/enhanced/drlvm/trunk/vm/vmcore/include/vm_core_types.h 07/17/2007 02:32:35 Harmony-3985:  this is general cleanup of thread data structs andis a precursor to fixing thread lifecycle
added wjwashburn  /harmony/enhanced/drlvm/trunk/vm/vmcore/src/thread/thread_ti_timing.cpp 07/17/2007 02:32:35 Harmony-3985:  this is general cleanup of thread data structs andis a precursor to fixing thread lifecycle
modified wjwashburn  /harmony/enhanced/drlvm/trunk/vm/thread/src/thread_private.h 07/17/2007 02:32:35 Harmony-3985:  this is general cleanup of thread data structs andis a precursor to fixing thread lifecycle
modified wjwashburn  /harmony/enhanced/drlvm/trunk/vm/vmcore/src/jvmti/jvmti.cpp 07/17/2007 02:32:35 Harmony-3985:  this is general cleanup of thread data structs andis a precursor to fixing thread lifecycle
modified wjwashburn  /harmony/enhanced/drlvm/trunk/vm/vmcore/src/exception/exceptions_jit.cpp 07/17/2007 02:32:35 Harmony-3985:  this is general cleanup of thread data structs andis a precursor to fixing thread lifecycle
deleted wjwashburn  /harmony/enhanced/drlvm/trunk/vm/thread/src/thread_ti_timing.c 07/17/2007 02:32:35 Harmony-3985:  this is general cleanup of thread data structs andis a precursor to fixing thread lifecycle
modified wjwashburn  /harmony/enhanced/drlvm/trunk/vm/tests/unit/thread/test_java_basic.c 07/17/2007 02:32:35 Harmony-3985:  this is general cleanup of thread data structs andis a precursor to fixing thread lifecycle
added wjwashburn  /harmony/enhanced/drlvm/trunk/vm/vmcore/src/thread/thread_ti_instr.cpp 07/17/2007 02:32:35 Harmony-3985:  this is general cleanup of thread data structs andis a precursor to fixing thread lifecycle
modified wjwashburn  /harmony/enhanced/drlvm/trunk/build/make/components/vm/hythr.xml 07/17/2007 02:32:35 Harmony-3985:  this is general cleanup of thread data structs andis a precursor to fixing thread lifecycle
modified wjwashburn  /harmony/enhanced/drlvm/trunk/vm/include/jvmti_support.h 07/17/2007 02:32:35 Harmony-3985:  this is general cleanup of thread data structs andis a precursor to fixing thread lifecycle
modified wjwashburn  /harmony/enhanced/drlvm/trunk/vm/tests/unit/thread/test_native_suspend.c 07/17/2007 02:32:35 Harmony-3985:  this is general cleanup of thread data structs andis a precursor to fixing thread lifecycle
added wjwashburn  /harmony/enhanced/drlvm/trunk/vm/vmcore/src/thread/thread_java_attrs.cpp 07/17/2007 02:32:35 Harmony-3985:  this is general cleanup of thread data structs andis a precursor to fixing thread lifecycle
added wjwashburn  /harmony/enhanced/drlvm/trunk/vm/vmcore/src/thread/thread_ti_others.cpp 07/17/2007 02:32:35 Harmony-3985:  this is general cleanup of thread data structs andis a precursor to fixing thread lifecycle
modified wjwashburn  /harmony/enhanced/drlvm/trunk/build/make/targets/cunit.test.xml 07/17/2007 02:32:35 Harmony-3985:  this is general cleanup of thread data structs andis a precursor to fixing thread lifecycle
modified wjwashburn  /harmony/enhanced/drlvm/trunk/vm/include/open/hythread_ext.h 07/17/2007 02:32:35 Harmony-3985:  this is general cleanup of thread data structs andis a precursor to fixing thread lifecycle
modified wjwashburn  /harmony/enhanced/drlvm/trunk/vm/tests/unit/thread/test_java_ptr_conv.c 07/17/2007 02:32:35 Harmony-3985:  this is general cleanup of thread data structs andis a precursor to fixing thread lifecycle
deleted wjwashburn  /harmony/enhanced/drlvm/trunk/vm/thread/src/thread_java_interrupt.c 07/17/2007 02:32:35 Harmony-3985:  this is general cleanup of thread data structs andis a precursor to fixing thread lifecycle
modified wjwashburn  /harmony/enhanced/drlvm/trunk/vm/vmcore/src/thread/thread_dump.cpp 07/17/2007 02:32:35 Harmony-3985:  this is general cleanup of thread data structs andis a precursor to fixing thread lifecycle
modified wjwashburn  /harmony/enhanced/drlvm/trunk/vm/include/open/thread_externals.h 07/17/2007 02:32:35 Harmony-3985:  this is general cleanup of thread data structs andis a precursor to fixing thread lifecycle
modified wjwashburn  /harmony/enhanced/drlvm/trunk/vm/vmcore/src/jit/ini.cpp 07/17/2007 02:32:35 Harmony-3985:  this is general cleanup of thread data structs andis a precursor to fixing thread lifecycle
modified wjwashburn  /harmony/enhanced/drlvm/trunk/vm/thread/src/thread_init.c 07/17/2007 02:32:35 Harmony-3985:  this is general cleanup of thread data structs andis a precursor to fixing thread lifecycle
modified wjwashburn  /harmony/enhanced/drlvm/trunk/vm/interpreter/src/interpreter_ti.cpp 07/17/2007 02:32:35 Harmony-3985:  this is general cleanup of thread data structs andis a precursor to fixing thread lifecycle
modified wjwashburn  /harmony/enhanced/drlvm/trunk/vm/vmcore/src/jvmti/jvmti_roots.cpp 07/17/2007 02:32:35 Harmony-3985:  this is general cleanup of thread data structs andis a precursor to fixing thread lifecycle
modified wjwashburn  /harmony/enhanced/drlvm/trunk/vm/vmcore/src/kernel_classes/native/org_apache_harmony_lang_management_ThreadMXBeanImpl.cpp 07/17/2007 02:32:35 Harmony-3985:  this is general cleanup of thread data structs andis a precursor to fixing thread lifecycle
added wjwashburn  /harmony/enhanced/drlvm/trunk/vm/vmcore/src/thread/thread_java_monitors.cpp 07/17/2007 02:32:35 Harmony-3985:  this is general cleanup of thread data structs andis a precursor to fixing thread lifecycle
modified wjwashburn  /harmony/enhanced/drlvm/trunk/vm/interpreter/src/interpreter.cpp 07/17/2007 02:32:35 Harmony-3985:  this is general cleanup of thread data structs andis a precursor to fixing thread lifecycle
added wjwashburn  /harmony/enhanced/drlvm/trunk/vm/vmcore/src/kernel_classes/javasrc/org/apache/harmony/drlvm/thread/ThreadHelper.java 07/17/2007 02:32:35 Harmony-3985:  this is general cleanup of thread data structs andis a precursor to fixing thread lifecycle
added wjwashburn  /harmony/enhanced/drlvm/trunk/vm/vmcore/src/thread/thread_private.h 07/17/2007 02:32:35 Harmony-3985:  this is general cleanup of thread data structs andis a precursor to fixing thread lifecycle
deleted wjwashburn  /harmony/enhanced/drlvm/trunk/vm/thread/src/thread_java_monitors.c 07/17/2007 02:32:35 Harmony-3985:  this is general cleanup of thread data structs andis a precursor to fixing thread lifecycle
modified wjwashburn  /harmony/enhanced/drlvm/trunk/vm/vmcore/src/jit/compile.cpp 07/17/2007 02:32:35 Harmony-3985:  this is general cleanup of thread data structs andis a precursor to fixing thread lifecycle
modified wjwashburn  /harmony/enhanced/drlvm/trunk/vm/vmcore/src/util/em64t/base/native_stack_em64t.cpp 07/17/2007 02:32:35 Harmony-3985:  this is general cleanup of thread data structs andis a precursor to fixing thread lifecycle
modified wjwashburn  /harmony/enhanced/drlvm/trunk/vm/thread/src/win/os_thread.c 07/17/2007 02:32:35 Harmony-3985:  this is general cleanup of thread data structs andis a precursor to fixing thread lifecycle
modified wjwashburn  /harmony/enhanced/drlvm/trunk/vm/tests/unit/thread/test_ti_state.c 07/17/2007 02:32:35 Harmony-3985:  this is general cleanup of thread data structs andis a precursor to fixing thread lifecycle
modified wjwashburn  /harmony/enhanced/drlvm/trunk/vm/vmcore/src/gc/root_set_enum_common.cpp 07/17/2007 02:32:35 Harmony-3985:  this is general cleanup of thread data structs andis a precursor to fixing thread lifecycle
modified wjwashburn  /harmony/enhanced/drlvm/trunk/vm/thread/src/linux/os_thread.c 07/17/2007 02:32:35 Harmony-3985:  this is general cleanup of thread data structs andis a precursor to fixing thread lifecycle
modified wjwashburn  /harmony/enhanced/drlvm/trunk/vm/thread/src/hythr.def 07/17/2007 02:32:35 Harmony-3985:  this is general cleanup of thread data structs andis a precursor to fixing thread lifecycle
added wjwashburn  /harmony/enhanced/drlvm/trunk/vm/vmcore/src/thread/helpers 07/17/2007 02:32:35 Harmony-3985:  this is general cleanup of thread data structs andis a precursor to fixing thread lifecycle
modified wjwashburn  /harmony/enhanced/drlvm/trunk/vm/vmcore/src/thread/lock_manager.cpp 07/17/2007 02:32:35 Harmony-3985:  this is general cleanup of thread data structs andis a precursor to fixing thread lifecycle
modified wjwashburn  /harmony/enhanced/drlvm/trunk/vm/thread/src/thread_native_fat_monitor.c 07/17/2007 02:32:35 Harmony-3985:  this is general cleanup of thread data structs andis a precursor to fixing thread lifecycle
modified wjwashburn  /harmony/enhanced/drlvm/trunk/vm/tests/unit/thread/utils/thread_unit_test_utils.c 07/17/2007 02:32:35 Harmony-3985:  this is general cleanup of thread data structs andis a precursor to fixing thread lifecycle
modified wjwashburn  /harmony/enhanced/drlvm/trunk/vm/tests/unit/thread/test_native_basic.c 07/17/2007 02:32:35 Harmony-3985:  this is general cleanup of thread data structs andis a precursor to fixing thread lifecycle
modified wjwashburn  /harmony/enhanced/drlvm/trunk/vm/include/interpreter_exports.h 07/17/2007 02:32:35 Harmony-3985:  this is general cleanup of thread data structs andis a precursor to fixing thread lifecycle
modified wjwashburn  /harmony/enhanced/drlvm/trunk/vm/interpreter/src/interp_exports.cpp 07/17/2007 02:32:35 Harmony-3985:  this is general cleanup of thread data structs andis a precursor to fixing thread lifecycle
deleted wjwashburn  /harmony/enhanced/drlvm/trunk/vm/thread/src/thread_java_iterator.c 07/17/2007 02:32:35 Harmony-3985:  this is general cleanup of thread data structs andis a precursor to fixing thread lifecycle
deleted wjwashburn  /harmony/enhanced/drlvm/trunk/vm/thread/javasrc 07/17/2007 02:32:35 Harmony-3985:  this is general cleanup of thread data structs andis a precursor to fixing thread lifecycle
modified wjwashburn  /harmony/enhanced/drlvm/trunk/vm/tests/unit/thread/utils/thread_unit_test_utils.h 07/17/2007 02:32:35 Harmony-3985:  this is general cleanup of thread data structs andis a precursor to fixing thread lifecycle
deleted wjwashburn  /harmony/enhanced/drlvm/trunk/vm/thread/src/thread_java_park.c 07/17/2007 02:32:35 Harmony-3985:  this is general cleanup of thread data structs andis a precursor to fixing thread lifecycle
modified wjwashburn  /harmony/enhanced/drlvm/trunk/vm/vmcore/src/util/win/ia32_em64t/nt_exception_filter_common.cpp 07/17/2007 02:32:35 Harmony-3985:  this is general cleanup of thread data structs andis a precursor to fixing thread lifecycle
modified wjwashburn  /harmony/enhanced/drlvm/trunk/vm/tests/unit/thread/test_ti_monitor_info.c 07/17/2007 02:32:35 Harmony-3985:  this is general cleanup of thread data structs andis a precursor to fixing thread lifecycle
modified wjwashburn  /harmony/enhanced/drlvm/trunk/vm/thread/src/thread_native_interrupt.c 07/17/2007 02:32:35 Harmony-3985:  this is general cleanup of thread data structs andis a precursor to fixing thread lifecycle
modified wjwashburn  /harmony/enhanced/drlvm/trunk/vm/port/src/lil/ipf/pim/m2n_ipf.cpp 07/17/2007 02:32:35 Harmony-3985:  this is general cleanup of thread data structs andis a precursor to fixing thread lifecycle
modified wjwashburn  /harmony/enhanced/drlvm/trunk/vm/port/src/lil/ia32/pim/m2n_ia32.cpp 07/17/2007 02:32:35 Harmony-3985:  this is general cleanup of thread data structs andis a precursor to fixing thread lifecycle
modified wjwashburn  /harmony/enhanced/drlvm/trunk/vm/vmcore/src/jvmti/jvmti_stack.cpp 07/17/2007 02:32:35 Harmony-3985:  this is general cleanup of thread data structs andis a precursor to fixing thread lifecycle
modified wjwashburn  /harmony/enhanced/drlvm/trunk/vm/vmcore/src/thread/thread_manager.cpp 07/17/2007 02:32:35 Harmony-3985:  this is general cleanup of thread data structs andis a precursor to fixing thread lifecycle
modified wjwashburn  /harmony/enhanced/drlvm/trunk/vm/vmcore/src/init/vm_init.cpp 07/17/2007 02:32:35 Harmony-3985:  this is general cleanup of thread data structs andis a precursor to fixing thread lifecycle
modified wjwashburn  /harmony/enhanced/drlvm/trunk/vm/vmcore/src/object/object_handles.cpp 07/17/2007 02:32:35 Harmony-3985:  this is general cleanup of thread data structs andis a precursor to fixing thread lifecycle
modified wjwashburn  /harmony/enhanced/drlvm/trunk/vm/include/open/ti_thread.h 07/17/2007 02:32:35 Harmony-3985:  this is general cleanup of thread data structs andis a precursor to fixing thread lifecycle
modified wjwashburn  /harmony/enhanced/drlvm/trunk/vm/vmcore/src/jvmti/jvmti_step.cpp 07/17/2007 02:32:35 Harmony-3985:  this is general cleanup of thread data structs andis a precursor to fixing thread lifecycle
modified wjwashburn  /harmony/enhanced/drlvm/trunk/vm/vmcore/src/util/ipf/base/native_stack_ipf.cpp 07/17/2007 02:32:35 Harmony-3985:  this is general cleanup of thread data structs andis a precursor to fixing thread lifecycle
modified wjwashburn  /harmony/enhanced/drlvm/trunk/vm/vmcore/src/util/ia32/base/native_stack_ia32.cpp 07/17/2007 02:32:35 Harmony-3985:  this is general cleanup of thread data structs andis a precursor to fixing thread lifecycle
deleted wjwashburn  /harmony/enhanced/drlvm/trunk/build/make/components/vm/jthread.xml 07/17/2007 02:32:35 Harmony-3985:  this is general cleanup of thread data structs andis a precursor to fixing thread lifecycle
added wjwashburn  /harmony/enhanced/drlvm/trunk/vm/vmcore/src/thread/thread_java_suspend.cpp 07/17/2007 02:32:35 Harmony-3985:  this is general cleanup of thread data structs andis a precursor to fixing thread lifecycle
modified wjwashburn  /harmony/enhanced/drlvm/trunk/build/make/deploy.xml 07/17/2007 02:32:35 Harmony-3985:  this is general cleanup of thread data structs andis a precursor to fixing thread lifecycle
modified wjwashburn  /harmony/enhanced/drlvm/trunk/vm/thread/src/thread_native_thin_monitor.c 07/17/2007 02:32:35 Harmony-3985:  this is general cleanup of thread data structs andis a precursor to fixing thread lifecycle
modified wjwashburn  /harmony/enhanced/drlvm/trunk/vm/tests/unit/thread/test_native_thin_monitor.c 07/17/2007 02:32:35 Harmony-3985:  this is general cleanup of thread data structs andis a precursor to fixing thread lifecycle
added wjwashburn  /harmony/enhanced/drlvm/trunk/vm/vmcore/src/kernel_classes/javasrc/org/apache/harmony/drlvm/thread 07/17/2007 02:32:35 Harmony-3985:  this is general cleanup of thread data structs andis a precursor to fixing thread lifecycle
deleted wjwashburn  /harmony/enhanced/drlvm/trunk/vm/thread/src/thread_java_basic.c 07/17/2007 02:32:35 Harmony-3985:  this is general cleanup of thread data structs andis a precursor to fixing thread lifecycle
modified wjwashburn  /harmony/enhanced/drlvm/trunk/vm/vmcore/include/jvmti_internal.h 07/17/2007 02:32:35 Harmony-3985:  this is general cleanup of thread data structs andis a precursor to fixing thread lifecycle
modified wjwashburn  /harmony/enhanced/drlvm/trunk/vm/vmcore/src/util/native_stack.cpp 07/17/2007 02:32:35 Harmony-3985:  this is general cleanup of thread data structs andis a precursor to fixing thread lifecycle
modified wjwashburn  /harmony/enhanced/drlvm/trunk/build/make/components/vm/vmcore.xml 07/17/2007 02:32:35 Harmony-3985:  this is general cleanup of thread data structs andis a precursor to fixing thread lifecycle
modified wjwashburn  /harmony/enhanced/drlvm/trunk/vm/include/open/jthread.h 07/17/2007 02:32:35 Harmony-3985:  this is general cleanup of thread data structs andis a precursor to fixing thread lifecycle
modified wjwashburn  /harmony/enhanced/drlvm/trunk/vm/vmcore/src/kernel_classes/native/java_lang_VMThreadManager.cpp 07/17/2007 02:32:35 Harmony-3985:  this is general cleanup of thread data structs andis a precursor to fixing thread lifecycle
modified wjwashburn  /harmony/enhanced/drlvm/trunk/vm/thread/src/thread_native_suspend.c 07/17/2007 02:32:35 Harmony-3985:  this is general cleanup of thread data structs andis a precursor to fixing thread lifecycle
modified wjwashburn  /harmony/enhanced/drlvm/trunk/vm/vmcore/include/vm_threads.h 07/17/2007 02:32:35 Harmony-3985:  this is general cleanup of thread data structs andis a precursor to fixing thread lifecycle

Mime
View raw message