harmony-alerts mailing list archives

Site index · List index
Message view « Date » · « Thread »
Top « Date » · « Thread »
From nom...@intel.com
Subject [build-test alert] BUILD FAILED Linux SUSE 9 64bit gcc debug: drlvm reg.test
Date Tue, 17 Jul 2007 09:54:57 GMT
BUILD FAILED:
	Ant Error Message:
/export/cruise/trunk/cc/projects/drlvm/trunk/build/make/build.xml:472: The following error
occurred while executing this line: /export/cruise/trunk/cc/projects/drlvm/trunk/build/make/targets/reg.test.run.xml:122:
There were test failures

Date of build:	07/17/2007 16:27:52
Time to build:	26 minutes 52 seconds
Last changed:	07/17/2007 16:18:07
Last log entry:	changed https -> http for antlr url to fix connectivity complaints

***********************************************************
Execution log (errors/warnings messages):	
Test org.apache.harmony.drlvm.tests.regression.h3225.PositiveJsrTest FAILED
Configuration:
     Hosting Java = 1.5.0_09 (Sun Microsystems Inc.)
    classlib root = /export/cruise/trunk/cc/projects/classlib/trunk
               os = Linux
             arch = em64t
              cxx = gcc
              cfg = debug
     svn revision = ${svn.revision}
       components = deploy

=====================================
DRLVM Regression Testing on platform: linux.x86_64
=====================================
        
The GC did not provide gc_add_weak_root_set_entry()
Running on JET
Running on OPT
Running on interpreter
The GC did not provide gc_add_weak_root_set_entry()
Running on OPT
Running on OPT
The GC did not provide gc_add_weak_root_set_entry()
========================================
Regression testing report was stored in:
========================================
/export/cruise/trunk/cc/projects/drlvm/trunk/build/lnx_em64t_gcc_debug/semis/reg.tests/reports/html
========================================

***********************************************************
Unit Tests: (81)
        
error: test org.apache.harmony.drlvm.tests.regression.h2103.Test
Unit Test Error Details:	(2)
                
Test: testClass: org.apache.harmony.drlvm.tests.regression.h2103.Testjava.lang.NoSuchMethodError:
org/apache/harmony/drlvm/tests/regression/h2103/SubClass.mth()I while resolving constant pool
entry at index 9 in class org/apache/harmony/drlvm/tests/regression/h2103/SupClass
	at org.apache.harmony.drlvm.tests.regression.h2103.Test.test(Test.java:20)
	at java.lang.reflect.VMReflection.invokeMethod(VMReflection.java)


***********************************************************
Modifications since last successful build:	(2)
            
modified varlax  /harmony/enhanced/drlvm/trunk/build/make/win.properties 07/17/2007 16:18:07
changed https -> http for antlr url to fix connectivity complaints
add cc-drlvm log20070717141534Lbuild.901 07/17/2007 14:15:34drlvm

Mime
View raw message