harmony-alerts mailing list archives

Site index · List index
Message view « Date » · « Thread »
Top « Date » · « Thread »
From nbe...@kc.rr.com
Subject [build-test alert] BUILD FAILED Windows XP x86: drlvm-test
Date Wed, 11 Jul 2007 08:55:13 GMT
BUILD FAILED:
	Ant Error Message:
C:\harmony\buildtest2\scripts\cc-exec-adaptor.xml:101: The following error occurred while executing this line: C:\harmony\buildtest2\adaptors\drlvm-test\adaptor.xml:75: There were drlvm-test failures

Date of build:	07/10/2007 22:31:31
Time to build:	319 minutes 59 seconds
Last changed:	07/10/2007 19:11:44
Last log entry:	drlvm

***********************************************************
Errors/Warnings:	(27)
            
[java] Java Result: 1
[java] Java Result: 1
[java] Java Result: 130
[java] Java Result: 1
[java] Java Result: 1
[java] Java Result: 130
[java] Java Result: 1
[java] Java Result: 1
[java] Java Result: 130
[java] Java Result: 1
[java] Java Result: 1
[java] Java Result: 130
[java] Java Result: 1
[java] Java Result: 1
[java] Java Result: 130
[junit] Tests FAILED
[junit] Tests FAILED
[junit] Tests FAILED
[junit] Tests FAILED (timeout)
[junit] Tests FAILED
BUILD FAILED
C:\harmony\buildtest2\build\checkouts\drlvm\build\make\build.xml:398: The following error occurred while executing this line:
C:\harmony\buildtest2\build\checkouts\drlvm\build\make\build_component.xml:73: The following error occurred while executing this line:
C:\harmony\buildtest2\build\checkouts\drlvm\build\win_ia32_msvc_debug\semis\build\targets\test.xml:6: Some tests failed
Total time: 314 minutes 29 seconds
The execution FAILED with the following exception:
The following error occurred while executing this line:
C:\harmony\buildtest2\adaptors\drlvm-test\adaptor.xml:75: There were drlvm-test failures

***********************************************************
Unit Tests: (4338)
        
failure: test_exec_Str java.lang.RuntimeTest2
failure: test_exec_Str java.lang.RuntimeTest2
failure: test_exec_Str java.lang.RuntimeTest2
failure: test_exec_Str java.lang.RuntimeTest2
failure: test_exec_Str java.lang.RuntimeTest2
Unit Test Error Details:	(5)
                
Test: test_exec_StrClass: java.lang.RuntimeTest2junit.framework.AssertionFailedError: check001: the date's reply has not been received
	at junit.framework.Assert.fail(Assert.java:47)
	at java.lang.RuntimeTest2.exec_StrForWindows(RuntimeTest2.java:295)
	at java.lang.RuntimeTest2.test_exec_Str(RuntimeTest2.java:362)
	at java.lang.reflect.VMReflection.invokeMethod(VMReflection.java)
	at java.lang.reflect.Method.invoke(Method.java:317)
	at junit.framework.TestCase.runTest(TestCase.java:164)
	at junit.framework.TestCase.runBare(TestCase.java:130)
	at junit.framework.TestResult$1.protect(TestResult.java:106)
	at junit.framework.TestResult.runProtected(TestResult.java:124)
	at junit.framework.TestResult.run(TestResult.java:109)
	at junit.framework.TestCase.run(TestCase.java:120)
	at junit.framework.TestSuite.runTest(TestSuite.java:230)
	at junit.framework.TestSuite.run(TestSuite.java:225)
	at org.apache.tools.ant.taskdefs.optional.junit.JUnitTestRunner.run(JUnitTestRunner.java:297)
	at org.apache.tools.ant.taskdefs.optional.junit.JUnitTestRunner.launch(JUnitTestRunner.java:672)
	at org.apache.tools.ant.taskdefs.optional.junit.JUnitTestRunner.main(JUnitTestRunner.java:546)
Test: test_exec_StrClass: java.lang.RuntimeTest2junit.framework.AssertionFailedError: check001: the date's reply has not been received
	at junit.framework.Assert.fail(Assert.java:47)
	at java.lang.RuntimeTest2.exec_StrForWindows(RuntimeTest2.java:295)
	at java.lang.RuntimeTest2.test_exec_Str(RuntimeTest2.java:362)
	at java.lang.reflect.VMReflection.invokeMethod(VMReflection.java)
	at java.lang.reflect.Method.invoke(Method.java:317)
	at junit.framework.TestCase.runTest(TestCase.java:164)
	at junit.framework.TestCase.runBare(TestCase.java:130)
	at junit.framework.TestResult$1.protect(TestResult.java:106)
	at junit.framework.TestResult.runProtected(TestResult.java:124)
	at junit.framework.TestResult.run(TestResult.java:109)
	at junit.framework.TestCase.run(TestCase.java:120)
	at junit.framework.TestSuite.runTest(TestSuite.java:230)
	at junit.framework.TestSuite.run(TestSuite.java:225)
	at org.apache.tools.ant.taskdefs.optional.junit.JUnitTestRunner.run(JUnitTestRunner.java:297)
	at org.apache.tools.ant.taskdefs.optional.junit.JUnitTestRunner.launch(JUnitTestRunner.java:672)
	at org.apache.tools.ant.taskdefs.optional.junit.JUnitTestRunner.main(JUnitTestRunner.java:546)
Test: test_exec_StrClass: java.lang.RuntimeTest2junit.framework.AssertionFailedError: check001: the date's reply has not been received
	at junit.framework.Assert.fail(Assert.java:47)
	at java.lang.RuntimeTest2.exec_StrForWindows(RuntimeTest2.java:295)
	at java.lang.RuntimeTest2.test_exec_Str(RuntimeTest2.java:362)
	at java.lang.reflect.VMReflection.invokeMethod(VMReflection.java)
	at java.lang.reflect.Method.invoke(Method.java:317)
	at junit.framework.TestCase.runTest(TestCase.java:164)
	at junit.framework.TestCase.runBare(TestCase.java:130)
	at junit.framework.TestResult$1.protect(TestResult.java:106)
	at junit.framework.TestResult.runProtected(TestResult.java:124)
	at junit.framework.TestResult.run(TestResult.java:109)
	at junit.framework.TestCase.run(TestCase.java:120)
	at junit.framework.TestSuite.runTest(TestSuite.java:230)
	at junit.framework.TestSuite.run(TestSuite.java:225)
	at org.apache.tools.ant.taskdefs.optional.junit.JUnitTestRunner.run(JUnitTestRunner.java:297)
	at org.apache.tools.ant.taskdefs.optional.junit.JUnitTestRunner.launch(JUnitTestRunner.java:672)
	at org.apache.tools.ant.taskdefs.optional.junit.JUnitTestRunner.main(JUnitTestRunner.java:546)
Test: test_exec_StrClass: java.lang.RuntimeTest2junit.framework.AssertionFailedError: check001: the date's reply has not been received
	at junit.framework.Assert.fail(Assert.java:47)
	at java.lang.RuntimeTest2.exec_StrForWindows(RuntimeTest2.java:295)
	at java.lang.RuntimeTest2.test_exec_Str(RuntimeTest2.java:362)
	at java.lang.reflect.VMReflection.invokeMethod(VMReflection.java)
	at java.lang.reflect.Method.invoke(Method.java:317)
	at junit.framework.TestCase.runTest(TestCase.java:164)
	at junit.framework.TestCase.runBare(TestCase.java)
	at junit.framework.TestResult$1.protect(TestResult.java)
	at junit.framework.TestResult.runProtected(TestResult.java)
	at junit.framework.TestResult.run(TestResult.java)
	at junit.framework.TestCase.run(TestCase.java)
	at junit.framework.TestSuite.runTest(TestSuite.java:230)
	at junit.framework.TestSuite.run(TestSuite.java)
	at org.apache.tools.ant.taskdefs.optional.junit.JUnitTestRunner.run(JUnitTestRunner.java)
	at org.apache.tools.ant.taskdefs.optional.junit.JUnitTestRunner.launch(JUnitTestRunner.java:672)
	at org.apache.tools.ant.taskdefs.optional.junit.JUnitTestRunner.main(JUnitTestRunner.java:546)
Test: test_exec_StrClass: java.lang.RuntimeTest2junit.framework.AssertionFailedError: check001: the date's reply has not been received
	at junit.framework.Assert.fail(Assert.java:47)
	at java.lang.RuntimeTest2.exec_StrForWindows(RuntimeTest2.java:295)
	at java.lang.RuntimeTest2.test_exec_Str(RuntimeTest2.java:362)
	at java.lang.reflect.VMReflection.invokeMethod(VMReflection.java)
	at java.lang.reflect.Method.invoke(Method.java:317)
	at junit.framework.TestCase.runTest(TestCase.java:164)
	at junit.framework.TestCase.runBare(TestCase.java)
	at junit.framework.TestResult$1.protect(TestResult.java)
	at junit.framework.TestResult.runProtected(TestResult.java)
	at junit.framework.TestResult.run(TestResult.java)
	at junit.framework.TestCase.run(TestCase.java)
	at junit.framework.TestSuite.runTest(TestSuite.java)
	at junit.framework.TestSuite.run(TestSuite.java)
	at org.apache.tools.ant.taskdefs.optional.junit.JUnitTestRunner.run(JUnitTestRunner.java)
	at org.apache.tools.ant.taskdefs.optional.junit.JUnitTestRunner.launch(JUnitTestRunner.java:672)
	at org.apache.tools.ant.taskdefs.optional.junit.JUnitTestRunner.main(JUnitTestRunner.java:546)

***********************************************************
Modifications since last successful build:	(311)
            
add cc-drlvm log20070710191144Lbuild.34 07/10/2007 19:11:44drlvm
add cc-classlib log20070710102749Lbuild.61 07/10/2007 10:27:49classlib
modified tonywu  /harmony/enhanced/classlib/trunk/modules/luni/src/main/java/org/apache/harmony/luni/internal/locale/Language_no.java 07/10/2007 09:46:56 Fix Harmony-4402 ([classlib][luni] Locale("no", "NO").getDisplayLanguage() returns upper-case value instead of lower-case if localized for Norwegian locale)
modified tonywu  /harmony/enhanced/classlib/trunk/modules/luni/src/test/api/common/tests/api/java/util/LocaleTest.java 07/10/2007 09:46:56 Fix Harmony-4402 ([classlib][luni] Locale("no", "NO").getDisplayLanguage() returns upper-case value instead of lower-case if localized for Norwegian locale)
modified tonywu  /harmony/enhanced/classlib/trunk/modules/luni/src/main/java/org/apache/harmony/luni/internal/locale/Language_no.java 07/10/2007 09:46:56 Fix Harmony-4402 ([classlib][luni] Locale("no", "NO").getDisplayLanguage() returns upper-case value instead of lower-case if localized for Norwegian locale)
modified tonywu  /harmony/enhanced/classlib/trunk/modules/luni/src/test/api/common/tests/api/java/util/LocaleTest.java 07/10/2007 09:46:56 Fix Harmony-4402 ([classlib][luni] Locale("no", "NO").getDisplayLanguage() returns upper-case value instead of lower-case if localized for Norwegian locale)
modified tonywu  /harmony/enhanced/classlib/trunk/modules/archive/src/test/java/org/apache/harmony/archive/tests/java/util/zip/ZipOutputStreamTest.java 07/10/2007 09:45:00 correct typo
modified tonywu  /harmony/enhanced/classlib/trunk/modules/archive/src/test/java/org/apache/harmony/archive/tests/java/util/zip/ZipOutputStreamTest.java 07/10/2007 09:45:00 correct typo
modified tonywu  /harmony/enhanced/classlib/trunk/modules/archive/src/main/java/java/util/zip/ZipOutputStream.java 07/10/2007 09:02:31 Fix Harmony-4405 ([classlib][luni] Compatibility: ZipOutputStream.write(null, off, length) exception throwing order differs on Harmony and RI)
modified tonywu  /harmony/enhanced/classlib/trunk/modules/archive/src/test/java/org/apache/harmony/archive/tests/java/util/zip/ZipOutputStreamTest.java 07/10/2007 09:02:31 Fix Harmony-4405 ([classlib][luni] Compatibility: ZipOutputStream.write(null, off, length) exception throwing order differs on Harmony and RI)
modified tonywu  /harmony/enhanced/classlib/trunk/modules/archive/src/main/java/java/util/zip/ZipOutputStream.java 07/10/2007 09:02:31 Fix Harmony-4405 ([classlib][luni] Compatibility: ZipOutputStream.write(null, off, length) exception throwing order differs on Harmony and RI)
modified tonywu  /harmony/enhanced/classlib/trunk/modules/archive/src/test/java/org/apache/harmony/archive/tests/java/util/zip/ZipOutputStreamTest.java 07/10/2007 09:02:31 Fix Harmony-4405 ([classlib][luni] Compatibility: ZipOutputStream.write(null, off, length) exception throwing order differs on Harmony and RI)
modified tonywu  /harmony/enhanced/classlib/trunk/modules/luni/src/main/java/java/util/GregorianCalendar.java 07/10/2007 08:42:19 Fix Harmony-4372 for backward roll operation([classlib][luni] GregorianCalendar.roll() works incorrectly around end of year if MinimalDaysInFirstWeek is 4)
modified tonywu  /harmony/enhanced/classlib/trunk/modules/luni/src/test/api/common/tests/api/java/util/GregorianCalendarTest.java 07/10/2007 08:42:19 Fix Harmony-4372 for backward roll operation([classlib][luni] GregorianCalendar.roll() works incorrectly around end of year if MinimalDaysInFirstWeek is 4)
modified tonywu  /harmony/enhanced/classlib/trunk/modules/luni/src/main/java/java/util/GregorianCalendar.java 07/10/2007 08:42:19 Fix Harmony-4372 for backward roll operation([classlib][luni] GregorianCalendar.roll() works incorrectly around end of year if MinimalDaysInFirstWeek is 4)
modified tonywu  /harmony/enhanced/classlib/trunk/modules/luni/src/test/api/common/tests/api/java/util/GregorianCalendarTest.java 07/10/2007 08:42:19 Fix Harmony-4372 for backward roll operation([classlib][luni] GregorianCalendar.roll() works incorrectly around end of year if MinimalDaysInFirstWeek is 4)
add cc-classlib log20070710060601Lbuild.60 07/10/2007 06:06:01classlib
deleted tonywu  /harmony/enhanced/classlib/trunk/modules/jndi/src/main/java/org/apache/harmony/jndi/provider/GenericURLDirContextFactory.java 07/10/2007 04:55:54 remove redundant class
deleted tonywu  /harmony/enhanced/classlib/trunk/modules/jndi/src/main/java/org/apache/harmony/jndi/provider/GenericURLDirContextFactory.java 07/10/2007 04:55:54 remove redundant class
add cc-classlib log20070710025913Lbuild.59 07/10/2007 02:59:13classlib
modified pyang  /harmony/enhanced/classlib/trunk/modules/beans/src/test/java/org/apache/harmony/beans/tests/java/beans/PropertyEditorSupportTest.java 07/10/2007 02:12:07 Fix 2 bugs in PropertyEditorSupport: 1. setSource(null) should not throw NPE(the original tests fail on RI, also updated accordingly), 2. firePropertyChange should fire an event with the source only
modified pyang  /harmony/enhanced/classlib/trunk/modules/beans/src/main/java/java/beans/PropertyEditorSupport.java 07/10/2007 02:12:07 Fix 2 bugs in PropertyEditorSupport: 1. setSource(null) should not throw NPE(the original tests fail on RI, also updated accordingly), 2. firePropertyChange should fire an event with the source only
modified pyang  /harmony/enhanced/classlib/trunk/modules/beans/src/test/java/org/apache/harmony/beans/tests/java/beans/PropertyEditorSupportTest.java 07/10/2007 02:12:07 Fix 2 bugs in PropertyEditorSupport: 1. setSource(null) should not throw NPE(the original tests fail on RI, also updated accordingly), 2. firePropertyChange should fire an event with the source only
modified pyang  /harmony/enhanced/classlib/trunk/modules/beans/src/main/java/java/beans/PropertyEditorSupport.java 07/10/2007 02:12:07 Fix 2 bugs in PropertyEditorSupport: 1. setSource(null) should not throw NPE(the original tests fail on RI, also updated accordingly), 2. firePropertyChange should fire an event with the source only
add cc-classlib log20070710021136Lbuild.58 07/10/2007 02:11:36classlib
modified pyang  /harmony/enhanced/classlib/trunk/modules/beans/src/test/java/org/apache/harmony/beans/tests/java/beans/StatementTest.java 07/10/2007 01:52:12 Add several testcases to Expression and its superclass Statement, including the subclassing Expression, overloaded method recognition, empty array, array with null element, etc, and fix Expression/Statement to pass these tests. But there is still 1 thing to be done, tracked by HARMONY-4392.
modified pyang  /harmony/enhanced/classlib/trunk/modules/beans/src/main/java/java/beans/Expression.java 07/10/2007 01:52:12 Add several testcases to Expression and its superclass Statement, including the subclassing Expression, overloaded method recognition, empty array, array with null element, etc, and fix Expression/Statement to pass these tests. But there is still 1 thing to be done, tracked by HARMONY-4392.
modified pyang  /harmony/enhanced/classlib/trunk/modules/beans/src/main/java/java/beans/Statement.java 07/10/2007 01:52:12 Add several testcases to Expression and its superclass Statement, including the subclassing Expression, overloaded method recognition, empty array, array with null element, etc, and fix Expression/Statement to pass these tests. But there is still 1 thing to be done, tracked by HARMONY-4392.
modified pyang  /harmony/enhanced/classlib/trunk/modules/beans/src/test/java/org/apache/harmony/beans/tests/java/beans/ExpressionTest.java 07/10/2007 01:52:12 Add several testcases to Expression and its superclass Statement, including the subclassing Expression, overloaded method recognition, empty array, array with null element, etc, and fix Expression/Statement to pass these tests. But there is still 1 thing to be done, tracked by HARMONY-4392.
modified pyang  /harmony/enhanced/classlib/trunk/modules/beans/src/test/java/org/apache/harmony/beans/tests/java/beans/StatementTest.java 07/10/2007 01:52:12 Add several testcases to Expression and its superclass Statement, including the subclassing Expression, overloaded method recognition, empty array, array with null element, etc, and fix Expression/Statement to pass these tests. But there is still 1 thing to be done, tracked by HARMONY-4392.
modified pyang  /harmony/enhanced/classlib/trunk/modules/beans/src/main/java/java/beans/Expression.java 07/10/2007 01:52:12 Add several testcases to Expression and its superclass Statement, including the subclassing Expression, overloaded method recognition, empty array, array with null element, etc, and fix Expression/Statement to pass these tests. But there is still 1 thing to be done, tracked by HARMONY-4392.
modified pyang  /harmony/enhanced/classlib/trunk/modules/beans/src/main/java/java/beans/Statement.java 07/10/2007 01:52:12 Add several testcases to Expression and its superclass Statement, including the subclassing Expression, overloaded method recognition, empty array, array with null element, etc, and fix Expression/Statement to pass these tests. But there is still 1 thing to be done, tracked by HARMONY-4392.
modified pyang  /harmony/enhanced/classlib/trunk/modules/beans/src/test/java/org/apache/harmony/beans/tests/java/beans/ExpressionTest.java 07/10/2007 01:52:12 Add several testcases to Expression and its superclass Statement, including the subclassing Expression, overloaded method recognition, empty array, array with null element, etc, and fix Expression/Statement to pass these tests. But there is still 1 thing to be done, tracked by HARMONY-4392.
add cc-classlib log20070710013650Lbuild.57 07/10/2007 01:36:50classlib
modified tonywu  /harmony/enhanced/classlib/trunk/modules/luni/src/main/java/java/util/GregorianCalendar.java 07/10/2007 01:31:10 Fix HARMONY-4384 ([classlib][luni] Losing Calendar.set(...) settings during consecutive set(...) calls)
modified tonywu  /harmony/enhanced/classlib/trunk/modules/luni/src/test/api/common/tests/api/java/util/CalendarTest.java 07/10/2007 01:31:10 Fix HARMONY-4384 ([classlib][luni] Losing Calendar.set(...) settings during consecutive set(...) calls)
modified tonywu  /harmony/enhanced/classlib/trunk/modules/luni/src/main/java/java/util/GregorianCalendar.java 07/10/2007 01:31:10 Fix HARMONY-4384 ([classlib][luni] Losing Calendar.set(...) settings during consecutive set(...) calls)
modified tonywu  /harmony/enhanced/classlib/trunk/modules/luni/src/test/api/common/tests/api/java/util/CalendarTest.java 07/10/2007 01:31:10 Fix HARMONY-4384 ([classlib][luni] Losing Calendar.set(...) settings during consecutive set(...) calls)
add cc-drlvm log20070709180547Lbuild.33 07/09/2007 18:05:47drlvm
add cc-classlib log20070709124034Lbuild.56 07/09/2007 12:40:34classlib
modified tellison  /harmony/enhanced/classlib/trunk/modules/luni/src/main/java/java/util/HashMap.java 07/09/2007 07:17:27 Fix for HARMONY-4064 ([classlib][luni] Performance improvement of java.util.HashMap)
modified tellison  /harmony/enhanced/classlib/trunk/modules/luni/src/main/java/java/util/HashMap.java 07/09/2007 07:17:27 Fix for HARMONY-4064 ([classlib][luni] Performance improvement of java.util.HashMap)
add cc-classlib log20070709062056Lbuild.55 07/09/2007 06:20:56classlib
modified tonywu  /harmony/enhanced/classlib/trunk/modules/luni/src/main/java/java/util/GregorianCalendar.java 07/09/2007 05:31:42 Fix HARMONY-4372 ([classlib][luni] GregorianCalendar.roll() works incorrectly around end of year if MinimalDaysInFirstWeek is 4)
modified tonywu  /harmony/enhanced/classlib/trunk/modules/luni/src/test/api/common/tests/api/java/util/GregorianCalendarTest.java 07/09/2007 05:31:42 Fix HARMONY-4372 ([classlib][luni] GregorianCalendar.roll() works incorrectly around end of year if MinimalDaysInFirstWeek is 4)
modified tonywu  /harmony/enhanced/classlib/trunk/modules/luni/src/main/java/java/util/GregorianCalendar.java 07/09/2007 05:31:42 Fix HARMONY-4372 ([classlib][luni] GregorianCalendar.roll() works incorrectly around end of year if MinimalDaysInFirstWeek is 4)
modified tonywu  /harmony/enhanced/classlib/trunk/modules/luni/src/test/api/common/tests/api/java/util/GregorianCalendarTest.java 07/09/2007 05:31:42 Fix HARMONY-4372 ([classlib][luni] GregorianCalendar.roll() works incorrectly around end of year if MinimalDaysInFirstWeek is 4)
modified leoli  /harmony/enhanced/classlib/trunk/modules/luni/src/main/java/java/util/AbstractSequentialList.java 07/09/2007 05:25:36 Apply patch for HARMONY-4395([classlib][util]AbstractSequentialList.set should throw IndexOutOfBoundsException when no elements exists.).
modified leoli  /harmony/enhanced/classlib/trunk/modules/luni/src/test/api/common/tests/api/java/util/AbstractSequentialListTest.java 07/09/2007 05:25:36 Apply patch for HARMONY-4395([classlib][util]AbstractSequentialList.set should throw IndexOutOfBoundsException when no elements exists.).
modified leoli  /harmony/enhanced/classlib/trunk/modules/luni/src/main/java/java/util/AbstractSequentialList.java 07/09/2007 05:25:36 Apply patch for HARMONY-4395([classlib][util]AbstractSequentialList.set should throw IndexOutOfBoundsException when no elements exists.).
modified leoli  /harmony/enhanced/classlib/trunk/modules/luni/src/test/api/common/tests/api/java/util/AbstractSequentialListTest.java 07/09/2007 05:25:36 Apply patch for HARMONY-4395([classlib][util]AbstractSequentialList.set should throw IndexOutOfBoundsException when no elements exists.).
add cc-classlib log20070709052425Lbuild.54 07/09/2007 05:24:25classlib
modified hindessm  /harmony/enhanced/classlib/trunk/modules/portlib/src/test/native/hytime/shared/hytime.c 07/09/2007 03:49:09 Allow this to compile with -Dhy.no.thr=true.
modified hindessm  /harmony/enhanced/classlib/trunk/modules/portlib/src/test/native/hytime/shared/hytime.c 07/09/2007 03:49:09 Allow this to compile with -Dhy.no.thr=true.
modified leoli  /harmony/enhanced/classlib/trunk/modules/luni/src/main/java/java/net/ProxySelectorImpl.java 07/09/2007 03:23:12 Fix bug for HARMONY-4281([classlib][net] test tests.api.java.net.ProxySelectorTest failed if proxy defined in the classlib\depends\files\net.properties)
modified leoli  /harmony/enhanced/classlib/trunk/modules/luni/src/test/api/common/tests/api/java/net/ProxySelectorTest.java 07/09/2007 03:23:12 Fix bug for HARMONY-4281([classlib][net] test tests.api.java.net.ProxySelectorTest failed if proxy defined in the classlib\depends\files\net.properties)
modified leoli  /harmony/enhanced/classlib/trunk/modules/luni/src/main/java/java/net/ProxySelectorImpl.java 07/09/2007 03:23:12 Fix bug for HARMONY-4281([classlib][net] test tests.api.java.net.ProxySelectorTest failed if proxy defined in the classlib\depends\files\net.properties)
modified leoli  /harmony/enhanced/classlib/trunk/modules/luni/src/test/api/common/tests/api/java/net/ProxySelectorTest.java 07/09/2007 03:23:12 Fix bug for HARMONY-4281([classlib][net] test tests.api.java.net.ProxySelectorTest failed if proxy defined in the classlib\depends\files\net.properties)
add cc-classlib log20070709023515Lbuild.53 07/09/2007 02:35:15classlib
modified pyang  /harmony/enhanced/classlib/trunk/modules/beans/src/main/java/java/beans/SimpleBeanInfo.java 07/09/2007 01:49:57 SimpleBeanInfo.loadImage(String) should return null on given null parameter
modified pyang  /harmony/enhanced/classlib/trunk/modules/beans/src/test/java/org/apache/harmony/beans/tests/java/beans/SimpleBeanInfoTest.java 07/09/2007 01:49:57 SimpleBeanInfo.loadImage(String) should return null on given null parameter
modified pyang  /harmony/enhanced/classlib/trunk/modules/beans/src/main/java/java/beans/SimpleBeanInfo.java 07/09/2007 01:49:57 SimpleBeanInfo.loadImage(String) should return null on given null parameter
modified pyang  /harmony/enhanced/classlib/trunk/modules/beans/src/test/java/org/apache/harmony/beans/tests/java/beans/SimpleBeanInfoTest.java 07/09/2007 01:49:57 SimpleBeanInfo.loadImage(String) should return null on given null parameter
add cc-classlib log20070709014405Lbuild.52 07/09/2007 01:44:05classlib
modified pyang  /harmony/enhanced/classlib/trunk/modules/beans/src/main/java/java/beans/EventHandler.java 07/09/2007 01:41:16 1. modify EventHanderTest according to RI's behavior 2. fix java.beans.EventHandler
modified pyang  /harmony/enhanced/classlib/trunk/modules/beans/src/test/java/org/apache/harmony/beans/tests/java/beans/EventHandlerTest.java 07/09/2007 01:41:16 1. modify EventHanderTest according to RI's behavior 2. fix java.beans.EventHandler
modified pyang  /harmony/enhanced/classlib/trunk/modules/beans/src/main/java/java/beans/EventHandler.java 07/09/2007 01:41:16 1. modify EventHanderTest according to RI's behavior 2. fix java.beans.EventHandler
modified pyang  /harmony/enhanced/classlib/trunk/modules/beans/src/test/java/org/apache/harmony/beans/tests/java/beans/EventHandlerTest.java 07/09/2007 01:41:16 1. modify EventHanderTest according to RI's behavior 2. fix java.beans.EventHandler
add cc-drlvm log20070706114435Lbuild.32 07/06/2007 11:44:35drlvm
add cc-classlib log20070706043022Lbuild.51 07/06/2007 04:30:22classlib
modified pyang  /harmony/enhanced/classlib/trunk/modules/beans/src/test/java/org/apache/harmony/beans/tests/java/beans/VetoableChangeSupportTest.java 07/06/2007 02:11:41 1. Refine the VetoableChangeSupport against RI's behavior, the original version has 12 faiulres in RI; 2. add serialization test; 3. Fix VetoableChangeSupport to pass most of the tests, but there's still 1 failures left
modified pyang  /harmony/enhanced/classlib/trunk/modules/beans/src/main/java/java/beans/VetoableChangeSupport.java 07/06/2007 02:11:41 1. Refine the VetoableChangeSupport against RI's behavior, the original version has 12 faiulres in RI; 2. add serialization test; 3. Fix VetoableChangeSupport to pass most of the tests, but there's still 1 failures left
modified pyang  /harmony/enhanced/classlib/trunk/modules/beans/src/test/java/org/apache/harmony/beans/tests/java/beans/VetoableChangeSupportTest.java 07/06/2007 02:11:41 1. Refine the VetoableChangeSupport against RI's behavior, the original version has 12 faiulres in RI; 2. add serialization test; 3. Fix VetoableChangeSupport to pass most of the tests, but there's still 1 failures left
modified pyang  /harmony/enhanced/classlib/trunk/modules/beans/src/main/java/java/beans/VetoableChangeSupport.java 07/06/2007 02:11:41 1. Refine the VetoableChangeSupport against RI's behavior, the original version has 12 faiulres in RI; 2. add serialization test; 3. Fix VetoableChangeSupport to pass most of the tests, but there's still 1 failures left
modified tonywu  /harmony/enhanced/classlib/trunk/modules/luni/src/main/java/java/io/CharArrayReader.java 07/06/2007 01:26:09 Fix HARMONY-4357 ([classlib][luni] Compatibility: CharArrayReader.reset() behavior differs on Harmony and RI if the stream hasn't been marked)
modified tonywu  /harmony/enhanced/classlib/trunk/modules/luni/src/test/api/common/tests/api/java/io/CharArrayReaderTest.java 07/06/2007 01:26:09 Fix HARMONY-4357 ([classlib][luni] Compatibility: CharArrayReader.reset() behavior differs on Harmony and RI if the stream hasn't been marked)
modified tonywu  /harmony/enhanced/classlib/trunk/modules/luni/src/main/java/java/io/CharArrayReader.java 07/06/2007 01:26:09 Fix HARMONY-4357 ([classlib][luni] Compatibility: CharArrayReader.reset() behavior differs on Harmony and RI if the stream hasn't been marked)
modified tonywu  /harmony/enhanced/classlib/trunk/modules/luni/src/test/api/common/tests/api/java/io/CharArrayReaderTest.java 07/06/2007 01:26:09 Fix HARMONY-4357 ([classlib][luni] Compatibility: CharArrayReader.reset() behavior differs on Harmony and RI if the stream hasn't been marked)
modified pyang  /harmony/enhanced/classlib/trunk/modules/beans/src/main/java/java/beans/VetoableChangeListenerProxy.java 07/06/2007 01:17:02 Fix the VetoableChangeListenerProxy to enable VetoableChangeListenerProxyTest
modified pyang  /harmony/enhanced/classlib/trunk/modules/beans/make/exclude.common 07/06/2007 01:17:02 Fix the VetoableChangeListenerProxy to enable VetoableChangeListenerProxyTest
modified pyang  /harmony/enhanced/classlib/trunk/modules/beans/src/main/java/java/beans/VetoableChangeListenerProxy.java 07/06/2007 01:17:02 Fix the VetoableChangeListenerProxy to enable VetoableChangeListenerProxyTest
modified pyang  /harmony/enhanced/classlib/trunk/modules/beans/make/exclude.common 07/06/2007 01:17:02 Fix the VetoableChangeListenerProxy to enable VetoableChangeListenerProxyTest
modified tonywu  /harmony/enhanced/classlib/trunk/modules/luni/src/test/api/common/tests/api/java/net/MulticastSocketTest.java 07/06/2007 00:47:19 Remove the assertion since it fails on both RI and Harmony in IPv6 Env
modified tonywu  /harmony/enhanced/classlib/trunk/modules/luni/src/test/api/common/tests/api/java/net/MulticastSocketTest.java 07/06/2007 00:47:19 Remove the assertion since it fails on both RI and Harmony in IPv6 Env
add cc-classlib log20070705231653Lbuild.50 07/05/2007 23:16:53classlib
modified pyang  /harmony/enhanced/classlib/trunk/modules/beans/src/test/java/org/apache/harmony/beans/tests/java/beans/beancontext/BeanContextServiceRevokedEventTest.java 07/05/2007 22:41:59 In the BeanContextServiceRevokeEvent constructor, the propgatedFrom should not be set, fix this bug with regression test
modified pyang  /harmony/enhanced/classlib/trunk/modules/beans/src/main/java/java/beans/beancontext/BeanContextServiceRevokedEvent.java 07/05/2007 22:41:59 In the BeanContextServiceRevokeEvent constructor, the propgatedFrom should not be set, fix this bug with regression test
modified pyang  /harmony/enhanced/classlib/trunk/modules/beans/src/test/java/org/apache/harmony/beans/tests/java/beans/beancontext/BeanContextServiceRevokedEventTest.java 07/05/2007 22:41:59 In the BeanContextServiceRevokeEvent constructor, the propgatedFrom should not be set, fix this bug with regression test
modified pyang  /harmony/enhanced/classlib/trunk/modules/beans/src/main/java/java/beans/beancontext/BeanContextServiceRevokedEvent.java 07/05/2007 22:41:59 In the BeanContextServiceRevokeEvent constructor, the propgatedFrom should not be set, fix this bug with regression test
add cc-classlib log20070705222306Lbuild.49 07/05/2007 22:23:06classlib
modified leoli  /harmony/enhanced/classlib/trunk/modules/beans/src/test/java/org/apache/harmony/beans/tests/java/beans/beancontext/BeanContextServicesSupportTest.java 07/05/2007 22:21:21 Apply patch for HARMONY-4344([classlib][beans] BeanContextServicesSupport.serviceAvailable will add duplicate service class).
modified leoli  /harmony/enhanced/classlib/trunk/modules/beans/src/main/java/java/beans/beancontext/BeanContextServicesSupport.java 07/05/2007 22:21:21 Apply patch for HARMONY-4344([classlib][beans] BeanContextServicesSupport.serviceAvailable will add duplicate service class).
modified leoli  /harmony/enhanced/classlib/trunk/modules/beans/src/test/java/org/apache/harmony/beans/tests/java/beans/beancontext/BeanContextServicesSupportTest.java 07/05/2007 22:21:21 Apply patch for HARMONY-4344([classlib][beans] BeanContextServicesSupport.serviceAvailable will add duplicate service class).
modified leoli  /harmony/enhanced/classlib/trunk/modules/beans/src/main/java/java/beans/beancontext/BeanContextServicesSupport.java 07/05/2007 22:21:21 Apply patch for HARMONY-4344([classlib][beans] BeanContextServicesSupport.serviceAvailable will add duplicate service class).
add cc-drlvm log20070705095609Lbuild.31 07/05/2007 09:56:09drlvm
modified mfursov  /harmony/enhanced/drlvm/trunk/vm/jitrino/src/optimizer/Opnd.cpp 07/05/2007 07:51:20 Fix for HARMONY-4349  (error in lazy resolution helpers)Fix for HARMONY-4334  (support for unresolved compressed types in Jitrino.OPT)Fix for HARMONY-4181  (fix for x86_64 calling conventions support in Jitrino.JET)reenabling HARMONY-4267 regression test on x86_64 platforms
modified mfursov  /harmony/enhanced/drlvm/trunk/vm/jitrino/src/shared/Type.cpp 07/05/2007 07:51:20 Fix for HARMONY-4349  (error in lazy resolution helpers)Fix for HARMONY-4334  (support for unresolved compressed types in Jitrino.OPT)Fix for HARMONY-4181  (fix for x86_64 calling conventions support in Jitrino.JET)reenabling HARMONY-4267 regression test on x86_64 platforms
modified mfursov  /harmony/enhanced/drlvm/trunk/src/test/regression/excludes/exclude.windows.x86_64 07/05/2007 07:51:20 Fix for HARMONY-4349  (error in lazy resolution helpers)Fix for HARMONY-4334  (support for unresolved compressed types in Jitrino.OPT)Fix for HARMONY-4181  (fix for x86_64 calling conventions support in Jitrino.JET)reenabling HARMONY-4267 regression test on x86_64 platforms
modified mfursov  /harmony/enhanced/drlvm/trunk/vm/jitrino/src/jet/compiler.cpp 07/05/2007 07:51:20 Fix for HARMONY-4349  (error in lazy resolution helpers)Fix for HARMONY-4334  (support for unresolved compressed types in Jitrino.OPT)Fix for HARMONY-4181  (fix for x86_64 calling conventions support in Jitrino.JET)reenabling HARMONY-4267 regression test on x86_64 platforms
modified mfursov  /harmony/enhanced/drlvm/trunk/vm/jitrino/src/jet/csig.h 07/05/2007 07:51:20 Fix for HARMONY-4349  (error in lazy resolution helpers)Fix for HARMONY-4334  (support for unresolved compressed types in Jitrino.OPT)Fix for HARMONY-4181  (fix for x86_64 calling conventions support in Jitrino.JET)reenabling HARMONY-4267 regression test on x86_64 platforms
modified mfursov  /harmony/enhanced/drlvm/trunk/vm/jitrino/src/shared/Type.h 07/05/2007 07:51:20 Fix for HARMONY-4349  (error in lazy resolution helpers)Fix for HARMONY-4334  (support for unresolved compressed types in Jitrino.OPT)Fix for HARMONY-4181  (fix for x86_64 calling conventions support in Jitrino.JET)reenabling HARMONY-4267 regression test on x86_64 platforms
modified mfursov  /harmony/enhanced/drlvm/trunk/vm/vmcore/src/class_support/Resolve.cpp 07/05/2007 07:51:20 Fix for HARMONY-4349  (error in lazy resolution helpers)Fix for HARMONY-4334  (support for unresolved compressed types in Jitrino.OPT)Fix for HARMONY-4181  (fix for x86_64 calling conventions support in Jitrino.JET)reenabling HARMONY-4267 regression test on x86_64 platforms
modified mfursov  /harmony/enhanced/drlvm/trunk/src/test/regression/excludes/exclude.linux.x86_64 07/05/2007 07:51:20 Fix for HARMONY-4349  (error in lazy resolution helpers)Fix for HARMONY-4334  (support for unresolved compressed types in Jitrino.OPT)Fix for HARMONY-4181  (fix for x86_64 calling conventions support in Jitrino.JET)reenabling HARMONY-4267 regression test on x86_64 platforms
modified mfursov  /harmony/enhanced/drlvm/trunk/vm/jitrino/src/translator/java/JavaLabelPrepass.h 07/05/2007 07:51:20 Fix for HARMONY-4349  (error in lazy resolution helpers)Fix for HARMONY-4334  (support for unresolved compressed types in Jitrino.OPT)Fix for HARMONY-4181  (fix for x86_64 calling conventions support in Jitrino.JET)reenabling HARMONY-4267 regression test on x86_64 platforms
add cc-drlvm log20070705043415Lbuild.30 07/05/2007 04:34:15drlvm
add cc-classlib log20070705041923Lbuild.48 07/05/2007 04:19:23classlib
modified ivavladimir  /harmony/enhanced/drlvm/trunk/build/make/excludes/exclude.drlvm_smoke.windows.x86_64.jet 07/05/2007 02:41:45 exclude test exception/FinalizeStackTest on Win x86_64 due to HARMONY-2972
modified leoli  /harmony/enhanced/classlib/trunk/modules/sql/src/main/java/java/sql/DriverManager.java 07/05/2007 00:53:44 Apply patch for HARMONY-4303([classlib][sql] java.sql.DriverManager.getDrivers() will read System prpperty "jdbc.drivers" cause java.lang.ExceptionInInitializerError).
modified leoli  /harmony/enhanced/classlib/trunk/modules/sql/src/test/java/org/apache/harmony/sql/tests/java/sql/DriverManagerTest.java 07/05/2007 00:53:44 Apply patch for HARMONY-4303([classlib][sql] java.sql.DriverManager.getDrivers() will read System prpperty "jdbc.drivers" cause java.lang.ExceptionInInitializerError).
added leoli  /harmony/enhanced/classlib/trunk/modules/sql/src/test/java/org/apache/harmony/sql/tests/java/sql/TestMainForDriver.java 07/05/2007 00:53:44 Apply patch for HARMONY-4303([classlib][sql] java.sql.DriverManager.getDrivers() will read System prpperty "jdbc.drivers" cause java.lang.ExceptionInInitializerError).
modified leoli  /harmony/enhanced/classlib/trunk/modules/sql/META-INF/MANIFEST.MF 07/05/2007 00:53:44 Apply patch for HARMONY-4303([classlib][sql] java.sql.DriverManager.getDrivers() will read System prpperty "jdbc.drivers" cause java.lang.ExceptionInInitializerError).
modified leoli  /harmony/enhanced/classlib/trunk/modules/sql/src/main/java/java/sql/DriverManager.java 07/05/2007 00:53:44 Apply patch for HARMONY-4303([classlib][sql] java.sql.DriverManager.getDrivers() will read System prpperty "jdbc.drivers" cause java.lang.ExceptionInInitializerError).
modified leoli  /harmony/enhanced/classlib/trunk/modules/sql/src/test/java/org/apache/harmony/sql/tests/java/sql/DriverManagerTest.java 07/05/2007 00:53:44 Apply patch for HARMONY-4303([classlib][sql] java.sql.DriverManager.getDrivers() will read System prpperty "jdbc.drivers" cause java.lang.ExceptionInInitializerError).
added leoli  /harmony/enhanced/classlib/trunk/modules/sql/src/test/java/org/apache/harmony/sql/tests/java/sql/TestMainForDriver.java 07/05/2007 00:53:44 Apply patch for HARMONY-4303([classlib][sql] java.sql.DriverManager.getDrivers() will read System prpperty "jdbc.drivers" cause java.lang.ExceptionInInitializerError).
modified leoli  /harmony/enhanced/classlib/trunk/modules/sql/META-INF/MANIFEST.MF 07/05/2007 00:53:44 Apply patch for HARMONY-4303([classlib][sql] java.sql.DriverManager.getDrivers() will read System prpperty "jdbc.drivers" cause java.lang.ExceptionInInitializerError).
add cc-classlib log20070704234328Lbuild.47 07/04/2007 23:43:28classlib
modified leoli  /harmony/enhanced/classlib/trunk/modules/jndi/src/main/java/javax/naming/InitialContext.java 07/04/2007 22:28:47 Roll back the patch for HARMONY-4141 on javax.naming.InitialContext. The applied patch is not ready actually.
modified leoli  /harmony/enhanced/classlib/trunk/modules/jndi/src/main/java/javax/naming/InitialContext.java 07/04/2007 22:28:47 Roll back the patch for HARMONY-4141 on javax.naming.InitialContext. The applied patch is not ready actually.
add cc-drlvm log20070704191015Lbuild.29 07/04/2007 19:10:15drlvm
add cc-classlib log20070704132255Lbuild.46 07/04/2007 13:22:55classlib
modified tonywu  /harmony/enhanced/classlib/trunk/modules/luni/src/test/api/common/tests/api/java/io/SerializationStressTest5.java 07/04/2007 10:21:07 clean up compiler warnings in io module, no functional change.
modified tonywu  /harmony/enhanced/classlib/trunk/modules/luni/src/test/api/common/tests/api/java/io/StreamTokenizerTest.java 07/04/2007 10:21:07 clean up compiler warnings in io module, no functional change.
modified tonywu  /harmony/enhanced/classlib/trunk/modules/luni/src/test/api/common/tests/api/java/io/StringBufferInputStreamTest.java 07/04/2007 10:21:07 clean up compiler warnings in io module, no functional change.
modified tonywu  /harmony/enhanced/classlib/trunk/modules/luni/src/test/api/common/tests/api/java/io/SerializationStressTest.java 07/04/2007 10:21:07 clean up compiler warnings in io module, no functional change.
modified tonywu  /harmony/enhanced/classlib/trunk/modules/luni/src/test/api/common/tests/api/java/io/SerializationStressTest1.java 07/04/2007 10:21:07 clean up compiler warnings in io module, no functional change.
modified tonywu  /harmony/enhanced/classlib/trunk/modules/luni/src/test/api/common/tests/api/java/io/SerializationStressTest2.java 07/04/2007 10:21:07 clean up compiler warnings in io module, no functional change.
modified tonywu  /harmony/enhanced/classlib/trunk/modules/luni/src/test/api/common/tests/api/java/io/SerializationStressTest3.java 07/04/2007 10:21:07 clean up compiler warnings in io module, no functional change.
modified tonywu  /harmony/enhanced/classlib/trunk/modules/luni/src/test/api/common/tests/api/java/io/SerializationStressTest4.java 07/04/2007 10:21:07 clean up compiler warnings in io module, no functional change.
modified tonywu  /harmony/enhanced/classlib/trunk/modules/luni/src/test/api/common/tests/api/java/io/SerializationStressTest5.java 07/04/2007 10:21:07 clean up compiler warnings in io module, no functional change.
modified tonywu  /harmony/enhanced/classlib/trunk/modules/luni/src/test/api/common/tests/api/java/io/StreamTokenizerTest.java 07/04/2007 10:21:07 clean up compiler warnings in io module, no functional change.
modified tonywu  /harmony/enhanced/classlib/trunk/modules/luni/src/test/api/common/tests/api/java/io/StringBufferInputStreamTest.java 07/04/2007 10:21:07 clean up compiler warnings in io module, no functional change.
modified tonywu  /harmony/enhanced/classlib/trunk/modules/luni/src/test/api/common/tests/api/java/io/SerializationStressTest.java 07/04/2007 10:21:07 clean up compiler warnings in io module, no functional change.
modified tonywu  /harmony/enhanced/classlib/trunk/modules/luni/src/test/api/common/tests/api/java/io/SerializationStressTest1.java 07/04/2007 10:21:07 clean up compiler warnings in io module, no functional change.
modified tonywu  /harmony/enhanced/classlib/trunk/modules/luni/src/test/api/common/tests/api/java/io/SerializationStressTest2.java 07/04/2007 10:21:07 clean up compiler warnings in io module, no functional change.
modified tonywu  /harmony/enhanced/classlib/trunk/modules/luni/src/test/api/common/tests/api/java/io/SerializationStressTest3.java 07/04/2007 10:21:07 clean up compiler warnings in io module, no functional change.
modified tonywu  /harmony/enhanced/classlib/trunk/modules/luni/src/test/api/common/tests/api/java/io/SerializationStressTest4.java 07/04/2007 10:21:07 clean up compiler warnings in io module, no functional change.
add cc-drlvm log20070704085341Lbuild.28 07/04/2007 08:53:41drlvm
add cc-classlib log20070704082920Lbuild.45 07/04/2007 08:29:20classlib
added tonywu  /harmony/enhanced/classlib/trunk/modules/luni/src/test/api/common/tests/api/java/io/InputStreamTest.java 07/04/2007 07:59:54 Fix Harmony-4337 ([classlib][luni] Compatibility: InputStream.read(null, offset, len) exception throwing order differs on Harmony and RI if offset is negative)
modified tonywu  /harmony/enhanced/classlib/trunk/modules/luni/src/main/java/java/io/InputStream.java 07/04/2007 07:59:54 Fix Harmony-4337 ([classlib][luni] Compatibility: InputStream.read(null, offset, len) exception throwing order differs on Harmony and RI if offset is negative)
added tonywu  /harmony/enhanced/classlib/trunk/modules/luni/src/test/api/common/tests/api/java/io/InputStreamTest.java 07/04/2007 07:59:54 Fix Harmony-4337 ([classlib][luni] Compatibility: InputStream.read(null, offset, len) exception throwing order differs on Harmony and RI if offset is negative)
modified tonywu  /harmony/enhanced/classlib/trunk/modules/luni/src/main/java/java/io/InputStream.java 07/04/2007 07:59:54 Fix Harmony-4337 ([classlib][luni] Compatibility: InputStream.read(null, offset, len) exception throwing order differs on Harmony and RI if offset is negative)
add cc-classlib log20070704074931Lbuild.44 07/04/2007 07:49:31classlib
modified apetrenko  /harmony/enhanced/classlib/trunk/modules/awt/src/main/java/common/org/apache/harmony/awt/gl/CommonGraphics2DFactory.java 07/04/2007 05:54:26 Patch for HARMONY-3719 "Graphics.getFontMetrics() throws HeadlessExcetion if headless"
modified apetrenko  /harmony/enhanced/classlib/trunk/modules/awt/src/main/java/common/org/apache/harmony/awt/wtk/GraphicsFactory.java 07/04/2007 05:54:26 Patch for HARMONY-3719 "Graphics.getFontMetrics() throws HeadlessExcetion if headless"
modified apetrenko  /harmony/enhanced/classlib/trunk/modules/awt/src/main/java/common/java/awt/ToolkitImpl.java 07/04/2007 05:54:26 Patch for HARMONY-3719 "Graphics.getFontMetrics() throws HeadlessExcetion if headless"
modified apetrenko  /harmony/enhanced/classlib/trunk/modules/awt/src/main/java/common/org/apache/harmony/awt/gl/CommonGraphics2DFactory.java 07/04/2007 05:54:26 Patch for HARMONY-3719 "Graphics.getFontMetrics() throws HeadlessExcetion if headless"
modified apetrenko  /harmony/enhanced/classlib/trunk/modules/awt/src/main/java/common/org/apache/harmony/awt/wtk/GraphicsFactory.java 07/04/2007 05:54:26 Patch for HARMONY-3719 "Graphics.getFontMetrics() throws HeadlessExcetion if headless"
modified apetrenko  /harmony/enhanced/classlib/trunk/modules/awt/src/main/java/common/java/awt/ToolkitImpl.java 07/04/2007 05:54:26 Patch for HARMONY-3719 "Graphics.getFontMetrics() throws HeadlessExcetion if headless"
modified mfursov  /harmony/enhanced/drlvm/trunk/vm/jitrino/src/codegenerator/ia32/Ia32CodeEmitter.cpp 07/04/2007 04:01:12 Fix for HARMONY-4318Enabling lazy resolution mode in JET for 32-bit platforms by default
modified mfursov  /harmony/enhanced/drlvm/trunk/vm/jitrino/src/codegenerator/ia32/Ia32CodeLayout.cpp 07/04/2007 04:01:12 Fix for HARMONY-4318Enabling lazy resolution mode in JET for 32-bit platforms by default
modified mfursov  /harmony/enhanced/drlvm/trunk/vm/jitrino/src/jet/compiler.cpp 07/04/2007 04:01:12 Fix for HARMONY-4318Enabling lazy resolution mode in JET for 32-bit platforms by default
modified pyang  /harmony/enhanced/classlib/trunk/modules/beans/src/test/java/org/apache/harmony/beans/tests/java/beans/beancontext/BeanContextSupportTest.java 07/04/2007 03:47:04 BeanContextSupport.classEquals() should throw NPE on null parameters
modified pyang  /harmony/enhanced/classlib/trunk/modules/beans/src/main/java/java/beans/beancontext/BeanContextSupport.java 07/04/2007 03:47:04 BeanContextSupport.classEquals() should throw NPE on null parameters
modified pyang  /harmony/enhanced/classlib/trunk/modules/beans/src/test/java/org/apache/harmony/beans/tests/java/beans/beancontext/BeanContextSupportTest.java 07/04/2007 03:47:04 BeanContextSupport.classEquals() should throw NPE on null parameters
modified pyang  /harmony/enhanced/classlib/trunk/modules/beans/src/main/java/java/beans/beancontext/BeanContextSupport.java 07/04/2007 03:47:04 BeanContextSupport.classEquals() should throw NPE on null parameters
modified pyang  /harmony/enhanced/classlib/trunk/modules/beans/src/test/java/org/apache/harmony/beans/tests/java/beans/beancontext/BeanContextEventTest.java 07/04/2007 03:41:10 Add serialization test and golden file for java.beans.beancontext.BeanContextEvent
added pyang  /harmony/enhanced/classlib/trunk/modules/beans/src/test/resources/serialization/org/apache/harmony/beans/tests/java/beans/beancontext/BeanContextEventTest.golden.ser 07/04/2007 03:41:10 Add serialization test and golden file for java.beans.beancontext.BeanContextEvent
modified pyang  /harmony/enhanced/classlib/trunk/modules/beans/src/test/java/org/apache/harmony/beans/tests/java/beans/beancontext/BeanContextEventTest.java 07/04/2007 03:41:10 Add serialization test and golden file for java.beans.beancontext.BeanContextEvent
added pyang  /harmony/enhanced/classlib/trunk/modules/beans/src/test/resources/serialization/org/apache/harmony/beans/tests/java/beans/beancontext/BeanContextEventTest.golden.ser 07/04/2007 03:41:10 Add serialization test and golden file for java.beans.beancontext.BeanContextEvent
add cc-drlvm log20070704021937Lbuild.27 07/04/2007 02:19:37drlvm
add cc-classlib log20070704015908Lbuild.43 07/04/2007 01:59:08classlib
modified xli  /harmony/enhanced/drlvm/trunk/vm/gc_gen/src/los/lspace_alloc_collect.cpp 07/03/2007 23:38:21 Fix HARMONY-4325 : undefine verify macros in 01_mark_sweep.patch for Tick project
modified xli  /harmony/enhanced/drlvm/trunk/vm/gc_gen/src/mark_sweep/sspace_verify.h 07/03/2007 23:38:21 Fix HARMONY-4325 : undefine verify macros in 01_mark_sweep.patch for Tick project
modified xli  /harmony/enhanced/drlvm/trunk/vm/gc_gen/src/mark_sweep/sspace_alloc.cpp 07/03/2007 23:38:21 Fix HARMONY-4325 : undefine verify macros in 01_mark_sweep.patch for Tick project
modified xli  /harmony/enhanced/drlvm/trunk/vm/gc_gen/src/mark_sweep/sspace_mark_sweep.cpp 07/03/2007 23:38:21 Fix HARMONY-4325 : undefine verify macros in 01_mark_sweep.patch for Tick project
added xli  /harmony/enhanced/drlvm/trunk/vm/gc_gen/src/mark_sweep/sspace.cpp 07/03/2007 22:01:01 HARMONY-4325 : 01_mark_sweep.patch for Tick project
modified xli  /harmony/enhanced/drlvm/trunk/vm/gc_gen/src/finalizer_weakref/finalizer_weakref.cpp 07/03/2007 22:01:01 HARMONY-4325 : 01_mark_sweep.patch for Tick project
modified xli  /harmony/enhanced/drlvm/trunk/vm/gc_gen/src/mark_compact/mspace_alloc.cpp 07/03/2007 22:01:01 HARMONY-4325 : 01_mark_sweep.patch for Tick project
added xli  /harmony/enhanced/drlvm/trunk/vm/gc_gen/src/los/lspace_alloc_collect.cpp 07/03/2007 22:01:01 HARMONY-4325 : 01_mark_sweep.patch for Tick project
added xli  /harmony/enhanced/drlvm/trunk/vm/gc_gen/src/mark_sweep/sspace_mark.cpp 07/03/2007 22:01:01 HARMONY-4325 : 01_mark_sweep.patch for Tick project
modified xli  /harmony/enhanced/drlvm/trunk/vm/gc_gen/src/mark_compact/mspace_extend_compact.cpp 07/03/2007 22:01:01 HARMONY-4325 : 01_mark_sweep.patch for Tick project
modified xli  /harmony/enhanced/drlvm/trunk/vm/gc_gen/src/gen/gen.h 07/03/2007 22:01:01 HARMONY-4325 : 01_mark_sweep.patch for Tick project
modified xli  /harmony/enhanced/drlvm/trunk/vm/gc_gen/src/mark_compact/mspace_collect_compact.h 07/03/2007 22:01:01 HARMONY-4325 : 01_mark_sweep.patch for Tick project
modified xli  /harmony/enhanced/drlvm/trunk/build/make/components/vm/gc_gen.xml 07/03/2007 22:01:01 HARMONY-4325 : 01_mark_sweep.patch for Tick project
added xli  /harmony/enhanced/drlvm/trunk/vm/gc_gen/src/mark_sweep/sspace_mark_sweep.h 07/03/2007 22:01:01 HARMONY-4325 : 01_mark_sweep.patch for Tick project
modified xli  /harmony/enhanced/drlvm/trunk/vm/gc_gen/src/verify/verify_gc_effect.cpp 07/03/2007 22:01:01 HARMONY-4325 : 01_mark_sweep.patch for Tick project
modified xli  /harmony/enhanced/drlvm/trunk/vm/gc_gen/src/mark_compact/mspace_slide_compact.cpp 07/03/2007 22:01:01 HARMONY-4325 : 01_mark_sweep.patch for Tick project
modified xli  /harmony/enhanced/drlvm/trunk/vm/gc_gen/src/common/gc_common.h 07/03/2007 22:01:01 HARMONY-4325 : 01_mark_sweep.patch for Tick project
added xli  /harmony/enhanced/drlvm/trunk/vm/gc_gen/src/mark_sweep/sspace_verify.cpp 07/03/2007 22:01:01 HARMONY-4325 : 01_mark_sweep.patch for Tick project
added xli  /harmony/enhanced/drlvm/trunk/vm/gc_gen/src/los/free_area_pool.cpp 07/03/2007 22:01:01 HARMONY-4325 : 01_mark_sweep.patch for Tick project
modified xli  /harmony/enhanced/drlvm/trunk/vm/gc_gen/src/common/space_tuner.cpp 07/03/2007 22:01:01 HARMONY-4325 : 01_mark_sweep.patch for Tick project
modified xli  /harmony/enhanced/drlvm/trunk/vm/gc_gen/src/common/gc_block.h 07/03/2007 22:01:01 HARMONY-4325 : 01_mark_sweep.patch for Tick project
added xli  /harmony/enhanced/drlvm/trunk/vm/gc_gen/src/mark_sweep/sspace_chunk.cpp 07/03/2007 22:01:01 HARMONY-4325 : 01_mark_sweep.patch for Tick project
deleted xli  /harmony/enhanced/drlvm/trunk/vm/gc_gen/src/mark_sweep/lspace.cpp 07/03/2007 22:01:01 HARMONY-4325 : 01_mark_sweep.patch for Tick project
deleted xli  /harmony/enhanced/drlvm/trunk/vm/gc_gen/src/mark_sweep/free_area_pool.h 07/03/2007 22:01:01 HARMONY-4325 : 01_mark_sweep.patch for Tick project
modified xli  /harmony/enhanced/drlvm/trunk/vm/gc_gen/src/mark_compact/mspace.cpp 07/03/2007 22:01:01 HARMONY-4325 : 01_mark_sweep.patch for Tick project
added xli  /harmony/enhanced/drlvm/trunk/vm/gc_gen/src/los/lspace.h 07/03/2007 22:01:01 HARMONY-4325 : 01_mark_sweep.patch for Tick project
added xli  /harmony/enhanced/drlvm/trunk/vm/gc_gen/src/los 07/03/2007 22:01:01 HARMONY-4325 : 01_mark_sweep.patch for Tick project
modified xli  /harmony/enhanced/drlvm/trunk/vm/gc_gen/src/mark_compact/fallback_mark_scan.cpp 07/03/2007 22:01:01 HARMONY-4325 : 01_mark_sweep.patch for Tick project
added xli  /harmony/enhanced/drlvm/trunk/vm/gc_gen/src/mark_sweep/sspace_sweep.cpp 07/03/2007 22:01:01 HARMONY-4325 : 01_mark_sweep.patch for Tick project
added xli  /harmony/enhanced/drlvm/trunk/vm/gc_gen/src/mark_sweep/sspace.h 07/03/2007 22:01:01 HARMONY-4325 : 01_mark_sweep.patch for Tick project
modified xli  /harmony/enhanced/drlvm/trunk/vm/gc_gen/src/common/gc_metadata.cpp 07/03/2007 22:01:01 HARMONY-4325 : 01_mark_sweep.patch for Tick project
modified xli  /harmony/enhanced/drlvm/trunk/vm/gc_gen/src/gen/gen.cpp 07/03/2007 22:01:01 HARMONY-4325 : 01_mark_sweep.patch for Tick project
modified xli  /harmony/enhanced/drlvm/trunk/vm/gc_gen/src/mark_compact/mspace_collect_compact.cpp 07/03/2007 22:01:01 HARMONY-4325 : 01_mark_sweep.patch for Tick project
deleted xli  /harmony/enhanced/drlvm/trunk/vm/gc_gen/src/mark_sweep/lspace_alloc_collect.cpp 07/03/2007 22:01:01 HARMONY-4325 : 01_mark_sweep.patch for Tick project
modified xli  /harmony/enhanced/drlvm/trunk/vm/gc_gen/src/verify/verify_live_heap.cpp 07/03/2007 22:01:01 HARMONY-4325 : 01_mark_sweep.patch for Tick project
added xli  /harmony/enhanced/drlvm/trunk/vm/gc_gen/src/mark_sweep/sspace_alloc.cpp 07/03/2007 22:01:01 HARMONY-4325 : 01_mark_sweep.patch for Tick project
modified xli  /harmony/enhanced/drlvm/trunk/vm/gc_gen/src/verify/verifier_common.cpp 07/03/2007 22:01:01 HARMONY-4325 : 01_mark_sweep.patch for Tick project
modified xli  /harmony/enhanced/drlvm/trunk/vm/gc_gen/src/verify/verifier_scanner.cpp 07/03/2007 22:01:01 HARMONY-4325 : 01_mark_sweep.patch for Tick project
added xli  /harmony/enhanced/drlvm/trunk/vm/gc_gen/src/mark_sweep/sspace_mark_sweep.cpp 07/03/2007 22:01:01 HARMONY-4325 : 01_mark_sweep.patch for Tick project
modified xli  /harmony/enhanced/drlvm/trunk/vm/gc_gen/src/common/gc_common.cpp 07/03/2007 22:01:01 HARMONY-4325 : 01_mark_sweep.patch for Tick project
modified xli  /harmony/enhanced/drlvm/trunk/vm/gc_gen/src/verify/verify_mutator_effect.cpp 07/03/2007 22:01:01 HARMONY-4325 : 01_mark_sweep.patch for Tick project
deleted xli  /harmony/enhanced/drlvm/trunk/vm/gc_gen/src/mark_sweep/free_area_pool.cpp 07/03/2007 22:01:01 HARMONY-4325 : 01_mark_sweep.patch for Tick project
modified xli  /harmony/enhanced/drlvm/trunk/vm/gc_gen/src/verify/verify_gc_effect.h 07/03/2007 22:01:01 HARMONY-4325 : 01_mark_sweep.patch for Tick project
modified xli  /harmony/enhanced/drlvm/trunk/vm/gc_gen/src/thread/collector.h 07/03/2007 22:01:01 HARMONY-4325 : 01_mark_sweep.patch for Tick project
added xli  /harmony/enhanced/drlvm/trunk/vm/gc_gen/src/mark_sweep/sspace_verify.h 07/03/2007 22:01:01 HARMONY-4325 : 01_mark_sweep.patch for Tick project
added xli  /harmony/enhanced/drlvm/trunk/vm/gc_gen/src/los/lspace.cpp 07/03/2007 22:01:01 HARMONY-4325 : 01_mark_sweep.patch for Tick project
added xli  /harmony/enhanced/drlvm/trunk/vm/gc_gen/src/los/free_area_pool.h 07/03/2007 22:01:01 HARMONY-4325 : 01_mark_sweep.patch for Tick project
modified xli  /harmony/enhanced/drlvm/trunk/vm/gc_gen/src/mark_compact/mspace_move_compact.cpp 07/03/2007 22:01:01 HARMONY-4325 : 01_mark_sweep.patch for Tick project
modified xli  /harmony/enhanced/drlvm/trunk/vm/gc_gen/src/thread/mutator.h 07/03/2007 22:01:01 HARMONY-4325 : 01_mark_sweep.patch for Tick project
added xli  /harmony/enhanced/drlvm/trunk/vm/gc_gen/src/mark_sweep/sspace_chunk.h 07/03/2007 22:01:01 HARMONY-4325 : 01_mark_sweep.patch for Tick project
deleted xli  /harmony/enhanced/drlvm/trunk/vm/gc_gen/src/mark_sweep/lspace.h 07/03/2007 22:01:01 HARMONY-4325 : 01_mark_sweep.patch for Tick project
modified leoli  /harmony/enhanced/classlib/trunk/modules/jndi/src/main/java/javax/naming/InitialContext.java 07/03/2007 21:58:25 Apply patch for HARMONY-4141([classlib][jndi] InitialContext.getURLOrDefaultInitCtx() optimization)
modified leoli  /harmony/enhanced/classlib/trunk/modules/jndi/src/main/java/javax/naming/InitialContext.java 07/03/2007 21:58:25 Apply patch for HARMONY-4141([classlib][jndi] InitialContext.getURLOrDefaultInitCtx() optimization)
add cc-drlvm log20070703201439Lbuild.26 07/03/2007 20:14:39drlvm
add cc-classlib log20070703130936Lbuild.42 07/03/2007 13:09:36classlib
modified tonywu  /harmony/enhanced/classlib/trunk/modules/luni/src/test/api/common/tests/api/java/io/ObjectStreamFieldTest.java 07/03/2007 11:52:07 clean up compiler warnings in io module, no functional change.
modified tonywu  /harmony/enhanced/classlib/trunk/modules/luni/src/test/api/common/tests/api/java/io/NotActiveExceptionTest.java 07/03/2007 11:52:07 clean up compiler warnings in io module, no functional change.
modified tonywu  /harmony/enhanced/classlib/trunk/modules/luni/src/test/api/common/tests/api/java/io/LineNumberInputStreamTest.java 07/03/2007 11:52:07 clean up compiler warnings in io module, no functional change.
modified tonywu  /harmony/enhanced/classlib/trunk/modules/luni/src/test/api/common/tests/api/java/io/PipedInputStreamTest.java 07/03/2007 11:52:07 clean up compiler warnings in io module, no functional change.
modified tonywu  /harmony/enhanced/classlib/trunk/modules/luni/src/test/api/common/tests/api/java/io/InputStreamReaderTest.java 07/03/2007 11:52:07 clean up compiler warnings in io module, no functional change.
modified tonywu  /harmony/enhanced/classlib/trunk/modules/luni/src/test/api/common/tests/api/java/io/ByteArrayOutputStreamTest.java 07/03/2007 11:52:07 clean up compiler warnings in io module, no functional change.
modified tonywu  /harmony/enhanced/classlib/trunk/modules/luni/src/test/api/common/tests/api/java/io/ObjectInputStreamTest.java 07/03/2007 11:52:07 clean up compiler warnings in io module, no functional change.
modified tonywu  /harmony/enhanced/classlib/trunk/modules/luni/src/test/api/common/tests/api/java/io/ObjectOutputStreamTest.java 07/03/2007 11:52:07 clean up compiler warnings in io module, no functional change.
modified tonywu  /harmony/enhanced/classlib/trunk/modules/luni/src/test/api/common/tests/api/java/io/SequenceInputStreamTest.java 07/03/2007 11:52:07 clean up compiler warnings in io module, no functional change.
modified tonywu  /harmony/enhanced/classlib/trunk/modules/luni/src/test/api/common/org/apache/harmony/luni/tests/java/io/ObjectInputStreamTest.java 07/03/2007 11:52:07 clean up compiler warnings in io module, no functional change.
modified tonywu  /harmony/enhanced/classlib/trunk/modules/luni/src/test/api/common/tests/api/java/io/DataInputStreamTest.java 07/03/2007 11:52:07 clean up compiler warnings in io module, no functional change.
modified tonywu  /harmony/enhanced/classlib/trunk/modules/luni/src/test/api/common/tests/api/java/io/ObjectStreamFieldTest.java 07/03/2007 11:52:07 clean up compiler warnings in io module, no functional change.
modified tonywu  /harmony/enhanced/classlib/trunk/modules/luni/src/test/api/common/tests/api/java/io/NotActiveExceptionTest.java 07/03/2007 11:52:07 clean up compiler warnings in io module, no functional change.
modified tonywu  /harmony/enhanced/classlib/trunk/modules/luni/src/test/api/common/tests/api/java/io/LineNumberInputStreamTest.java 07/03/2007 11:52:07 clean up compiler warnings in io module, no functional change.
modified tonywu  /harmony/enhanced/classlib/trunk/modules/luni/src/test/api/common/tests/api/java/io/PipedInputStreamTest.java 07/03/2007 11:52:07 clean up compiler warnings in io module, no functional change.
modified tonywu  /harmony/enhanced/classlib/trunk/modules/luni/src/test/api/common/tests/api/java/io/InputStreamReaderTest.java 07/03/2007 11:52:07 clean up compiler warnings in io module, no functional change.
modified tonywu  /harmony/enhanced/classlib/trunk/modules/luni/src/test/api/common/tests/api/java/io/ByteArrayOutputStreamTest.java 07/03/2007 11:52:07 clean up compiler warnings in io module, no functional change.
modified tonywu  /harmony/enhanced/classlib/trunk/modules/luni/src/test/api/common/tests/api/java/io/ObjectInputStreamTest.java 07/03/2007 11:52:07 clean up compiler warnings in io module, no functional change.
modified tonywu  /harmony/enhanced/classlib/trunk/modules/luni/src/test/api/common/tests/api/java/io/ObjectOutputStreamTest.java 07/03/2007 11:52:07 clean up compiler warnings in io module, no functional change.
modified tonywu  /harmony/enhanced/classlib/trunk/modules/luni/src/test/api/common/tests/api/java/io/SequenceInputStreamTest.java 07/03/2007 11:52:07 clean up compiler warnings in io module, no functional change.
modified tonywu  /harmony/enhanced/classlib/trunk/modules/luni/src/test/api/common/org/apache/harmony/luni/tests/java/io/ObjectInputStreamTest.java 07/03/2007 11:52:07 clean up compiler warnings in io module, no functional change.
modified tonywu  /harmony/enhanced/classlib/trunk/modules/luni/src/test/api/common/tests/api/java/io/DataInputStreamTest.java 07/03/2007 11:52:07 clean up compiler warnings in io module, no functional change.
modified tonywu  /harmony/enhanced/classlib/trunk/modules/luni/.classpath 07/03/2007 11:38:48 correct output path for impl tests
modified tonywu  /harmony/enhanced/classlib/trunk/modules/luni/.classpath 07/03/2007 11:38:48 correct output path for impl tests
modified tonywu  /harmony/enhanced/classlib/trunk/modules/luni/src/main/java/java/io/LineNumberReader.java 07/03/2007 11:24:57 Fix Harmony-4294 ([classlib][io] LineNumberReader treats \r\n as two lines)
modified tonywu  /harmony/enhanced/classlib/trunk/modules/luni/src/test/api/common/tests/api/java/io/LineNumberReaderTest.java 07/03/2007 11:24:57 Fix Harmony-4294 ([classlib][io] LineNumberReader treats \r\n as two lines)
modified tonywu  /harmony/enhanced/classlib/trunk/modules/luni/src/main/java/java/io/LineNumberReader.java 07/03/2007 11:24:57 Fix Harmony-4294 ([classlib][io] LineNumberReader treats \r\n as two lines)
modified tonywu  /harmony/enhanced/classlib/trunk/modules/luni/src/test/api/common/tests/api/java/io/LineNumberReaderTest.java 07/03/2007 11:24:57 Fix Harmony-4294 ([classlib][io] LineNumberReader treats \r\n as two lines)
add cc-classlib log20070703083954Lbuild.41 07/03/2007 08:39:54classlib
modified tonywu  /harmony/enhanced/classlib/trunk/modules/luni/src/main/java/java/io/OutputStream.java 07/03/2007 08:27:48 Fix Harmony-4311 ([classlib][luni] Compatibility: OutputStream.write(null, off, len) exception throwing order differs on Harmony and RI)
modified tonywu  /harmony/enhanced/classlib/trunk/modules/luni/src/test/api/common/tests/api/java/io/PipedOutputStreamTest.java 07/03/2007 08:27:48 Fix Harmony-4311 ([classlib][luni] Compatibility: OutputStream.write(null, off, len) exception throwing order differs on Harmony and RI)
modified tonywu  /harmony/enhanced/classlib/trunk/modules/luni/src/main/java/java/io/OutputStream.java 07/03/2007 08:27:48 Fix Harmony-4311 ([classlib][luni] Compatibility: OutputStream.write(null, off, len) exception throwing order differs on Harmony and RI)
modified tonywu  /harmony/enhanced/classlib/trunk/modules/luni/src/test/api/common/tests/api/java/io/PipedOutputStreamTest.java 07/03/2007 08:27:48 Fix Harmony-4311 ([classlib][luni] Compatibility: OutputStream.write(null, off, len) exception throwing order differs on Harmony and RI)
add cc-classlib log20070703081753Lbuild.40 07/03/2007 08:17:53classlib
modified ivavladimir  /harmony/enhanced/classlib/trunk/modules/awt/make/exclude.linux.x86_64.drl 07/03/2007 03:19:32 exclude test due to HARMONY-4307
modified ivavladimir  /harmony/enhanced/classlib/trunk/modules/awt/make/exclude.linux.x86_64.drl 07/03/2007 03:19:32 exclude test due to HARMONY-4307
add cc-drlvm log20070703023646Lbuild.25 07/03/2007 02:36:46drlvm
modified mfursov  /harmony/enhanced/drlvm/trunk/src/test/regression/excludes/exclude.windows.x86_64 07/03/2007 02:13:40 Excluding HARMONY-4267 regression test for x86_64 platforms. JIT does not support unresolved types for compressed references today.
modified mfursov  /harmony/enhanced/drlvm/trunk/src/test/regression/excludes/exclude.linux.x86_64 07/03/2007 02:13:40 Excluding HARMONY-4267 regression test for x86_64 platforms. JIT does not support unresolved types for compressed references today.
add cc-drlvm log20070703020941Lbuild.24 07/03/2007 02:09:41drlvm
add cc-classlib log20070703014408Lbuild.39 07/03/2007 01:44:08classlib
added pyang  /harmony/enhanced/classlib/trunk/modules/luni/src/test/impl/org/apache/harmony/tests/internal/net 07/03/2007 01:08:23 Apply patch for HARMONY-617([classlib][luni] HttpURLConnection does not support persistent connections)
modified pyang  /harmony/enhanced/classlib/trunk/modules/luni/.classpath 07/03/2007 01:08:23 Apply patch for HARMONY-617([classlib][luni] HttpURLConnection does not support persistent connections)
modified pyang  /harmony/enhanced/classlib/trunk/modules/luni/src/main/java/org/apache/harmony/luni/internal/net/www/protocol/http/HttpURLConnection.java 07/03/2007 01:08:23 Apply patch for HARMONY-617([classlib][luni] HttpURLConnection does not support persistent connections)
added pyang  /harmony/enhanced/classlib/trunk/modules/luni/src/test/impl/org/apache/harmony/tests/internal/net/www/protocol/http 07/03/2007 01:08:23 Apply patch for HARMONY-617([classlib][luni] HttpURLConnection does not support persistent connections)
modified pyang  /harmony/enhanced/classlib/trunk/modules/luni/src/main/java/org/apache/harmony/luni/internal/net/www/protocol/https/HttpsURLConnection.java 07/03/2007 01:08:23 Apply patch for HARMONY-617([classlib][luni] HttpURLConnection does not support persistent connections)
added pyang  /harmony/enhanced/classlib/trunk/modules/luni/src/test/impl 07/03/2007 01:08:23 Apply patch for HARMONY-617([classlib][luni] HttpURLConnection does not support persistent connections)
added pyang  /harmony/enhanced/classlib/trunk/modules/luni/src/test/impl/org/apache/harmony/tests/internal/net/www/protocol/http/PersistenceTest.java 07/03/2007 01:08:23 Apply patch for HARMONY-617([classlib][luni] HttpURLConnection does not support persistent connections)
added pyang  /harmony/enhanced/classlib/trunk/modules/luni/src/main/java/org/apache/harmony/luni/internal/net/www/protocol/http/HttpConnectionManager.java 07/03/2007 01:08:23 Apply patch for HARMONY-617([classlib][luni] HttpURLConnection does not support persistent connections)
added pyang  /harmony/enhanced/classlib/trunk/modules/luni/src/test/impl/org/apache/harmony/tests/internal 07/03/2007 01:08:23 Apply patch for HARMONY-617([classlib][luni] HttpURLConnection does not support persistent connections)
modified pyang  /harmony/enhanced/classlib/trunk/modules/luni/src/test/api/common/org/apache/harmony/luni/tests/internal/net/www/protocol/http/HttpURLConnectionTest.java 07/03/2007 01:08:23 Apply patch for HARMONY-617([classlib][luni] HttpURLConnection does not support persistent connections)
added pyang  /harmony/enhanced/classlib/trunk/modules/luni/src/main/java/org/apache/harmony/luni/internal/net/www/protocol/http/HttpConnection.java 07/03/2007 01:08:23 Apply patch for HARMONY-617([classlib][luni] HttpURLConnection does not support persistent connections)
added pyang  /harmony/enhanced/classlib/trunk/modules/luni/src/test/impl/org/apache 07/03/2007 01:08:23 Apply patch for HARMONY-617([classlib][luni] HttpURLConnection does not support persistent connections)
modified pyang  /harmony/enhanced/classlib/trunk/modules/luni/src/test/api/common/org/apache/harmony/luni/tests/internal/net/www/protocol/https/HttpsURLConnectionTest.java 07/03/2007 01:08:23 Apply patch for HARMONY-617([classlib][luni] HttpURLConnection does not support persistent connections)
added pyang  /harmony/enhanced/classlib/trunk/modules/luni/src/test/impl/org/apache/harmony/tests/internal/net/www 07/03/2007 01:08:23 Apply patch for HARMONY-617([classlib][luni] HttpURLConnection does not support persistent connections)
added pyang  /harmony/enhanced/classlib/trunk/modules/luni/src/test/impl/org/apache/harmony/tests/internal/net/www/protocol 07/03/2007 01:08:23 Apply patch for HARMONY-617([classlib][luni] HttpURLConnection does not support persistent connections)
added pyang  /harmony/enhanced/classlib/trunk/modules/luni/src/main/java/org/apache/harmony/luni/internal/net/www/protocol/http/HttpConfiguration.java 07/03/2007 01:08:23 Apply patch for HARMONY-617([classlib][luni] HttpURLConnection does not support persistent connections)
added pyang  /harmony/enhanced/classlib/trunk/modules/luni/src/test/impl/org/apache/harmony 07/03/2007 01:08:23 Apply patch for HARMONY-617([classlib][luni] HttpURLConnection does not support persistent connections)
added pyang  /harmony/enhanced/classlib/trunk/modules/luni/src/test/impl/org/apache/harmony/tests 07/03/2007 01:08:23 Apply patch for HARMONY-617([classlib][luni] HttpURLConnection does not support persistent connections)
added pyang  /harmony/enhanced/classlib/trunk/modules/luni/src/test/impl/org 07/03/2007 01:08:23 Apply patch for HARMONY-617([classlib][luni] HttpURLConnection does not support persistent connections)
modified pyang  /harmony/enhanced/classlib/trunk/modules/luni/build.xml 07/03/2007 01:08:23 Apply patch for HARMONY-617([classlib][luni] HttpURLConnection does not support persistent connections)
added pyang  /harmony/enhanced/classlib/trunk/modules/luni/src/test/impl/org/apache/harmony/tests/internal/net 07/03/2007 01:08:23 Apply patch for HARMONY-617([classlib][luni] HttpURLConnection does not support persistent connections)
modified pyang  /harmony/enhanced/classlib/trunk/modules/luni/.classpath 07/03/2007 01:08:23 Apply patch for HARMONY-617([classlib][luni] HttpURLConnection does not support persistent connections)
modified pyang  /harmony/enhanced/classlib/trunk/modules/luni/src/main/java/org/apache/harmony/luni/internal/net/www/protocol/http/HttpURLConnection.java 07/03/2007 01:08:23 Apply patch for HARMONY-617([classlib][luni] HttpURLConnection does not support persistent connections)
added pyang  /harmony/enhanced/classlib/trunk/modules/luni/src/test/impl/org/apache/harmony/tests/internal/net/www/protocol/http 07/03/2007 01:08:23 Apply patch for HARMONY-617([classlib][luni] HttpURLConnection does not support persistent connections)
modified pyang  /harmony/enhanced/classlib/trunk/modules/luni/src/main/java/org/apache/harmony/luni/internal/net/www/protocol/https/HttpsURLConnection.java 07/03/2007 01:08:23 Apply patch for HARMONY-617([classlib][luni] HttpURLConnection does not support persistent connections)
added pyang  /harmony/enhanced/classlib/trunk/modules/luni/src/test/impl 07/03/2007 01:08:23 Apply patch for HARMONY-617([classlib][luni] HttpURLConnection does not support persistent connections)
added pyang  /harmony/enhanced/classlib/trunk/modules/luni/src/test/impl/org/apache/harmony/tests/internal/net/www/protocol/http/PersistenceTest.java 07/03/2007 01:08:23 Apply patch for HARMONY-617([classlib][luni] HttpURLConnection does not support persistent connections)
added pyang  /harmony/enhanced/classlib/trunk/modules/luni/src/main/java/org/apache/harmony/luni/internal/net/www/protocol/http/HttpConnectionManager.java 07/03/2007 01:08:23 Apply patch for HARMONY-617([classlib][luni] HttpURLConnection does not support persistent connections)
added pyang  /harmony/enhanced/classlib/trunk/modules/luni/src/test/impl/org/apache/harmony/tests/internal 07/03/2007 01:08:23 Apply patch for HARMONY-617([classlib][luni] HttpURLConnection does not support persistent connections)
modified pyang  /harmony/enhanced/classlib/trunk/modules/luni/src/test/api/common/org/apache/harmony/luni/tests/internal/net/www/protocol/http/HttpURLConnectionTest.java 07/03/2007 01:08:23 Apply patch for HARMONY-617([classlib][luni] HttpURLConnection does not support persistent connections)
added pyang  /harmony/enhanced/classlib/trunk/modules/luni/src/main/java/org/apache/harmony/luni/internal/net/www/protocol/http/HttpConnection.java 07/03/2007 01:08:23 Apply patch for HARMONY-617([classlib][luni] HttpURLConnection does not support persistent connections)
added pyang  /harmony/enhanced/classlib/trunk/modules/luni/src/test/impl/org/apache 07/03/2007 01:08:23 Apply patch for HARMONY-617([classlib][luni] HttpURLConnection does not support persistent connections)
modified pyang  /harmony/enhanced/classlib/trunk/modules/luni/src/test/api/common/org/apache/harmony/luni/tests/internal/net/www/protocol/https/HttpsURLConnectionTest.java 07/03/2007 01:08:23 Apply patch for HARMONY-617([classlib][luni] HttpURLConnection does not support persistent connections)
added pyang  /harmony/enhanced/classlib/trunk/modules/luni/src/test/impl/org/apache/harmony/tests/internal/net/www 07/03/2007 01:08:23 Apply patch for HARMONY-617([classlib][luni] HttpURLConnection does not support persistent connections)
added pyang  /harmony/enhanced/classlib/trunk/modules/luni/src/test/impl/org/apache/harmony/tests/internal/net/www/protocol 07/03/2007 01:08:23 Apply patch for HARMONY-617([classlib][luni] HttpURLConnection does not support persistent connections)
added pyang  /harmony/enhanced/classlib/trunk/modules/luni/src/main/java/org/apache/harmony/luni/internal/net/www/protocol/http/HttpConfiguration.java 07/03/2007 01:08:23 Apply patch for HARMONY-617([classlib][luni] HttpURLConnection does not support persistent connections)
added pyang  /harmony/enhanced/classlib/trunk/modules/luni/src/test/impl/org/apache/harmony 07/03/2007 01:08:23 Apply patch for HARMONY-617([classlib][luni] HttpURLConnection does not support persistent connections)
added pyang  /harmony/enhanced/classlib/trunk/modules/luni/src/test/impl/org/apache/harmony/tests 07/03/2007 01:08:23 Apply patch for HARMONY-617([classlib][luni] HttpURLConnection does not support persistent connections)
added pyang  /harmony/enhanced/classlib/trunk/modules/luni/src/test/impl/org 07/03/2007 01:08:23 Apply patch for HARMONY-617([classlib][luni] HttpURLConnection does not support persistent connections)
modified pyang  /harmony/enhanced/classlib/trunk/modules/luni/build.xml 07/03/2007 01:08:23 Apply patch for HARMONY-617([classlib][luni] HttpURLConnection does not support persistent connections)
modified xli  /harmony/enhanced/drlvm/trunk/vm/vmcore/include/init.h 07/02/2007 21:16:46 HARMONY-3934 : comments by Vladimir Beliaev: The attached patch does the following things:1. reports error if -XX propery format is broken (-XX:+key, -XX:-key or -XX:key=[value] is allowed), i.e. '-XX:gc.dll=' is a proper specification (of empty value) while '-XX:gc.dll' argument produces error ('initialize_properties' returnns the status code now).2. renamed 'vm.dlls' to 'gc.dll'". This required to do the following:    2.1 add a check that "gc.dll" property is always set (the vm_init code expects this property is set either to default value or it is set through command line)   2.2 remove "parsing cycle" of gc.dll (previously "vm.dlls" may contain the list of DLLs)I've tested DRLVM with different variants of related command line - works as expected.
modified xli  /harmony/enhanced/drlvm/trunk/vm/vmcore/src/init/vm_init.cpp 07/02/2007 21:16:46 HARMONY-3934 : comments by Vladimir Beliaev: The attached patch does the following things:1. reports error if -XX propery format is broken (-XX:+key, -XX:-key or -XX:key=[value] is allowed), i.e. '-XX:gc.dll=' is a proper specification (of empty value) while '-XX:gc.dll' argument produces error ('initialize_properties' returnns the status code now).2. renamed 'vm.dlls' to 'gc.dll'". This required to do the following:    2.1 add a check that "gc.dll" property is always set (the vm_init code expects this property is set either to default value or it is set through command line)   2.2 remove "parsing cycle" of gc.dll (previously "vm.dlls" may contain the list of DLLs)I've tested DRLVM with different variants of related command line - works as expected.
modified xli  /harmony/enhanced/drlvm/trunk/vm/vmcore/src/init/harmony.properties 07/02/2007 21:16:46 HARMONY-3934 : comments by Vladimir Beliaev: The attached patch does the following things:1. reports error if -XX propery format is broken (-XX:+key, -XX:-key or -XX:key=[value] is allowed), i.e. '-XX:gc.dll=' is a proper specification (of empty value) while '-XX:gc.dll' argument produces error ('initialize_properties' returnns the status code now).2. renamed 'vm.dlls' to 'gc.dll'". This required to do the following:    2.1 add a check that "gc.dll" property is always set (the vm_init code expects this property is set either to default value or it is set through command line)   2.2 remove "parsing cycle" of gc.dll (previously "vm.dlls" may contain the list of DLLs)I've tested DRLVM with different variants of related command line - works as expected.
modified xli  /harmony/enhanced/drlvm/trunk/vm/vmcore/src/init/vm_properties.cpp 07/02/2007 21:16:46 HARMONY-3934 : comments by Vladimir Beliaev: The attached patch does the following things:1. reports error if -XX propery format is broken (-XX:+key, -XX:-key or -XX:key=[value] is allowed), i.e. '-XX:gc.dll=' is a proper specification (of empty value) while '-XX:gc.dll' argument produces error ('initialize_properties' returnns the status code now).2. renamed 'vm.dlls' to 'gc.dll'". This required to do the following:    2.1 add a check that "gc.dll" property is always set (the vm_init code expects this property is set either to default value or it is set through command line)   2.2 remove "parsing cycle" of gc.dll (previously "vm.dlls" may contain the list of DLLs)I've tested DRLVM with different variants of related command line - works as expected.
add cc-classlib log20070702204825Lbuild.38 07/02/2007 20:48:25classlib
modified ndbeyer  /harmony/enhanced/common_resources/build/depends.properties 07/02/2007 20:39:54 Update Eclipse dependencies to v3.3 (final)Synchronize common_resources depends.properties and depends.xml with classlib's version
modified ndbeyer  /harmony/enhanced/common_resources/build/depends.xml 07/02/2007 20:39:54 Update Eclipse dependencies to v3.3 (final)Synchronize common_resources depends.properties and depends.xml with classlib's version
modified ndbeyer  /harmony/enhanced/jdktools/trunk/make/depends.properties 07/02/2007 20:39:54 Update Eclipse dependencies to v3.3 (final)Synchronize common_resources depends.properties and depends.xml with classlib's version
modified ndbeyer  /harmony/enhanced/classlib/trunk/make/depends.properties 07/02/2007 20:39:54 Update Eclipse dependencies to v3.3 (final)Synchronize common_resources depends.properties and depends.xml with classlib's version
modified ndbeyer  /harmony/enhanced/common_resources/build/depends.properties 07/02/2007 20:39:54 Update Eclipse dependencies to v3.3 (final)Synchronize common_resources depends.properties and depends.xml with classlib's version
modified ndbeyer  /harmony/enhanced/common_resources/build/depends.xml 07/02/2007 20:39:54 Update Eclipse dependencies to v3.3 (final)Synchronize common_resources depends.properties and depends.xml with classlib's version
modified ndbeyer  /harmony/enhanced/jdktools/trunk/make/depends.properties 07/02/2007 20:39:54 Update Eclipse dependencies to v3.3 (final)Synchronize common_resources depends.properties and depends.xml with classlib's version
modified ndbeyer  /harmony/enhanced/classlib/trunk/make/depends.properties 07/02/2007 20:39:54 Update Eclipse dependencies to v3.3 (final)Synchronize common_resources depends.properties and depends.xml with classlib's version

begin 644 execution_log.zip
M4$L#! H    ( )@>ZS;$^TX>3B4  '.% @ 2    97AE8W5T:6]N7VQO9RYH
M=&UL[5U[<^,VDO\_5?D.N,I=[61KAQ;UL&QODJIY>!+/S8Q]EI/=K7A*15.0
MQ#%%JOC0V/GT!X"41$D4V$T*$CV&*C6A+/0#C4:C ?P(_#2.)NXO/]WY@\=?
M?IH&])>?+!)&CR[]^6]#WXM>ALY?](R<-/[GGW_[Y?OO@M@[^_X[0LB? ^K2
MB'XF;_G_'6]$NJ<F&3HN#<DP\"?DS=GMV HFOO=X>Q<[[B"B8=1,'F\#&L9N
M%-X. G<V><E_$3P9UR_6S/I,7O-2G-<9F5CW-*$R'B;N:K'5;^',>SE@*MG1
M65&Q:>!/I87H0T0#KS^@Z\629VJ/??;\>\CK_>;#JU[OP\5K\K.TSO:8VO=^
MS&IMNU88NLZ=3(&D(H8?&E9@CPW[X<&PAR.ISH[G1,97QRLN%'O.@]Q&-#)"
M.G%"8^ $85'16&Y+47$CFDR-+U8!,ZZ=Q.""GD1!3&5,1DQYRXMLYKR!<R>5
M-W7CD>-!2R<5886-&0U"QY=;6AC&8)[NQX%- 48T$OZB"P%*<Q^F0>04%$Z8
MQMY?SG1*!T;BV)8K)QI1CP961 W'2XH;,RMPK#N09H6>!=,!US9I:7LZC:SP
MOI*7O?&]H3.*6?TWFSA;3GQ^\T,1_-ZSGUD ,(V.T>B;3?*B%WODHV,'?O@8
M1G02D@O/-GZ4<YL'!A+X?E0QG&QHNOSX(>/]+\<;^%]#(!$/0HS(L5I-J!@6
MLAC%))S98(KAB%$,Z%T\*B!A,9P$=.;P3LA(.IV.V2Q6S/8G4]^C7A0*,5/7
M?RQRU<@*>#B)?(/;7NI5A058-$W&,>;/(0MB=D0'\JX[+]<7=-*RQ26X?OW9
M9*W,VWCJ.C;KZ@/" LH7-N80SYI0UD>(PZP51 :Y2O]^??[K]7FO=W'YB=R<
M]VYZY/KW3\R,0\=CQ$,V3D2<"N:S8N!/_\J&K#YWK#[WE;YH_ELQ^*2_)VT0
MLJ1A)%K!8#D(SP6(Y0V(-;*XJF7DBLQB&W-YNTRF+$B__#*;1([(7D*64="I
M%5!YC IH/R?V;#"?;(2=2S;@!,Z !YHI]WL_#A/+.SQ&$7_(>L.0!M2S*8G\
ME </AD:J:[ 3?COEYCK>_3JGPCB]6:"_Z-5%9MUH,_Y+3GS_<W+/LAXV#@14
M] OVY6RG;BUT$-Z6!F^:$X;%H\U'(ZXXMZU)DE1")-G<D(?3"2&8_9=P%1)N
M7S.CWD]]EE>8V6>#<WXV1KCRI^\"%F7-Y=/S,D"/U<2EO8A.S>SS\S+"'Q\O
M6/PRY__/J7QQ"/-8DCI;'W7V'L02+;;G7S_\D&F[]W]\O+D@"4G(0CA.K>WA
MI!8VD"O$O]G,:9K,92/+35=+F/O>T7GK#HSM9'<+WGQHWU[.8M.W@B*_)A,\
ML7SA#ZAA2,3V6(XD2O(1>WLQ]A&&3DK>!5;P2+(1GL]K>,;FWXEL,OL3?5A3
MM099J30[K)IZEDUY:V>E)Y>[)UV63NY83YM8GC/<G+7M)W(M1OYZQ"V).A6C
M%B :3?WID NO1<Q:IF1K$6OY@XY7.EX]MWB52=/K$;&D"E6,6:'@'3+>3R73
MRLZBUN)6]B<=N73D>FZ1*YU?UR-J;55FWKG-<A%KOH@@C445XLN<_UILF?]9
MQQ4=5^H35S:V73)K9H=>*PLH;]>PN(8YRM; 772G^B8[%2N275>6C-/%F_D_
M%WZ*>5S'7IH$"'U(G""M7(?EVV3"\FCR_N*&O&!-9<5N5 "KV)52]8@<MU^<
M:+NNS' >-Y5\8?Q+S$9MUE/.7__^ZQF;HD31,NNBWLP)_ F?V!A&7IU7B0>^
M1_^KL%0O%6%;4^N.Y7@<MJ2 /9UQ=,<.&7^DT=@?G'L12X%LRW7O+/N>.*%X
MYB'"#U86LK//O-%>Y'CFFH2W3FC=B:0W*TM4!%P/< LS.91X,1L[ Q)Q.%?N
M=+2,A'D++/<H8,VP24=\+]&STU"HW5)*1[4-0+1O*?,HW[:V-M../.%UQ@*V
M'4\=YL5LJ!G&GBW &A6]6;VCO>$1=-/*J(HO'*Q8FDNM@$N+QC1-"#*[<+NJ
MDV[\ S1^!Q&:,_0[CLSSF!'&MDW#D.4I M^\.P'*?&L]XY!M:.TPWRB=293(
M$6[X$O" ]7W6_ ,^[(=\ 84.BO.&Q?K)*[Y"?",80!QU;AI>P' M;V0DM*02
ML0!0QW;D!Q@V8M(41CS\0<@651:+XJG14(0CU[^SW Q8D*=7//8@F,V57V[6
M+9[^VT19,9>#$8V=8-#G.P,O?B03D;%AF)8*C:MY!7#@X3,H;$N()8?"42+'
M,"MF 8I9#*VX 34AGIMDN;>Q",Q0#G$XI9X K2)=3%BU8E<MX&$\.M0=H#PL
MY;@8(3.58H.+J"L/7Q'(XU)F-QD>//HE;"#Q+V7PDG^(N7 9,6]*_@IEP=1-
MQT:PU&L:QDQ6Q@)XS\].]F!3Q9VQR/AT7O\[(R%E 7W>V_[X1_+:R!GYL.B.
M1YF(]<]]]8<Z>E[S&7E>QFV4>5X0>]KCI![7JN)Q"]+D_5BNA\B1^^?7UY?7
M_4^7_8^7U^?]=]>O/I[W$$XY\6=E!\OY0"M,G'8'A%5+=(B4<MD4APN_ !;K
MLR Y3$:ON^YNW34+:\D^UVG=]=Q3OH#P))=VVZU]+.VVNWII-S-OJ]AAGM3J
M7KL%[YLYPV+=U][6O3-_R$J"99T:-J-H8A?? R4AFV2\?HC&UBVQGY9H(\;=
MI]_O=,3-#K9Z/V6G^RFY2-$:8)LT DPCP+;\,O^H0X!]<?A^E&^\/[_9CQHY
MG?D@F"^J,5\U6GO0F"]%"P,:\Z5A/YN%-.9+-[[&?-7 MS3F2^:H&O.E,5^[
M"HT:\[6Y,:LQ7T\'!Z$Q7\\!\Z5A6AJF]23#DX9I5>T0&J:EETHU3.O;7HW5
M,"T-&M@LI&%:9;WSF8.#-$RK+BVA85K/-N)JF):&:6F8EH9ID7W M"ZO#@;3
M*C9#<GLC?;#=>)#>) *]<FVC*5,NX?S!$"7Z"93K:W+5FO%P<FSXTTBJ;G&%
M,IOT1\4WZ,RI,N/:4?&-*W.J-+@=;;^B)%LZ9YFQ@*+8#LM/3KP^!!*/-6#Q
MH""_!02^B8Y:MM(CDQZ9],BTX)$_,HD+3:<!C=:OGE.E1DW"%JMWQ;"E5\4U
M@+C^2]8:0*PQI)N%-(!8-[X&$-? MS2 6.:H&D"L <2["HT:0+P)&=( XJ>#
MT'L" .*=6N\YHY%30_[+<M*TAMLNY&'#'V([FD8V']Z+GQ_&6<.2I4G(_F#)
M]<#I0\'1&I:L8<G;"VE8LH8EUV:9[UF!Y#0L^1F!834LN2XMH6')SS;B:EBR
MAB5K\)<&?Q&5X*\>#6:LK\WO#]Z/*F5,<1!H<AC,I.H65TA#DQ<Q^Q 8/]: 
MQ0-#?:')J]]L/NB)"DJ"R0\_D#?^9.J(M&#(-?WJ!_?Y.8CJ%F%%^DNEP]N^
M?_<E1W/VS;8_DPZ)_,AR1=\.V3.YH\065:&#'.WG9)RUJ*=A2PJ)9<<^UZ7/
M"?JLN]-)[%I\+Q]#%T>.&THI)LW9!,5RPL8F&<&OU*-!DAZ]86$ZMRES6_\-
MX4*2<+^=O7E:WN[]R.DG&R&R"O."_,_].RMT;%C1J<6<%E32&;!\UQD^%I;V
MF UG%*-$NF=16)A9@6>P+K.%'UBC8FLP@LB9<$ (H.241:>^[<<LJP=6<6@Q
MK_)9VQ<X]]+:4< D>#.(.HX7L@F W,47C%,MY#TF99R690*&/J1\8'V%\Q?:
M6%$$*)H:,1JSN :U8DH#=9C$<3GN/HBGTF:%=/[]Q_$[QZN!&LD@+PV&'QSO
M?BT4GJT[Q';C-\I%QAY'MZ6SV?OMQ=AG =ERG;O "AXW?)7]74Q@V,#))U?K
M/].':97JBU!8S^HG47IK]9.?*U9_/G+4TP*+<6VK$18EJMIA'HAJ:HA%G-QN
MB461BJ:8CR?UM,1BM-MJB$6)BG;@Z5<];2 2PZWU%[]6K7N:#-6T_O-4;;L-
MYB4JVB%-9NIIAGFFM=4*\P+EC9"=+]3.""N3F3PCK!2H;(3,C**NILA.>B0&
MR1:K;):Z=I&UZ8C$'#OK)MGI4EWML3*EDQAEI5QYRRPGR[4S2&8>GV>'S,^5
MJK^R*E)'(ZPNVVPQQ6JA2@;)KG'4T1XK:S!;S+%2II(UEBM;=;1%9MUMBR4R
M)2K9(;N254=+K*RT;;'%2IE*UA +RG4T0[+2O:7^R8^5*IXL"=>QYNEB]9:J
MI[\6U?W\@=IQ5&(U+F5Q\>G=Y9D %:0TZ4[*B$;]:>#X@1,])F^65N-Q1JY>
M]7KG;_%<PAUH$J(T8685+ #E"LV_;:)3H#!K-<L>EZUN0EW>Y -:17I"C9<^
M?DP9V&*M&RM^C;RR_/Y7)QKW%RBY:MJL,BO?,KQ+O?]TT:?>K$JO3%F4U^.+
M[Z!-DJ4M+YG%10J3_S+]B+?*XI#\3!J-AFF:W2YYT66/W1^)V<@Y94,IO?B0
M%XW#T7;XT[=(7>PQY;V./MATRKLNG[%,RWK^*I<*0Z)+:6DE!'&%Z"C>_BX=
M#@7U?H=@R8Y48=K@#LNG'.ZP6IQWT%9>I:XF??YF;GD-DL<]M[5DUZU Y05I
MV3HO&)0WO!,NN=#2QE_E4EX;FQ^"L0N%-ACMURDDJP %BB]799S2;I'E4;XM
MYEPH-V)55023ZKI$P>-N]%DPVH%]'JJW%.=171//YX-.G[]>7U&?):?J6GVU
MJMN'\]B!]XBT;!?Z+#GM4BOQZ,<[U&[.<;_1;POJH$![3M6//?Z_L@;(L"C?
M+H))Y:%YE4O5R6<5HRPY[-D+MN,O *F<8%$](\RPJ9:<+K84JVJTPFB_+;)]
MF[MH9I$0]H/DU)*R\Y,5+A7FHBD?-CJEO*H,>?G<]M8P!>B4HLDMG_-QXO)K
MEPL.3W_Y=&)YZ/7Z/!X5-'$B#O/V"_/393GG+U9SZ>I:H; =Z-L?T*'%CU8J
MT'M>;!3X\90L%3 ;.6^XHZ7ON]?)X5!;M!=Y5>B,/ L=<S*D^ZXJ.O8O&FDU
M3I;N7ZML*KCL9MS>D4Z'B/L%<*OB"BS)RTV,):PJM5&&6>E)>P&[7>FWF"BQ
M@.2Z=(3OUU"^N]=XUYKN2D,>66//]>W":4NR\7)&Q/[6[L3NJB+"T_@\)A*G
M'NZP>RV9[BWH2)&,@+D+SY&3KV&5*5"&S2YV#!+H5O5]@X1/-8WNN._1':BT
MPFB?#B+!>NY#? &R$F"Y1;>:\ZK2#!O,RKO'V'<'81\2$HLY5'-2SJ'O?_7*
M+Z.O<JFF#6>Q,&^EN++*:9^=9AL"=A^R"U"G!7;+4)><QF_G5-XOLKP&[(? 
M+PW$RV&U&[TJ[4-M,-J-3I7WQW*9[<A>%?;)UOGLLV]OPS$# I(@[1]#4F"Z
MA!XUR8OY4\Y9>-\R$<"6^VSY/"!W>;D'.E?A=ARM'W"6'+N7_/R9W 26%P[]
M8$+X#/",F%VSV9E(AA)6T2N7\C7GH>,-A+5"@2=/3F=GS]$NZW4TFQQEZW4D
M:Q".^_#.I"42I+T13OQ[FIP"QW_(.8II+PVV5".\%0?^TQS+BT?[<^9,H.XI
M"?TXL.GR+8*#:O;)Y\,]1@7V7\);R+D=V;?7L??.\2S7^8L&X:5WSN+\S;QY
M2,S$$Y;+^S,:! X;R(E%!G0:T.0XPU=7%[FG<V:UNZ9IVQ,.C28O_\TL&9W-
MF7#$-3\^G6/)^=E01=QZOC@X<1I':1,P#5D0$=5D"C%.L1=:0TK\J3CYQ?>*
M>>9KN&2Z7;_5;QG?3M89#0$%0G:+A+0.'2/1),_]#J3);3B.HP&;;VR/DIGS
MN]3K<S37YXCWF+<69=(N/7[K3(Z")#TPK-QK2.L"9*<>57AE:4/,VDM+&[]O
MO+94@\-.]9&PW^21L$D'I),[UE$FEN<,J?0HQP-&@G<6Z^'G02![E[]"'%BR
M5Q@%,D)R8D#F5QT!= 30$6 M EP4'PI6(0 LN"OL_TL9.=U_^:/N_;KWUZ?W
M%TVNI,7YO\F9PH*@#C.P]"#N54TND[DX[[!L#CUS_#A,_,&)TALNEW<7L[#"
MB0RQDF!,K6A<.S_4O?6;[*UKO2EY+_Z+$_7]] 4QYKM\DV/[\+W]E_EG%[<I
M]+AVZ6HJZSUO7(??5CV_T8&\2#&2DN7S76I3QAI[N-LAB4G9NQU82TK5+:Z0
MN.RGZ)8%&@PAY22KYN2W5]<?+S_]YV7SM"L!.CG^$4]J1C0(=R"K=6I*9(WL
MHZNQY47^Y'H>J!<KKE*J?U'K'D-2W#S+S_:R\SL6N N1,_*;(V&;[,(4E%IC
MR!)5^Y[7!L(74'B-O1CZ7-\:T,!XPY\Y]:\T>DO9+_SJ=_%'B.RJG"2*G<\/
M#+CP^$463K(<#S5*54X2Q3[XHP_B":L'@% B]I,?O?-C&7 Z7VHQG41H+PIH
M&):K+HQV3?CBF(AEJZ$Z0SGZK4K,MX%*ZH @WZK"IZMSG% IP9J8D<UU?,7O
M2X,( 17/%9'T.;B,HO(Y0OS EJ C5@7(R^8P#ZP1O_@9RK^P>)X("E9?6G23
M]8?+'I"SM&0.8P?6(PJ+;K+^*'UU=X6UO&@.:Y:\.C<)[!<J D2R*0K8>8M*
M;C)>SY;^+Z8QA0:H<O2;2C!J<74]U&\!Y7.$Y&_&0T5BJ3<52,8QICM0)*!\
MCI!'SQX'OL?T'"P51E2T#(---1(7[XG7D$(VF "%P\G61/(5&D-LFJSD9A"Q
M"-+D^3W[EUP+9- 9 5R@EE7Q,AHCM"HHO2[ -UX%@?4(#::P\FM"OGB.P5.Q
M#\EZ-D0.F&1-%)M&^\,)Z^?!H_'6C^]<4'C 4$D$7L#&:#")1-25:^7=6B07
M5D D$0<,0& 2B2C6G?VO6&$%1!)Q?U!;^M)AOKPBJD*!Y7P31ELHO(2? @@+
MQ99P(@#AFM@I#89&LB'PT?(>%Q,Q4+)5@A@JOC]@#^-*2A2QR%,EFSOVG,D4
MYG-HTCS1/3JC@>4B<ET46:Y(D?V\\0./!CTV(,.%@@DA8ON2-< "P3+2/-$B
M\'$W 4L$4$@%E>A1*%J@<&1_*L%!JLAV8ER^MTU-I'(!';HL5!J_TN@CC<8^
M:*$.0;0F;HZM,  XRPVQ)8AEXJ7@+KEP"*E,M Q5(I<,H)0)_N#;N8L.>;[7
MDIRILD6[;>SS%1,1S'CMC%@L8W]_'0^'L.D*EC)?,&I]#TZ3+TRT&RCO!A+D
MB_GH/"!D2$OG"Q!KP@@1!>6W"'GT0 N[H.+Y(A#)!90B7Q!\F@ DR!?#=Q1_
ML\+QQ)I"EU^PE&N"DW?+#+XVU4MCP&^^#_(--&F^Z M/8&4HJB/C:;<)3P,Q
M=/3"T>4+Y0-\ZH?05L92Y@ON\2/($>(*RN<+2?1#C8U82IG@R\N/:)%2FC5A
M<>2XQEOIR[!+*8#"N>S]J\"949>.*"B30Q#EB;L*?)!7  KGL4]&=_C0B2!:
M?P.3I*_HJ7X1,P,*7'L1LP;8-(W@TPB^W-XBZ7SI1P&"CVG(>K)OO#^_V8_\
M,O4_#&:/:LS>=ED:LZ<Q>RC%-&9/8_8T9D]C]L!"-&9O&VN-V=.8O35Q&K,'
M5D!C]@J%[P.SE[<9!E$/#0O4F#V-V8.(TI@]C=DK+5QC]K:(UI@]C=G3F#V-
MV2M6I*QXC<6#BI<#ZLHFY/O#[.5I6 (_IPC=)Y6I,7L:LZ<Q>QJS5R!98_8T
M9D]C]J12-&9/8_8T9D]C]C1FS[B\TIB]5<R>/]68O>VR-&9/8_90BFG,GL;L
M:<R>QNR!A6C,WC;6&K.G,7MKXC1F#ZR QNP5"M>8/8W9TY@]B#"-V=.8/8W9
MDXC6F#V-V=.8/8W9*U9$8_8VQ&K,7J&&&K.W(E-C]C1F#UI<8_;D\C1F3V/V
M"@5KS)[&[&G,GL;L:<R>QNRM=K[THP"SEU%M/_++U/\@F#UF&:FZQ17:%V8O
M=&6KZR/[B.^":TS@;C&!/Y";L1.F^7TRNK&O,QH\BO8 ]ZV$P5$RE);6IMA-
MEQ]P>J"QBQJ["-!#8Q>+A6OLHL8N:NQB(?MG@%W4 $,-,(0KH &&A<(UP% #
M##7 $"), PPUP% ##"6B-<!0 PPUP% ##(L5T0###;$:8%BHH088KLA\>@!#
MC?P#BM#(/XW\T\@_L&"-_-/(/XW\T\@_C?S3R+_5SI=^%"#_>C28T8!,_ $E
M[R_TB7VKZ+\PF$G5+:[0-WUB7[<EF6XO8"'/ 0>X^0$/PCO'UVD G ; P81J
M )P&P&D G ; ;6.L#^^3B]+8.HVM@PG1V#H0\*T49BYY?F_!=@$UMDYCZR"B
M-+9.8^M*"]?8NBVB-;9.8^LTMDYCZXH5T=BZ#;$:6U>HH<;6K<A\>M@Z?7@?
M1HB&\&'%: B?AO#)Q&H(7Z%@#>'3$+X#0OA6OPE>_8!R5%H.MNK/R?W "3Z3
M9+8_(.S+V4[1:*Q(5M?;1)/P=ARMP\7^_!*S0)K\_IG<!)87#OU@0B)G0L](
MN]OJ=B:24?-FG*"V2,*!'S.U8V"=K"JWK/WI@[%9J]5O2_(S63';GTP=E[Z\
M9ZY'W9<YY??2=HGX16U#/PYLFM,$XM%FB@BU>>=KD:2PP*&%)/(/H]=>#91V
M?(AYS./._@Q4J-<G/V(=K.<+ .LTCE*=8A;6_(#X,S86.@-*+#*@TX FL-=7
M5Q=&$<=KFOHQX5A/\O+?K.[1V9R)XWN$]6_&-+(<-RSDAK$/^R^I>V*(6\[H
MUK6\T:T 9+WR/#\2&H0+4!NO+JNS)UBQ"C+-8B^TALP&4QHDA4O6>,E46M\_
M!VSDC.AG\I;_G[L)\U>1PS\J=XY;9I#A)DQJ]=M+UG!3*ZA;6!)!6*9W$'L2
ME6N Y=:(]V\2\?YRS?%>WEF1/3XXP)TER"31*D6YQP(Y_L9UJ!<M@.[D!6LR
MBV6O/^Y'JS)6V0/D/8TU6<S[%Z?JB;<_\%-1:3A_RX"%5)8 ^ 4'U/*_'/$Q
M[(@U(,^)7PT&#A^6+)</8G\OCR+?U(:-?)%UQ\S)N\Z8R23^,**265"!<J99
MH%T!?:M=D?ZT&GV[49&^8OW;S5V\^=#NM"0%ERKT'L.(3A:9495XM?S4)$^X
M9;W7X#$N+Y7C\\_E H(?C QK:C&I1JJ2P<UCC*A' \<.$\1_ O#.7PJ;<[P1
M'8N-!F>D:?Z#O&/Y7\RF+6>D\0\B-G^2QQO6[H2ZUC2D U;2:!RS:13-69'.
MXWL,Y=LPFJU. 5\VE?[U#6N0 6%Y(1_P9WP",++[UF#0_TJM^W[@^U$_I%&?
MC1G!XXN<02)'2;,#KWSSQ 17_@3*]MAHM+M@MBVX28]/X&S!1C!1;,':FD91
M\V=:#&Z"5O,$SO84SK?;@/>"5AON8&9;A14P_H5A>]P$LT78%A-A,*YP"H];
M"&5;\(B 8@LW+=B]<-J"XQ?.OQ!#0@V,@-%6D1&Z\ C65:,M8LC!-)DB3\!H
MBS "PL$P@XXB;3'A5E&3J1ISX(,#Q@BJ(IB:4*.JEQU\+%,T\F+F(8@4'\RV
MC0KCF.YP>$_ ##H(MF9#C144):**QDA,6F/"9U"*VDQ1$H;I#Z>(N0,XPS6-
MYBE\?&AB/!<3%A 9>0<S^H*]P3PVS!.$PBL-9TH8GQHG9E&G.._=B.7 9+TK
M79'DTIKDW:N+#^=O=^U+[1/$DH2JV3@X7!T;3;BZ;; KG1A=A.LCHF '$:Y.
MX>N3I\9Q&QY9$/JV&\?P5D,,M2TX6X2V)L(9X*N_3-LNHM4021><*\*T)L(3
MFHC@>F(BEL 1C8:P0@N1*!]WX"Z&8-LQ$1U"31J#T!;5(1"^<-R%)W.80>+T
M&+Y<B9G=P*T -D(+Y6%@94V6S"E9#0>&A;RDH@: $PW+T;"<@\-ROC@<ANX;
M[\^?]]F3>4 <JH$X&HCS5( XFY_:0&+H$X'$F,8Q)K?$)&N%((.#0V),XP2Q
MV05.*;M&!Y'[(4 FB)9"P():'7BR#E:V:31-.%M$_HM9(,%@8C#= (Z):1FM
MIA(S8- K-=B@5+1_A%@OQ^S-(98X,6P1ML7L12"TQ:!B$-IB]N80?HLQ H(M
M2EM%1H"SQ6QV*=KQ4V5;-:@850YV<-LJBK>*_/9I(3$5^6T=0HT:^ I"6Q1;
M);8U%8!BFD:[H08CI@C,A3"MHC$'!8I1%1.>U*"#< 54FQU\B,1L>#00$R@$
M* :#<\6 8M3HVS Z&,P1V!M.FKBI)!@4TSX![%KN&15CFIBA (6*P4QPU:!B
M$"L^&!>%@VU,W%8J(KR>M.'+:7"T35L)SAWUSA9B_%;TWAKBE2W,HC+&P\#=
MH8E:5T5LU9L(& 0<7G%J'".L (?:-%'ZPK$V310H!H->P: N,4B(W2MKLF%6
MA2\POEU$6@"V0LMHG2J8W)@HP" "CGEZHJ #-W& X9UOC6FLC<;::*R-'&MS
M>:6Q-FM8&W^JL38::Z.Q-E6Q-JP?/0VL39-E[AW$UC(F76L69:T'!]L<XUZ_
M B>5[5-F507+#DVC>PQG"S9#U^B:"A8>S&.CB5 7@^7';'. Y_)F"Z4O''%S
M8C0P,RTUKW:@WH&&S]\0&QV8MX<4:7OXE^P1B[V8?0X$Z@BQOF\B%O@P>Y^(
MV(@P F;S$Z.M(B,@>@-B(PVC+68W40UZ [5J>' 'P[RSCM$6803,*Z"G"MXA
M:Z#21<S**6);"3/F(&R+,$)Q;JN\.RC"\: PJ6J6YE6\NVRJB6#\[7B$NHIV
M;VL \\3L-3=V^<*&\JAP^-//%$%N,*=;'!A6;^*.^ !GN$WC!/&B"09Q<XS9
M7X2O*Z .^4 =0X.:J8,1-ZT3 $A@SXB;-@J[@4'<M#!\P>'J!'&0+^(U,\PI
M- C S0GJ_344*@2Q* '?K#XQFBT%+\8UC X&>HC85\:<E8)0MXN8+<"7EUO&
M<5?!6A*S N+8'$1ZA&$+1UITC 8&Q8+H%"<(I 4<=<,ZL:I#8Q 3<T631P3N
MIHU AF!P-P@G@P\_;=3;K8B @\GHX)G7J7':4K"N9J+B(V;+ >8+&G>C<3<:
M=Y./NW'X':O3@$;2FY=WJ,?3P=TPTTCU+:Z1QMUHW(W&W;!^]#1P-QWC!#$C
MP+P!6G_4C=DR.BIRRE:WK6;[\[B%.J85;HAFB^65B#->P*]YM-0<QM+LX(X9
M!T_H.T:[A5@U J]'FXU3W$N*B!5IS/H.@JT*[(VBDS]--2 9W&H_BJT"6 ".
M+6*50-4^J(HWK7%OUV%>@U,!OC%1>#SX+HJ:?46<MBA/4+"2C LU" ?#7".#
MT5;%'5"XZRTPW4$%^ 87:A!&P*SVHF*" F@$SF\5]3+,6(;(H#%L5=P!9:HY
MS[R%W,D]N!64@&]PO1<.OC%1H&),*HKP7$6!')/<*6HSQ+8H2EL%LSX3<)5T
M.?0-8M<.[+<( \"3\;9QBD!\HH WQ?<TE0'>-"%[K?L^Z@:UO0[?^41&0 3P
MIHO8446<=8.YZQH!O8&\<E<BM+:,+@(A@X#>=(QC!<B;-@[*AKAQ$@6V@+/%
M1!;, C/FN S$0AW&><'&[6#0J'"H1;.#0G?!D3<XV#<<>=-%H>? ;-MJ+@_&
M+;<CM,4<J(X WAPK&H".,8@>1)_ =#5XGVBJF=YT4<Z \+%3S#V!6]B:&X >
M.)B'O.!ID1]':_M@-0"L:%B/AO4<'-;3H\&,!H1ONY/W%_I(G35H3QC,I/H6
MUTA#>S2T9U_0GA_(;Z^N/UY^^L_+9KO3DA1<JM![#",ZX7*_04 1Z[U/ U!D
MME 0"LQ!/L5SAX-#BCHFZF!3!*3(.$9LN6&NHD(LJ<+-H ;_Q'Q+T8L;F!D.
MZHTYS&5GX/5UU-G7BDZP471K ^;E:36NH.H8'T6'%"#VH ]_<982*%$#A4M!
M&$'%U2BHHYDQ-THBPCCF%!\%*\T--0@'=?=0(?:)%1U0H,BVF$-\$'L9J)ZK
MYOCS)W6(C[(C5@Y^-]WA+Y94 @=E^2("! B?X1RC=CAK<(B/HCN8,!CQAAI?
MJ,&]68@\%#/L(-AB$@7$3MFA3_%I(/ ^F%NS,&<V(-P6<_,(7-T.ZKHG.)"H
M:[01;Q+!@41F&W"3Q9Z!1$T4GA1S@D^SH>($GR[J!B8$XJ>#BJV(('C:5'+8
M3EN5OFH.VS%1[XXAU$5=PH0X; =S:@OBL!TE.'Z6S"'FSG"41PNU^(<Y; =S
MO@H<\M-&);6*SM%4=/<E0EL,R@-SUD[Y<^WD3J9F)H(ZWQ\.^3%1L#)$%S[M
M*)DW 4]ES,LM5K\EVWA9+,4:BB)AF!1C; /+"X=^,"$\@>'1H7W2GH08$K/+
MYI)8$A9@U9-T3MH;BJU^$SNF$F,ES_,MV[]O_Q20D?_-HDC"R(KBD!23P:05
M[3*_<1WJ10NX"GDQH$,K=J,?MZ:JJ_3SVZ/>G]\@*2ZOH!29DW* %&L@'$#7
MR/*X<JD5<DB,-R #&K%>2@>L[X3,+"&)O0'CK&JG_2C=:>?[^=2._.#1D&F=
M(3TK=N6D"M*"KW^_^/ VUUPED4'BD2.\SEJG)V=B;WSHNZ[_58"/>,PCOFW'
M0<!,_'7,04CT@=IQQ'^.QDY(7,>C9[M3I6_[DZGO,9\72G5;!],)BL,3,#FN
MZ_$9Z?F3.=)H*-Q2UI8W?F2Y:;AKF6TR<;R8T9*F&$U\;[ 6_=ZS?\EUXB/$
MG/]F^]-'5CWV+Z]^]]044+&01+ZTSFEW26HLHF?*D/SYES-ECL9+<8[LFQRX
MLLFIWVPTNHVNV>@WFZVFP3A\_]UWO!739O*].5;UJQ.-69.MM.^#3:>\S-EW
MI1L^7UUK8$U9C\UJ.O];XFL=X6L!)5_Y/\M2HBUY(O#=]]_]=&3]\M,1"W;L
MWSM_\,C^-XXF[B__#U!+ 0(4 PH    ( )@>ZS;$^TX>3B4  '.% @ 2    
M          "D@0    !E>&5C=71I;VY?;&]G+FAT;6Q02P4&      $  0! 
)    ?B4      
end


Mime
View raw message