harmony-alerts mailing list archives

Site index · List index
Message view « Date » · « Thread »
Top « Date » · « Thread »
From nom...@intel.com
Subject [build-test alert] BUILD FAILED Windows server 2003 msvc: jdktools_test
Date Wed, 11 Jul 2007 04:15:19 GMT
BUILD FAILED:
	Ant Error Message:
C:\cruise_hdk\cc\projects\trunk\working_jdktools\build.xml:242: The following error occurred
while executing this line: C:\cruise_hdk\cc\projects\trunk\working_jdktools\make\build-test.xml:60:
The following error occurred while executing this line: C:\cruise_hdk\cc\projects\trunk\working_jdktools\make\properties.xml:319:
The following error occurred while executing this line: C:\cruise_hdk\cc\projects\trunk\working_jdktools\modules\samsa\build.xml:142:
Execute failed: java.io.IOException: CreateProcess: C:\cruise_hdk\cc\projects\trunk\target\hdk\jdk\jre\..\bin\jarsigner.exe
error=2

Date of build:	07/11/2007 11:06:37
Time to build:	7 minutes 58 seconds
Last changed:	07/10/2007 21:46:56
Last log entry:	Fix Harmony-4402 ([classlib][luni] Locale("no", "NO").getDisplayLanguage()
returns upper-case value instead of lower-case if localized for Norwegian locale)

***********************************************************
Errors/Warnings:	(100)
            

========================================
Testing jdktools binaries...
========================================

Compiling JPDA tests
Since fork is false, ignoring memoryMaximumSize setting
----------
1. WARNING in C:\cruise_hdk\cc\projects\trunk\working_jdktools\modules\jpda\test\common\unit\org\apache\harmony\jpda\tests\framework\DebuggeeRegister.java
 (at line 57)
	registered.add(debuggee); 
	^^^^^^^^^^^^^^^^^^^^^^^^
Type safety: The method add(Object) belongs to the raw type LinkedList. References to generic
type LinkedList<E> should be parameterized
----------
----------
2. WARNING in C:\cruise_hdk\cc\projects\trunk\working_jdktools\modules\jpda\test\common\unit\org\apache\harmony\jpda\tests\framework\TestOptions.java
 (at line 28)
	import java.io.File;
	       ^^^^^^^^^^^^
The import java.io.File is never used
----------
----------
3. WARNING in C:\cruise_hdk\cc\projects\trunk\working_jdktools\modules\jpda\test\common\unit\org\apache\harmony\jpda\tests\framework\jdwp\PacketDispatcher.java
 (at line 113)
	eventQueue.add(eventPacket);
	^^^^^^^^^^^^^^^^^^^^^^^^^^^
Type safety: The method add(Object) belongs to the raw type List. References to generic type
List<E> should be parameterized
----------
4. WARNING in C:\cruise_hdk\cc\projects\trunk\working_jdktools\modules\jpda\test\common\unit\org\apache\harmony\jpda\tests\framework\jdwp\PacketDispatcher.java
 (at line 248)
	replies.put(new Integer(replyPacket.getId()),
                                replyPacket);
	^^^^^^^^^^^^^^^^^^^^^^^^^^^^^^^^^^^^^^^^^^^^^^^^^^^^^^^^^^^^^^^^^^^^^^^^^^^^^^^^^^^^^^^^^^^
Type safety: The method put(Object, Object) belongs to the raw type Hashtable. References
to generic type Hashtable<K,V> should be parameterized
----------
5. WARNING in C:\cruise_hdk\cc\projects\trunk\working_jdktools\modules\jpda\test\common\unit\org\apache\harmony\jpda\tests\framework\jdwp\PacketDispatcher.java
 (at line 283)
	commands.put(Id, command);
	^^^^^^^^^^^^^^^^^^^^^^^^^
Type safety: The method put(Object, Object) belongs to the raw type Hashtable. References
to generic type Hashtable<K,V> should be parameterized
----------
6. WARNING in C:\cruise_hdk\cc\projects\trunk\working_jdktools\modules\jpda\test\common\unit\org\apache\harmony\jpda\tests\framework\jdwp\PacketDispatcher.java
 (at line 354)
	commands.put(Id, command);
	^^^^^^^^^^^^^^^^^^^^^^^^^
Type safety: The method put(Object, Object) belongs to the raw type Hashtable. References
to generic type Hashtable<K,V> should be parameterized
----------
----------
7. WARNING in C:\cruise_hdk\cc\projects\trunk\working_jdktools\modules\jpda\test\common\unit\org\apache\harmony\jpda\tests\framework\jdwp\VmMirror.java
 (at line 1829)
	frames.add(frame);
	^^^^^^^^^^^^^^^^^
Type safety: The method add(Object) belongs to the raw type ArrayList. References to generic
type ArrayList<E> should be parameterized
----------
8. WARNING in C:\cruise_hdk\cc\projects\trunk\working_jdktools\modules\jpda\test\common\unit\org\apache\harmony\jpda\tests\framework\jdwp\VmMirror.java
 (at line 1897)
	vars.add(var);
	^^^^^^^^^^^^^
Type safety: The method add(Object) belongs to the raw type ArrayList. References to generic
type ArrayList<E> should be parameterized
----------
9. WARNING in C:\cruise_hdk\cc\projects\trunk\working_jdktools\modules\jpda\test\common\unit\org\apache\harmony\jpda\tests\framework\jdwp\VmMirror.java
 (at line 2117)
	fields.add(superClassFields.toArray()[i]);
	^^^^^^^^^^^^^^^^^^^^^^^^^^^^^^^^^^^^^^^^^
Type safety: The method add(Object) belongs to the raw type ArrayList. References to generic
type ArrayList<E> should be parameterized
----------
10. WARNING in C:\cruise_hdk\cc\projects\trunk\working_jdktools\modules\jpda\test\common\unit\org\apache\harmony\jpda\tests\framework\jdwp\VmMirror.java
 (at line 2127)
	fields.add(field);
	^^^^^^^^^^^^^^^^^
Type safety: The method add(Object) belongs to the raw type ArrayList. References to generic
type ArrayList<E> should be parameterized
----------
----------
11. WARNING in C:\cruise_hdk\cc\projects\trunk\working_jdktools\modules\jpda\test\common\unit\org\apache\harmony\jpda\tests\jdwp\Events\ExceptionTest.java
 (at line 187)
	long frameID = reply.getNextValueAsFrameID();
	     ^^^^^^^
The local variable frameID is never read
----------
----------
12. WARNING in C:\cruise_hdk\cc\projects\trunk\working_jdktools\modules\jpda\test\common\unit\org\apache\harmony\jpda\tests\jdwp\ThreadReference\FramesTest.java
 (at line 449)
	frames.add(new FrameStruct(frameID, loc));
	^^^^^^^^^^^^^^^^^^^^^^^^^^^^^^^^^^^^^^^^^
Type safety: The method add(Object) belongs to the raw type Vector. References to generic
type Vector<E> should be parameterized
----------
12 problems (12 warnings)
JPDA exclude list: C:\cruise_hdk\cc\projects\trunk\working_classlib\deploy\build\jdktools.jpda.exclude
Running JPDA tests
  Debugger JVM=C:\cruise_hdk\cc/projects/trunk/target/hdk/jdk/jre/bin/java
  Debuggee JVM=C:\cruise_hdk\cc/projects/trunk/target/hdk/jdk/jre/bin/java
The GC did not provide gc_add_weak_root_set_entry()
SAMSA exclude list: C:\cruise_hdk\cc\projects\trunk\working_classlib\deploy\build\jdktools.samsa.exclude
Running SAMSA tests
test.jre.home=C:\cruise_hdk\cc/projects/trunk/target/hdk/jdk/jre
Run jdk/bin/java -version in C:\cruise_hdk\cc\projects\trunk\working_jdktools\build\test_report
java version "1.5.0" 
pre-alpha : not complete or compatible
svn = r555148, (Jul 11 2007), Windows/em64t/msvc 1400, release build
http://harmony.apache.org
Run jdk/bin/javac -version in C:\cruise_hdk\cc\projects\trunk\working_jdktools\build\test_report
Run jdk/bin/javah in C:\cruise_hdk\cc\projects\trunk\working_jdktools\build\test_report
Run jdk/bin/jarsigner in C:\cruise_hdk\cc\projects\trunk\working_jdktools\build\test_report

***********************************************************
Unit Tests: (129)
        
All Tests Passed

***********************************************************
Modifications since last successful build:	(54)
            
modified tonywu  /harmony/enhanced/classlib/trunk/modules/luni/src/main/java/org/apache/harmony/luni/internal/locale/Language_no.java
07/10/2007 21:46:56 Fix Harmony-4402 ([classlib][luni] Locale("no", "NO").getDisplayLanguage()
returns upper-case value instead of lower-case if localized for Norwegian locale)
modified tonywu  /harmony/enhanced/classlib/trunk/modules/luni/src/test/api/common/tests/api/java/util/LocaleTest.java
07/10/2007 21:46:56 Fix Harmony-4402 ([classlib][luni] Locale("no", "NO").getDisplayLanguage()
returns upper-case value instead of lower-case if localized for Norwegian locale)
modified tonywu  /harmony/enhanced/classlib/trunk/modules/archive/src/test/java/org/apache/harmony/archive/tests/java/util/zip/ZipOutputStreamTest.java
07/10/2007 21:45:00 correct typo
modified tonywu  /harmony/enhanced/classlib/trunk/modules/archive/src/main/java/java/util/zip/ZipOutputStream.java
07/10/2007 21:02:31 Fix Harmony-4405 ([classlib][luni] Compatibility: ZipOutputStream.write(null,
off, length) exception throwing order differs on Harmony and RI)
modified tonywu  /harmony/enhanced/classlib/trunk/modules/archive/src/test/java/org/apache/harmony/archive/tests/java/util/zip/ZipOutputStreamTest.java
07/10/2007 21:02:31 Fix Harmony-4405 ([classlib][luni] Compatibility: ZipOutputStream.write(null,
off, length) exception throwing order differs on Harmony and RI)
modified tonywu  /harmony/enhanced/classlib/trunk/modules/luni/src/main/java/java/util/GregorianCalendar.java
07/10/2007 20:42:19 Fix Harmony-4372 for backward roll operation([classlib][luni] GregorianCalendar.roll()
works incorrectly around end of year if MinimalDaysInFirstWeek is 4)
modified tonywu  /harmony/enhanced/classlib/trunk/modules/luni/src/test/api/common/tests/api/java/util/GregorianCalendarTest.java
07/10/2007 20:42:19 Fix Harmony-4372 for backward roll operation([classlib][luni] GregorianCalendar.roll()
works incorrectly around end of year if MinimalDaysInFirstWeek is 4)
deleted tonywu  /harmony/enhanced/classlib/trunk/modules/jndi/src/main/java/org/apache/harmony/jndi/provider/GenericURLDirContextFactory.java
07/10/2007 16:55:54 remove redundant class
modified pyang  /harmony/enhanced/classlib/trunk/modules/beans/src/test/java/org/apache/harmony/beans/tests/java/beans/PropertyEditorSupportTest.java
07/10/2007 14:12:07 Fix 2 bugs in PropertyEditorSupport: 1. setSource(null) should not throw
NPE(the original tests fail on RI, also updated accordingly), 2. firePropertyChange should
fire an event with the source only
modified pyang  /harmony/enhanced/classlib/trunk/modules/beans/src/main/java/java/beans/PropertyEditorSupport.java
07/10/2007 14:12:07 Fix 2 bugs in PropertyEditorSupport: 1. setSource(null) should not throw
NPE(the original tests fail on RI, also updated accordingly), 2. firePropertyChange should
fire an event with the source only
modified pyang  /harmony/enhanced/classlib/trunk/modules/beans/src/test/java/org/apache/harmony/beans/tests/java/beans/StatementTest.java
07/10/2007 13:52:12 Add several testcases to Expression and its superclass Statement, including
the subclassing Expression, overloaded method recognition, empty array, array with null element,
etc, and fix Expression/Statement to pass these tests. But there is still 1 thing to be done,
tracked by HARMONY-4392.
modified pyang  /harmony/enhanced/classlib/trunk/modules/beans/src/main/java/java/beans/Expression.java
07/10/2007 13:52:12 Add several testcases to Expression and its superclass Statement, including
the subclassing Expression, overloaded method recognition, empty array, array with null element,
etc, and fix Expression/Statement to pass these tests. But there is still 1 thing to be done,
tracked by HARMONY-4392.
modified pyang  /harmony/enhanced/classlib/trunk/modules/beans/src/main/java/java/beans/Statement.java
07/10/2007 13:52:12 Add several testcases to Expression and its superclass Statement, including
the subclassing Expression, overloaded method recognition, empty array, array with null element,
etc, and fix Expression/Statement to pass these tests. But there is still 1 thing to be done,
tracked by HARMONY-4392.
modified pyang  /harmony/enhanced/classlib/trunk/modules/beans/src/test/java/org/apache/harmony/beans/tests/java/beans/ExpressionTest.java
07/10/2007 13:52:12 Add several testcases to Expression and its superclass Statement, including
the subclassing Expression, overloaded method recognition, empty array, array with null element,
etc, and fix Expression/Statement to pass these tests. But there is still 1 thing to be done,
tracked by HARMONY-4392.
modified tonywu  /harmony/enhanced/classlib/trunk/modules/luni/src/main/java/java/util/GregorianCalendar.java
07/10/2007 13:31:10 Fix HARMONY-4384 ([classlib][luni] Losing Calendar.set(...) settings during
consecutive set(...) calls)
modified tonywu  /harmony/enhanced/classlib/trunk/modules/luni/src/test/api/common/tests/api/java/util/CalendarTest.java
07/10/2007 13:31:10 Fix HARMONY-4384 ([classlib][luni] Losing Calendar.set(...) settings during
consecutive set(...) calls)
modified tellison  /harmony/enhanced/classlib/trunk/modules/luni/src/main/java/java/util/HashMap.java
07/09/2007 19:17:27 Fix for HARMONY-4064 ([classlib][luni] Performance improvement of java.util.HashMap)
modified tonywu  /harmony/enhanced/classlib/trunk/modules/luni/src/main/java/java/util/GregorianCalendar.java
07/09/2007 17:31:42 Fix HARMONY-4372 ([classlib][luni] GregorianCalendar.roll() works incorrectly
around end of year if MinimalDaysInFirstWeek is 4)
modified tonywu  /harmony/enhanced/classlib/trunk/modules/luni/src/test/api/common/tests/api/java/util/GregorianCalendarTest.java
07/09/2007 17:31:42 Fix HARMONY-4372 ([classlib][luni] GregorianCalendar.roll() works incorrectly
around end of year if MinimalDaysInFirstWeek is 4)
modified leoli  /harmony/enhanced/classlib/trunk/modules/luni/src/main/java/java/util/AbstractSequentialList.java
07/09/2007 17:25:36 Apply patch for HARMONY-4395([classlib][util]AbstractSequentialList.set
should throw IndexOutOfBoundsException when no elements exists.).
modified leoli  /harmony/enhanced/classlib/trunk/modules/luni/src/test/api/common/tests/api/java/util/AbstractSequentialListTest.java
07/09/2007 17:25:36 Apply patch for HARMONY-4395([classlib][util]AbstractSequentialList.set
should throw IndexOutOfBoundsException when no elements exists.).
modified hindessm  /harmony/enhanced/classlib/trunk/modules/portlib/src/test/native/hytime/shared/hytime.c
07/09/2007 15:49:09 Allow this to compile with -Dhy.no.thr=true.
modified leoli  /harmony/enhanced/classlib/trunk/modules/luni/src/main/java/java/net/ProxySelectorImpl.java
07/09/2007 15:23:12 Fix bug for HARMONY-4281([classlib][net] test tests.api.java.net.ProxySelectorTest
failed if proxy defined in the classlib\depends\files\net.properties)
modified leoli  /harmony/enhanced/classlib/trunk/modules/luni/src/test/api/common/tests/api/java/net/ProxySelectorTest.java
07/09/2007 15:23:12 Fix bug for HARMONY-4281([classlib][net] test tests.api.java.net.ProxySelectorTest
failed if proxy defined in the classlib\depends\files\net.properties)
modified pyang  /harmony/enhanced/classlib/trunk/modules/beans/src/main/java/java/beans/SimpleBeanInfo.java
07/09/2007 13:49:57 SimpleBeanInfo.loadImage(String) should return null on given null parameter
modified pyang  /harmony/enhanced/classlib/trunk/modules/beans/src/test/java/org/apache/harmony/beans/tests/java/beans/SimpleBeanInfoTest.java
07/09/2007 13:49:57 SimpleBeanInfo.loadImage(String) should return null on given null parameter
modified pyang  /harmony/enhanced/classlib/trunk/modules/beans/src/main/java/java/beans/EventHandler.java
07/09/2007 13:41:16 1. modify EventHanderTest according to RI's behavior 2. fix java.beans.EventHandler
modified pyang  /harmony/enhanced/classlib/trunk/modules/beans/src/test/java/org/apache/harmony/beans/tests/java/beans/EventHandlerTest.java
07/09/2007 13:41:16 1. modify EventHanderTest according to RI's behavior 2. fix java.beans.EventHandler
modified pyang  /harmony/enhanced/classlib/trunk/modules/beans/src/test/java/org/apache/harmony/beans/tests/java/beans/VetoableChangeSupportTest.java
07/06/2007 14:11:41 1. Refine the VetoableChangeSupport against RI's behavior, the original
version has 12 faiulres in RI; 2. add serialization test; 3. Fix VetoableChangeSupport to
pass most of the tests, but there's still 1 failures left
modified pyang  /harmony/enhanced/classlib/trunk/modules/beans/src/main/java/java/beans/VetoableChangeSupport.java
07/06/2007 14:11:41 1. Refine the VetoableChangeSupport against RI's behavior, the original
version has 12 faiulres in RI; 2. add serialization test; 3. Fix VetoableChangeSupport to
pass most of the tests, but there's still 1 failures left
modified tonywu  /harmony/enhanced/classlib/trunk/modules/luni/src/main/java/java/io/CharArrayReader.java
07/06/2007 13:26:09 Fix HARMONY-4357 ([classlib][luni] Compatibility: CharArrayReader.reset()
behavior differs on Harmony and RI if the stream hasn't been marked)
modified tonywu  /harmony/enhanced/classlib/trunk/modules/luni/src/test/api/common/tests/api/java/io/CharArrayReaderTest.java
07/06/2007 13:26:09 Fix HARMONY-4357 ([classlib][luni] Compatibility: CharArrayReader.reset()
behavior differs on Harmony and RI if the stream hasn't been marked)
modified pyang  /harmony/enhanced/classlib/trunk/modules/beans/src/main/java/java/beans/VetoableChangeListenerProxy.java
07/06/2007 13:17:02 Fix the VetoableChangeListenerProxy to enable VetoableChangeListenerProxyTest
modified pyang  /harmony/enhanced/classlib/trunk/modules/beans/make/exclude.common 07/06/2007
13:17:02 Fix the VetoableChangeListenerProxy to enable VetoableChangeListenerProxyTest
modified tonywu  /harmony/enhanced/classlib/trunk/modules/luni/src/test/api/common/tests/api/java/net/MulticastSocketTest.java
07/06/2007 12:47:19 Remove the assertion since it fails on both RI and Harmony in IPv6 Env
modified pyang  /harmony/enhanced/classlib/trunk/modules/beans/src/test/java/org/apache/harmony/beans/tests/java/beans/beancontext/BeanContextServiceRevokedEventTest.java
07/06/2007 10:41:59 In the BeanContextServiceRevokeEvent constructor, the propgatedFrom should
not be set, fix this bug with regression test
modified pyang  /harmony/enhanced/classlib/trunk/modules/beans/src/main/java/java/beans/beancontext/BeanContextServiceRevokedEvent.java
07/06/2007 10:41:59 In the BeanContextServiceRevokeEvent constructor, the propgatedFrom should
not be set, fix this bug with regression test
modified leoli  /harmony/enhanced/classlib/trunk/modules/beans/src/test/java/org/apache/harmony/beans/tests/java/beans/beancontext/BeanContextServicesSupportTest.java
07/06/2007 10:21:21 Apply patch for HARMONY-4344([classlib][beans] BeanContextServicesSupport.serviceAvailable
will add duplicate service class).
modified leoli  /harmony/enhanced/classlib/trunk/modules/beans/src/main/java/java/beans/beancontext/BeanContextServicesSupport.java
07/06/2007 10:21:21 Apply patch for HARMONY-4344([classlib][beans] BeanContextServicesSupport.serviceAvailable
will add duplicate service class).
modified mfursov  /harmony/enhanced/drlvm/trunk/vm/jitrino/src/optimizer/Opnd.cpp 07/05/2007
19:51:20 Fix for HARMONY-4349  (error in lazy resolution helpers)Fix for HARMONY-4334  (support
for unresolved compressed types in Jitrino.OPT)Fix for HARMONY-4181  (fix for x86_64 calling
conventions support in Jitrino.JET)reenabling HARMONY-4267 regression test on x86_64 platforms
modified mfursov  /harmony/enhanced/drlvm/trunk/vm/jitrino/src/shared/Type.cpp 07/05/2007
19:51:20 Fix for HARMONY-4349  (error in lazy resolution helpers)Fix for HARMONY-4334  (support
for unresolved compressed types in Jitrino.OPT)Fix for HARMONY-4181  (fix for x86_64 calling
conventions support in Jitrino.JET)reenabling HARMONY-4267 regression test on x86_64 platforms
modified mfursov  /harmony/enhanced/drlvm/trunk/src/test/regression/excludes/exclude.windows.x86_64
07/05/2007 19:51:20 Fix for HARMONY-4349  (error in lazy resolution helpers)Fix for HARMONY-4334
 (support for unresolved compressed types in Jitrino.OPT)Fix for HARMONY-4181  (fix for x86_64
calling conventions support in Jitrino.JET)reenabling HARMONY-4267 regression test on x86_64
platforms
modified mfursov  /harmony/enhanced/drlvm/trunk/vm/jitrino/src/jet/compiler.cpp 07/05/2007
19:51:20 Fix for HARMONY-4349  (error in lazy resolution helpers)Fix for HARMONY-4334  (support
for unresolved compressed types in Jitrino.OPT)Fix for HARMONY-4181  (fix for x86_64 calling
conventions support in Jitrino.JET)reenabling HARMONY-4267 regression test on x86_64 platforms
modified mfursov  /harmony/enhanced/drlvm/trunk/vm/jitrino/src/jet/csig.h 07/05/2007 19:51:20
Fix for HARMONY-4349  (error in lazy resolution helpers)Fix for HARMONY-4334  (support for
unresolved compressed types in Jitrino.OPT)Fix for HARMONY-4181  (fix for x86_64 calling conventions
support in Jitrino.JET)reenabling HARMONY-4267 regression test on x86_64 platforms
modified mfursov  /harmony/enhanced/drlvm/trunk/vm/jitrino/src/shared/Type.h 07/05/2007 19:51:20
Fix for HARMONY-4349  (error in lazy resolution helpers)Fix for HARMONY-4334  (support for
unresolved compressed types in Jitrino.OPT)Fix for HARMONY-4181  (fix for x86_64 calling conventions
support in Jitrino.JET)reenabling HARMONY-4267 regression test on x86_64 platforms
modified mfursov  /harmony/enhanced/drlvm/trunk/vm/vmcore/src/class_support/Resolve.cpp 07/05/2007
19:51:20 Fix for HARMONY-4349  (error in lazy resolution helpers)Fix for HARMONY-4334  (support
for unresolved compressed types in Jitrino.OPT)Fix for HARMONY-4181  (fix for x86_64 calling
conventions support in Jitrino.JET)reenabling HARMONY-4267 regression test on x86_64 platforms
modified mfursov  /harmony/enhanced/drlvm/trunk/src/test/regression/excludes/exclude.linux.x86_64
07/05/2007 19:51:20 Fix for HARMONY-4349  (error in lazy resolution helpers)Fix for HARMONY-4334
 (support for unresolved compressed types in Jitrino.OPT)Fix for HARMONY-4181  (fix for x86_64
calling conventions support in Jitrino.JET)reenabling HARMONY-4267 regression test on x86_64
platforms
modified mfursov  /harmony/enhanced/drlvm/trunk/vm/jitrino/src/translator/java/JavaLabelPrepass.h
07/05/2007 19:51:20 Fix for HARMONY-4349  (error in lazy resolution helpers)Fix for HARMONY-4334
 (support for unresolved compressed types in Jitrino.OPT)Fix for HARMONY-4181  (fix for x86_64
calling conventions support in Jitrino.JET)reenabling HARMONY-4267 regression test on x86_64
platforms
modified ivavladimir  /harmony/enhanced/drlvm/trunk/build/make/excludes/exclude.drlvm_smoke.windows.x86_64.jet
07/05/2007 14:41:45 exclude test exception/FinalizeStackTest on Win x86_64 due to HARMONY-2972
modified leoli  /harmony/enhanced/classlib/trunk/modules/sql/src/main/java/java/sql/DriverManager.java
07/05/2007 12:53:44 Apply patch for HARMONY-4303([classlib][sql] java.sql.DriverManager.getDrivers()
will read System prpperty "jdbc.drivers" cause java.lang.ExceptionInInitializerError).
modified leoli  /harmony/enhanced/classlib/trunk/modules/sql/src/test/java/org/apache/harmony/sql/tests/java/sql/DriverManagerTest.java
07/05/2007 12:53:44 Apply patch for HARMONY-4303([classlib][sql] java.sql.DriverManager.getDrivers()
will read System prpperty "jdbc.drivers" cause java.lang.ExceptionInInitializerError).
added leoli  /harmony/enhanced/classlib/trunk/modules/sql/src/test/java/org/apache/harmony/sql/tests/java/sql/TestMainForDriver.java
07/05/2007 12:53:44 Apply patch for HARMONY-4303([classlib][sql] java.sql.DriverManager.getDrivers()
will read System prpperty "jdbc.drivers" cause java.lang.ExceptionInInitializerError).
modified leoli  /harmony/enhanced/classlib/trunk/modules/sql/META-INF/MANIFEST.MF 07/05/2007
12:53:44 Apply patch for HARMONY-4303([classlib][sql] java.sql.DriverManager.getDrivers()
will read System prpperty "jdbc.drivers" cause java.lang.ExceptionInInitializerError).
modified leoli  /harmony/enhanced/classlib/trunk/modules/jndi/src/main/java/javax/naming/InitialContext.java
07/05/2007 10:28:47 Roll back the patch for HARMONY-4141 on javax.naming.InitialContext. The
applied patch is not ready actually. 

Mime
View raw message