harmony-alerts mailing list archives

Site index · List index
Message view « Date » · « Thread »
Top « Date » · « Thread »
From nom...@hursley.ibm.com
Subject [continuum] BUILD FAILURE: Java6 Classlib/linux.ia32 Build/Test
Date Tue, 10 Jul 2007 10:27:44 GMT
Online report : http://people.apache.org/~hindessm/continuum/java6_classlib/linux.ia32_build/test/2007/07/10/20070710-102744.failure.log.gz
Build statistics:
  State: Failed
  Previous State: Failed
  Started at: Tue, 10 Jul 2007 09:59:53 +0100
  Finished at: Tue, 10 Jul 2007 11:27:44 +0100
  Total time: 1h 27m 51s
  Build Trigger: Schedule
  Exit code: 1
  Building machine hostname: hy2
  Operating system : Linux(unknown)
  Java version : 1.5.0_06(Sun Microsystems Inc.)

Changes
                            classlib/modules/beans/src/test/java/org/apache/harmony/beans/tests/java/beans/VetoableChangeSupportTest.java
            classlib/modules/beans/src/test/java/org/apache/harmony/beans/tests/java/beans/EventHandlerTest.java
            classlib/modules/beans/src/test/java/org/apache/harmony/beans/tests/java/beans/beancontext/BeanContextServiceRevokedEventTest.java
            classlib/modules/beans/src/test/java/org/apache/harmony/beans/tests/java/beans/SimpleBeanInfoTest.java
            classlib/modules/beans/src/main/java/java/beans/VetoableChangeSupport.java
            classlib/modules/beans/src/main/java/java/beans/EventHandler.java
            classlib/modules/beans/src/main/java/java/beans/VetoableChangeListenerProxy.java
            classlib/modules/beans/src/main/java/java/beans/beancontext/BeanContextServiceRevokedEvent.java
            classlib/modules/beans/src/main/java/java/beans/SimpleBeanInfo.java
            classlib/modules/beans/make/exclude.common
            classlib/modules/luni/src/test/api/common/tests/api/java/net/MulticastSocketTest.java
            classlib/modules/luni/src/test/api/common/tests/api/java/net/ProxySelectorTest.java
            classlib/modules/luni/src/test/api/common/tests/api/java/io/CharArrayReaderTest.java
            classlib/modules/luni/src/test/api/common/tests/api/java/util/GregorianCalendarTest.java
            classlib/modules/luni/src/test/api/common/tests/api/java/util/AbstractSequentialListTest.java
            classlib/modules/luni/src/main/java/java/net/ProxySelectorImpl.java
            classlib/modules/luni/src/main/java/java/io/CharArrayReader.java
            classlib/modules/luni/src/main/java/java/util/GregorianCalendar.java
            classlib/modules/luni/src/main/java/java/util/AbstractSequentialList.java
            classlib/modules/luni/src/main/java/java/util/HashMap.java
            classlib/modules/portlib/src/test/native/hytime/shared/hytime.c
        
****************************************************************************
Output:
****************************************************************************
Buildfile: build.xml

svn-prop:

build:
   [delete] Deleting directory /home/hybld/continuum-working-directory/22/classlib/deploy
     [echo] Classlib revision is 554873
     [echo] Post process: true
     [echo] JAPI: true
     [echo] Building with reference jdk/javac
     [exec] Buildfile: build.xml

     [exec] -init-hdk-for-clean:
     [exec]     [mkdir] Created dir: /home/hybld/continuum-working-directory/22/classlib/deploy/build/ant
     [exec]      [copy] Copying 1 file to /home/hybld/continuum-working-directory/22/classlib/deploy/build/ant

     [exec] clean-java:

     [exec] -modules-clean-bin:

     [exec] clean:
     [exec]    [delete] Deleting 30 files from /home/hybld/continuum-working-directory/22/classlib/build/classes
     [exec]    [delete] Deleting 12 files from /home/hybld/continuum-working-directory/22/classlib/modules/accessibility/bin/test

     [exec] clean:
     [exec]    [delete] Deleting 13 files from /home/hybld/continuum-working-directory/22/classlib/build/classes
     [exec]    [delete] Deleting 5 files from /home/hybld/continuum-working-directory/22/classlib/modules/annotation/bin/test

     [exec] clean:
     [exec]    [delete] Deleting 35 files from /home/hybld/continuum-working-directory/22/classlib/build/classes
     [exec]    [delete] Deleting 1 files from /home/hybld/continuum-working-directory/22/classlib/modules/applet/bin/test

     [exec] clean:
     [exec]    [delete] Deleting 45 files from /home/hybld/continuum-working-directory/22/classlib/build/classes
     [exec]    [delete] Deleting 40 files from /home/hybld/continuum-working-directory/22/classlib/modules/archive/bin/test

     [exec] clean-native-includes:
     [exec]    [delete] /home/hybld/continuum-working-directory/22/classlib/deploy/include
not found.

     [exec] clean:
     [exec]    [delete] Deleting 113 files from /home/hybld/continuum-working-directory/22/classlib/build/classes
     [exec]    [delete] Deleting 226 files from /home/hybld/continuum-working-directory/22/classlib/modules/auth/bin/test

     [exec] clean:
     [exec]    [delete] Deleting 922 files from /home/hybld/continuum-working-directory/22/classlib/build/classes
     [exec]    [delete] Deleting 540 files from /home/hybld/continuum-working-directory/22/classlib/modules/awt/bin/test

     [exec] clean:
     [exec]    [delete] Deleting 108 files from /home/hybld/continuum-working-directory/22/classlib/build/classes
     [exec]    [delete] Deleting 268 files from /home/hybld/continuum-working-directory/22/classlib/modules/beans/bin/test

     [exec] clean:
     [exec]    [delete] Deleting 125 files from /home/hybld/continuum-working-directory/22/classlib/build/classes
     [exec]    [delete] /home/hybld/continuum-working-directory/22/classlib/modules/concurrent/bin/test
not found.

     [exec] clean:
     [exec]    [delete] Deleting 48 files from /home/hybld/continuum-working-directory/22/classlib/build/classes
     [exec]    [delete] Deleting 90 files from /home/hybld/continuum-working-directory/22/classlib/modules/crypto/bin/test

     [exec] clean:
     [exec]    [delete] Deleting 93 files from /home/hybld/continuum-working-directory/22/classlib/build/classes
     [exec]    [delete] Deleting 3 files from /home/hybld/continuum-working-directory/22/classlib/modules/imageio/bin/test

     [exec] clean:
     [exec]    [delete] Deleting 9 files from /home/hybld/continuum-working-directory/22/classlib/build/classes
     [exec]    [delete] Deleting 20 files from /home/hybld/continuum-working-directory/22/classlib/modules/instrument/bin/test

     [exec] clean:
     [exec]    [delete] Deleting 176 files from /home/hybld/continuum-working-directory/22/classlib/build/classes
     [exec]    [delete] Deleting 198 files from /home/hybld/continuum-working-directory/22/classlib/modules/jndi/bin/test

     [exec] clean:
     [exec]    [delete] Deleting 43 files from /home/hybld/continuum-working-directory/22/classlib/build/classes
     [exec]    [delete] Deleting 18 files from /home/hybld/continuum-working-directory/22/classlib/modules/lang-management/bin/api
     [exec]    [delete] Deleting 16 files from /home/hybld/continuum-working-directory/22/classlib/modules/lang-management/bin/impl

     [exec] clean:
     [exec]    [delete] Deleting 34 files from /home/hybld/continuum-working-directory/22/classlib/build/classes
     [exec]    [delete] Deleting 100 files from /home/hybld/continuum-working-directory/22/classlib/modules/logging/bin/test

     [exec] clean:
     [exec]    [delete] Deleting 1021 files from /home/hybld/continuum-working-directory/22/classlib/build/classes
     [exec]    [delete] Deleting 1012 files from /home/hybld/continuum-working-directory/22/classlib/modules/luni/bin/test

     [exec] clean-native-includes:
     [exec]    [delete] /home/hybld/continuum-working-directory/22/classlib/deploy/include
not found.
     [exec]    [delete] /home/hybld/continuum-working-directory/22/classlib/deploy/jdk/include
not found.

     [exec] clean:
     [exec]    [delete] Deleting 29 files from /home/hybld/continuum-working-directory/22/classlib/build/classes

     [exec] clean:
     [exec]    [delete] Deleting 14 files from /home/hybld/continuum-working-directory/22/classlib/build/classes
     [exec]    [delete] Deleting 25 files from /home/hybld/continuum-working-directory/22/classlib/modules/math/bin/test

     [exec] clean:
     [exec]    [delete] Deleting 14 files from /home/hybld/continuum-working-directory/22/classlib/build/classes
     [exec]    [delete] Deleting 1 files from /home/hybld/continuum-working-directory/22/classlib/modules/misc/bin/test

     [exec] clean:
     [exec]    [delete] Deleting 142 files from /home/hybld/continuum-working-directory/22/classlib/build/classes
     [exec]    [delete] Deleted 5 directories from /home/hybld/continuum-working-directory/22/classlib/build/classes
     [exec]    [delete] Deleting 157 files from /home/hybld/continuum-working-directory/22/classlib/modules/nio/bin/test
     [exec]    [delete] Deleted 19 directories from /home/hybld/continuum-working-directory/22/classlib/modules/nio/bin/test

     [exec] clean:
     [exec]    [delete] Deleting 303 files from /home/hybld/continuum-working-directory/22/classlib/build/classes
     [exec]    [delete] Deleting 79 files from /home/hybld/continuum-working-directory/22/classlib/modules/nio_char/bin/test

     [exec] clean:
     [exec]    [delete] Deleting 44 files from /home/hybld/continuum-working-directory/22/classlib/build/classes
     [exec]    [delete] Deleting 19 files from /home/hybld/continuum-working-directory/22/classlib/modules/pack200/bin/test

     [exec] clean-native-includes:
     [exec]    [delete] /home/hybld/continuum-working-directory/22/classlib/deploy/include
not found.

     [exec] clean:

     [exec] clean:
     [exec]    [delete] Deleting 32 files from /home/hybld/continuum-working-directory/22/classlib/build/classes
     [exec]    [delete] Deleting 32 files from /home/hybld/continuum-working-directory/22/classlib/modules/prefs/bin/test

     [exec] clean:
     [exec]    [delete] Deleting 205 files from /home/hybld/continuum-working-directory/22/classlib/build/classes
     [exec]    [delete] Deleting 60 files from /home/hybld/continuum-working-directory/22/classlib/modules/print/bin/test

     [exec] clean:
     [exec]    [delete] Deleting 177 files from /home/hybld/continuum-working-directory/22/classlib/build/classes
     [exec]    [delete] Deleting 14 files from /home/hybld/continuum-working-directory/22/classlib/modules/regex/bin/test

     [exec] clean:
     [exec]    [delete] Deleting 230 files from /home/hybld/continuum-working-directory/22/classlib/build/classes

...

     [exec]     [javac] ----------
     [exec]     [javac] 1. WARNING in /home/hybld/continuum-working-directory/22/classlib/modules/annotation/src/test/java/org/apache/harmony/annotation/tests/java/lang/annotation/IncompleteAnnotationExceptionTest.java
     [exec]     [javac]  (at line 53)
     [exec]     [javac] 	clazz, elementName);
     [exec]     [javac] 	^^^^^
     [exec]     [javac] Type safety: The expression of type Class needs unchecked conversion
to conform to Class<? extends Annotation>
     [exec]     [javac] ----------
     [exec]     [javac] 1 problem (1 warning)

     [exec] prepare-exclude:

...

     [exec]     [junit] Tests run: 4, Failures: 0, Errors: 0, Time elapsed: 1.588 sec
     [exec]     [junit] Tests run: 12, Failures: 0, Errors: 0, Time elapsed: 0.012 sec
     [exec]     [junit] Tests run: 19, Failures: 0, Errors: 0, Time elapsed: 0.029 sec
     [exec]     [junit] Tests run: 1, Failures: 0, Errors: 1, Time elapsed: 0 sec
     [exec]     [junit] Tests FAILED (timeout)

     [exec] touch-failures-file:

     [exec] touch-errors-file:


...

     [exec]     [junit] org.apache.harmony.rmi.test.MyException: MyRemoteObject.test_Exception
     [exec]     [junit] Done.

     [exec]     [junit] Testing test_Error...
     [exec]     [junit] java.rmi.ServerError: Error occurred while remote method invocation;
nested exception is:
     [exec]     [junit] 	java.lang.Error: MyRemoteObject.test_Error
     [exec]     [junit] Done.

     [exec]     [junit] Testing test_RuntimeException...
     [exec]     [junit] java.lang.RuntimeException: MyRemoteObject.text_RuntimeException
     [exec]     [junit] Done.

...

     [exec]     [junit] org.apache.harmony.rmi.test.MyException: MyRemoteObject.test_Exception
     [exec]     [junit] Done.

     [exec]     [junit] Testing test_Error...
     [exec]     [junit] java.rmi.ServerError: Error occurred while remote method invocation;
nested exception is:
     [exec]     [junit] 	java.lang.Error: MyRemoteObject.test_Error
     [exec]     [junit] Done.

     [exec]     [junit] Testing test_RuntimeException...
     [exec]     [junit] java.lang.RuntimeException: MyRemoteObject.text_RuntimeException
     [exec]     [junit] Done.

...

     [exec] gen-report:

     [exec] check-test-result:

     [exec] BUILD FAILED
     [exec] /home/hybld/continuum-working-directory/22/classlib/build.xml:169: The following
error occurred while executing this line:
     [exec] /home/hybld/continuum-working-directory/22/classlib/make/build-test.xml:142: There
were test crashes: /home/hybld/continuum-working-directory/22/classlib/build/test_report/TEST-org.apache.harmony.luni.tests.java.net.InetAddressTest.xml

     [exec] Total time: 67 minutes 33 seconds
     [exec] Result: 1
     [echo] Tests.failed is set to true

japi:

     [exec] Processing class java.lang,Object:+
     [exec] Processing package java.lang,:===============================================================================+-+++++++++++-+++++++++++++-+++++++++++++++++-+++++-+++++++++++++++++++++++-++++--^+^+++++++++--++++++++++

...

     [exec] Processing package java.lang.management,:===============================================================================++++-+++++++++++
     [exec] Processing package java.lang.ref,:===============================================================================+++++
     [exec] Processing package java.lang.reflect,:===============================================================================+++++++++++++++++++++
     [exec] Processing class ,java:
     [exec] Failed to Japize java: java.lang.RuntimeException: NoClassDefFoundError: java
     [exec] java.lang.RuntimeException: NoClassDefFoundError: java
     [exec] 	at net.wuffies.japi.ClassFile.forName(ClassFile.java:1626)
     [exec] 	at net.wuffies.japi.Japize.getClassWrapper(Japize.java:1425)
     [exec] 	at net.wuffies.japi.Japize.japizeClass(Japize.java:748)
     [exec] 	at net.wuffies.japi.Japize.processClass(Japize.java:516)

...

     [exec] 	at net.wuffies.japi.Japize.doJapize(Japize.java:443)
     [exec] 	at net.wuffies.japi.Japize.main(Japize.java:316)

     [exec] Processing class ,javax:
     [exec] Failed to Japize javax: java.lang.RuntimeException: NoClassDefFoundError: javax
     [exec] java.lang.RuntimeException: NoClassDefFoundError: javax
     [exec] 	at net.wuffies.japi.ClassFile.forName(ClassFile.java:1626)
     [exec] 	at net.wuffies.japi.Japize.getClassWrapper(Japize.java:1425)
     [exec] 	at net.wuffies.japi.Japize.japizeClass(Japize.java:748)
     [exec] 	at net.wuffies.japi.Japize.processClass(Japize.java:516)

...

     [exec] 	at net.wuffies.japi.Japize.doJapize(Japize.java:443)
     [exec] 	at net.wuffies.japi.Japize.main(Japize.java:316)

     [exec] Processing class ,org:
     [exec] Failed to Japize org: java.lang.RuntimeException: NoClassDefFoundError: org
     [exec] java.lang.RuntimeException: NoClassDefFoundError: org
     [exec] 	at net.wuffies.japi.ClassFile.forName(ClassFile.java:1626)
     [exec] 	at net.wuffies.japi.Japize.getClassWrapper(Japize.java:1425)
     [exec] 	at net.wuffies.japi.Japize.japizeClass(Japize.java:748)
     [exec] 	at net.wuffies.japi.Japize.processClass(Japize.java:516)

...

     [exec] Processing package javax.sql.rowset,:===============================================================================++++++++-+-+
     [exec] Processing package javax.sql.rowset.serial,:===============================================================================+++++++++++
     [exec] Processing package javax.sql.rowset.spi,:===============================================================================-++++++++
     [exec] Processing package javax.swing,:===============================================================================++--+-++++++--++++++++++++++++--------------------------------+++---++++++++--++++---+++++++++++++++-----++-+--++-+++-+++++++--++-++
     [exec] Failed to Japize javax.swing.JFormattedTextField: java.lang.ArrayIndexOutOfBoundsException
     [exec] java.lang.ArrayIndexOutOfBoundsException
     [exec] 	at java.util.Arrays.mergeSort(Arrays.java:2718)
     [exec] 	at java.util.Arrays.mergeSort(Arrays.java:2699)
     [exec] 	at java.util.Arrays.mergeSort(Arrays.java:270)
     [exec] 	at java.util.Arrays.sort(Arrays.java:2642)

...

     [exec] 	at net.wuffies.japi.Japize.processRootSet(Japize.java:471)
     [exec] 	at net.wuffies.japi.Japize.doJapize(Japize.java:443)
     [exec] 	at net.wuffies.japi.Japize.main(Japize.java:316)

     [exec] Failed to Japize javax.swing.JFormattedTextField$AbstractFormatter: java.lang.ArrayIndexOutOfBoundsException
     [exec] java.lang.ArrayIndexOutOfBoundsException
     [exec] 	at java.util.Arrays.mergeSort(Arrays.java:2726)
     [exec] 	at java.util.Arrays.sort(Arrays.java:2642)
     [exec] 	at java.util.Arrays.sort(Arrays.java:261)
     [exec] 	at net.wuffies.japi.BoundMemberSet.getCalls(BoundMemberSet.java:46)

...

     [exec] 	at net.wuffies.japi.Japize.processRootSet(Japize.java:471)
     [exec] 	at net.wuffies.japi.Japize.doJapize(Japize.java:443)
     [exec] 	at net.wuffies.japi.Japize.main(Japize.java:316)
     [exec] -
     [exec] Failed to Japize javax.swing.JFormattedTextField$AbstractFormatterFactory: java.lang.ArrayIndexOutOfBoundsException
     [exec] java.lang.ArrayIndexOutOfBoundsException
     [exec] 	at java.util.Arrays.mergeSort(Arrays.java:2726)
     [exec] 	at java.util.Arrays.sort(Arrays.java:2642)
     [exec] 	at java.util.Arrays.sort(Arrays.java:261)
     [exec] 	at net.wuffies.japi.BoundMemberSet.getCalls(BoundMemberSet.java:46)

...

     [exec] 	at net.wuffies.japi.Japize.processRootSet(Japize.java:471)
     [exec] 	at net.wuffies.japi.Japize.doJapize(Japize.java:443)
     [exec] 	at net.wuffies.japi.Japize.main(Japize.java:316)
     [exec] ------
     [exec] Failed to Japize javax.swing.JFrame: java.lang.ArrayIndexOutOfBoundsException
     [exec] java.lang.ArrayIndexOutOfBoundsException
     [exec] 	at java.util.Arrays.mergeSort(Arrays.java:2728)
     [exec] 	at java.util.Arrays.sort(Arrays.java:2642)
     [exec] 	at java.util.Arrays.sort(Arrays.java:261)
     [exec] 	at net.wuffies.japi.BoundMemberSet.getFields(BoundMemberSet.java:33)

...

     [exec] 	at net.wuffies.japi.Japize.processRootSet(Japize.java:471)
     [exec] 	at net.wuffies.japi.Japize.doJapize(Japize.java:443)
     [exec] 	at net.wuffies.japi.Japize.main(Japize.java:316)

     [exec] Failed to Japize javax.swing.JFrame$AccessibleJFrame: java.lang.ArrayIndexOutOfBoundsException
     [exec] java.lang.ArrayIndexOutOfBoundsException
     [exec] 	at java.util.Arrays.mergeSort(Arrays.java:2728)
     [exec] 	at java.util.Arrays.mergeSort(Arrays.java:2699)
     [exec] 	at java.util.Arrays.sort(Arrays.java:2642)
     [exec] 	at java.util.Arrays.sort(Arrays.java:261)

...

     [exec] 	at net.wuffies.japi.Japize.processRootSet(Japize.java:471)
     [exec] 	at net.wuffies.japi.Japize.doJapize(Japize.java:443)
     [exec] 	at net.wuffies.japi.Japize.main(Japize.java:316)

     [exec] Failed to Japize javax.swing.JInternalFrame: java.lang.ArrayIndexOutOfBoundsException
     [exec] java.lang.ArrayIndexOutOfBoundsException
     [exec] 	at java.util.Arrays.mergeSort(Arrays.java:2728)
     [exec] 	at java.util.Arrays.sort(Arrays.java:2642)
     [exec] 	at java.util.Arrays.sort(Arrays.java:261)
     [exec] 	at net.wuffies.japi.BoundMemberSet.getFields(BoundMemberSet.java:33)

...

     [exec] 	at net.wuffies.japi.Japize.processRootSet(Japize.java:471)
     [exec] 	at net.wuffies.japi.Japize.doJapize(Japize.java:443)
     [exec] 	at net.wuffies.japi.Japize.main(Japize.java:316)

     [exec] Failed to Japize javax.swing.JInternalFrame$AccessibleJInternalFrame: java.lang.ArrayIndexOutOfBoundsException
     [exec] java.lang.ArrayIndexOutOfBoundsException
     [exec] 	at java.util.Arrays.mergeSort(Arrays.java:2728)
     [exec] 	at java.util.Arrays.mergeSort(Arrays.java:2699)
     [exec] 	at java.util.Arrays.sort(Arrays.java:2642)
     [exec] 	at java.util.Arrays.sort(Arrays.java:261)

...

     [exec] 	at net.wuffies.japi.Japize.processRootSet(Japize.java:471)
     [exec] 	at net.wuffies.japi.Japize.doJapize(Japize.java:443)
     [exec] 	at net.wuffies.japi.Japize.main(Japize.java:316)

     [exec] Failed to Japize javax.swing.JInternalFrame$JDesktopIcon: java.lang.ArrayIndexOutOfBoundsException
     [exec] java.lang.ArrayIndexOutOfBoundsException
     [exec] 	at java.util.Arrays.mergeSort(Arrays.java:2728)
     [exec] 	at java.util.Arrays.sort(Arrays.java:2642)
     [exec] 	at java.util.Arrays.sort(Arrays.java:261)
     [exec] 	at net.wuffies.japi.BoundMemberSet.getFields(BoundMemberSet.java:33)

...

     [exec] 	at net.wuffies.japi.Japize.processRootSet(Japize.java:471)
     [exec] 	at net.wuffies.japi.Japize.doJapize(Japize.java:443)
     [exec] 	at net.wuffies.japi.Japize.main(Japize.java:316)

     [exec] Failed to Japize javax.swing.JInternalFrame$JDesktopIcon$AccessibleJDesktopIcon:
java.lang.ArrayIndexOutOfBoundsException
     [exec] java.lang.ArrayIndexOutOfBoundsException
     [exec] 	at java.util.Arrays.mergeSort(Arrays.java:2728)
     [exec] 	at java.util.Arrays.mergeSort(Arrays.java:2699)
     [exec] 	at java.util.Arrays.sort(Arrays.java:2642)
     [exec] 	at java.util.Arrays.sort(Arrays.java:261)

...

     [exec] 	at net.wuffies.japi.Japize.processRootSet(Japize.java:471)
     [exec] 	at net.wuffies.japi.Japize.doJapize(Japize.java:443)
     [exec] 	at net.wuffies.japi.Japize.main(Japize.java:316)

     [exec] Failed to Japize javax.swing.JLabel: java.lang.ArrayIndexOutOfBoundsException
     [exec] java.lang.ArrayIndexOutOfBoundsException
     [exec] 	at java.util.Arrays.mergeSort(Arrays.java:2728)
     [exec] 	at java.util.Arrays.mergeSort(Arrays.java:270)
     [exec] 	at java.util.Arrays.sort(Arrays.java:2642)
     [exec] 	at java.util.Arrays.sort(Arrays.java:261)

...

     [exec] 	at net.wuffies.japi.Japize.processRootSet(Japize.java:471)
     [exec] 	at net.wuffies.japi.Japize.doJapize(Japize.java:443)
     [exec] 	at net.wuffies.japi.Japize.main(Japize.java:316)
     [exec] -
     [exec] Failed to Japize javax.swing.JLabel$AccessibleJLabel: java.lang.ArrayIndexOutOfBoundsException
     [exec] java.lang.ArrayIndexOutOfBoundsException
     [exec] 	at java.util.Arrays.mergeSort(Arrays.java:2728)
     [exec] 	at java.util.Arrays.sort(Arrays.java:2642)
     [exec] 	at java.util.Arrays.sort(Arrays.java:261)
     [exec] 	at net.wuffies.japi.BoundMemberSet.getCalls(BoundMemberSet.java:46)

...

     [exec] 	at net.wuffies.japi.Japize.processRootSet(Japize.java:471)
     [exec] 	at net.wuffies.japi.Japize.doJapize(Japize.java:443)
     [exec] 	at net.wuffies.japi.Japize.main(Japize.java:316)

     [exec] Failed to Japize javax.swing.JLayeredPane: java.lang.ArrayIndexOutOfBoundsException
     [exec] java.lang.ArrayIndexOutOfBoundsException
     [exec] 	at java.util.Arrays.mergeSort(Arrays.java:2728)
     [exec] 	at java.util.Arrays.sort(Arrays.java:2642)
     [exec] 	at java.util.Arrays.sort(Arrays.java:261)
     [exec] 	at net.wuffies.japi.BoundMemberSet.getFields(BoundMemberSet.java:33)

...

     [exec] 	at net.wuffies.japi.Japize.processRootSet(Japize.java:471)
     [exec] 	at net.wuffies.japi.Japize.doJapize(Japize.java:443)
     [exec] 	at net.wuffies.japi.Japize.main(Japize.java:316)

     [exec] Failed to Japize javax.swing.JLayeredPane$AccessibleJLayeredPane: java.lang.ArrayIndexOutOfBoundsException
     [exec] java.lang.ArrayIndexOutOfBoundsException
     [exec] 	at java.util.Arrays.mergeSort(Arrays.java:2728)
     [exec] 	at java.util.Arrays.mergeSort(Arrays.java:2699)
     [exec] 	at java.util.Arrays.sort(Arrays.java:2642)
     [exec] 	at java.util.Arrays.sort(Arrays.java:261)

...

     [exec] 	at net.wuffies.japi.Japize.processRootSet(Japize.java:471)
     [exec] 	at net.wuffies.japi.Japize.doJapize(Japize.java:443)
     [exec] 	at net.wuffies.japi.Japize.main(Japize.java:316)

     [exec] Failed to Japize javax.swing.JList: java.lang.ArrayIndexOutOfBoundsException
     [exec] java.lang.ArrayIndexOutOfBoundsException
     [exec] 	at java.util.Arrays.mergeSort(Arrays.java:2728)
     [exec] 	at java.util.Arrays.sort(Arrays.java:2642)
     [exec] 	at java.util.Arrays.sort(Arrays.java:261)
     [exec] 	at net.wuffies.japi.BoundMemberSet.getFields(BoundMemberSet.java:33)

...

     [exec] 	at net.wuffies.japi.Japize.processRootSet(Japize.java:471)
     [exec] 	at net.wuffies.japi.Japize.doJapize(Japize.java:443)
     [exec] 	at net.wuffies.japi.Japize.main(Japize.java:316)
     [exec] -
     [exec] Failed to Japize javax.swing.JList$AccessibleJList: java.lang.ArrayIndexOutOfBoundsException
     [exec] java.lang.ArrayIndexOutOfBoundsException
     [exec] 	at java.util.Arrays.mergeSort(Arrays.java:2728)
     [exec] 	at java.util.Arrays.mergeSort(Arrays.java:2699)
     [exec] 	at java.util.Arrays.sort(Arrays.java:2642)
     [exec] 	at java.util.Arrays.sort(Arrays.java:261)

...

     [exec] 	at net.wuffies.japi.Japize.processRootSet(Japize.java:471)
     [exec] 	at net.wuffies.japi.Japize.doJapize(Japize.java:443)
     [exec] 	at net.wuffies.japi.Japize.main(Japize.java:316)

     [exec] Failed to Japize javax.swing.JList$AccessibleJList$AccessibleJListChild: java.lang.ArrayIndexOutOfBoundsException
     [exec] java.lang.ArrayIndexOutOfBoundsException
     [exec] 	at java.util.Arrays.mergeSort(Arrays.java:2728)
     [exec] 	at java.util.Arrays.mergeSort(Arrays.java:2699)
     [exec] 	at java.util.Arrays.sort(Arrays.java:2642)
     [exec] 	at java.util.Arrays.sort(Arrays.java:261)

...

     [exec] 	at net.wuffies.japi.Japize.processRootSet(Japize.java:471)
     [exec] 	at net.wuffies.japi.Japize.doJapize(Japize.java:443)
     [exec] 	at net.wuffies.japi.Japize.main(Japize.java:316)
     [exec] -
     [exec] Failed to Japize javax.swing.JMenu: java.lang.ArrayIndexOutOfBoundsException
     [exec] java.lang.ArrayIndexOutOfBoundsException
     [exec] 	at java.util.Arrays.mergeSort(Arrays.java:2728)
     [exec] 	at java.util.Arrays.mergeSort(Arrays.java:270)
     [exec] 	at java.util.Arrays.sort(Arrays.java:2642)
     [exec] 	at java.util.Arrays.sort(Arrays.java:261)

...

     [exec] 	at net.wuffies.japi.Japize.processRootSet(Japize.java:471)
     [exec] 	at net.wuffies.japi.Japize.doJapize(Japize.java:443)
     [exec] 	at net.wuffies.japi.Japize.main(Japize.java:316)
     [exec] -
     [exec] Failed to Japize javax.swing.JMenu$AccessibleJMenu: java.lang.ArrayIndexOutOfBoundsException
     [exec] java.lang.ArrayIndexOutOfBoundsException
     [exec] 	at java.util.Arrays.mergeSort(Arrays.java:2728)
     [exec] 	at java.util.Arrays.sort(Arrays.java:2642)
     [exec] 	at java.util.Arrays.sort(Arrays.java:261)
     [exec] 	at net.wuffies.japi.BoundMemberSet.getCalls(BoundMemberSet.java:46)

...

     [exec] 	at net.wuffies.japi.Japize.processRootSet(Japize.java:471)
     [exec] 	at net.wuffies.japi.Japize.doJapize(Japize.java:443)
     [exec] 	at net.wuffies.japi.Japize.main(Japize.java:316)

     [exec] Failed to Japize javax.swing.JMenu$WinListener: java.lang.ArrayIndexOutOfBoundsException
     [exec] java.lang.ArrayIndexOutOfBoundsException
     [exec] 	at java.util.Arrays.mergeSort(Arrays.java:2726)
     [exec] 	at java.util.Arrays.sort(Arrays.java:2642)
     [exec] 	at java.util.Arrays.sort(Arrays.java:261)
     [exec] 	at net.wuffies.japi.BoundMemberSet.getCalls(BoundMemberSet.java:46)

...

     [exec] 	at net.wuffies.japi.Japize.processRootSet(Japize.java:471)
     [exec] 	at net.wuffies.japi.Japize.doJapize(Japize.java:443)
     [exec] 	at net.wuffies.japi.Japize.main(Japize.java:316)

     [exec] Failed to Japize javax.swing.JMenuBar: java.lang.ArrayIndexOutOfBoundsException
     [exec] java.lang.ArrayIndexOutOfBoundsException
     [exec] 	at java.util.Arrays.mergeSort(Arrays.java:2728)
     [exec] 	at java.util.Arrays.sort(Arrays.java:2642)
     [exec] 	at java.util.Arrays.sort(Arrays.java:261)
     [exec] 	at net.wuffies.japi.BoundMemberSet.getFields(BoundMemberSet.java:33)

...

     [exec] 	at net.wuffies.japi.Japize.processRootSet(Japize.java:471)
     [exec] 	at net.wuffies.japi.Japize.doJapize(Japize.java:443)
     [exec] 	at net.wuffies.japi.Japize.main(Japize.java:316)

     [exec] Failed to Japize javax.swing.JMenuBar$AccessibleJMenuBar: java.lang.ArrayIndexOutOfBoundsException
     [exec] java.lang.ArrayIndexOutOfBoundsException
     [exec] 	at java.util.Arrays.mergeSort(Arrays.java:2728)
     [exec] 	at java.util.Arrays.mergeSort(Arrays.java:2699)
     [exec] 	at java.util.Arrays.sort(Arrays.java:2642)
     [exec] 	at java.util.Arrays.sort(Arrays.java:261)

...

     [exec] 	at net.wuffies.japi.Japize.processRootSet(Japize.java:471)
     [exec] 	at net.wuffies.japi.Japize.doJapize(Japize.java:443)
     [exec] 	at net.wuffies.japi.Japize.main(Japize.java:316)

     [exec] Failed to Japize javax.swing.JMenuItem: java.lang.ArrayIndexOutOfBoundsException
     [exec] java.lang.ArrayIndexOutOfBoundsException
     [exec] 	at java.util.Arrays.mergeSort(Arrays.java:2728)
     [exec] 	at java.util.Arrays.mergeSort(Arrays.java:270)
     [exec] 	at java.util.Arrays.sort(Arrays.java:2642)
     [exec] 	at java.util.Arrays.sort(Arrays.java:261)

...

     [exec] 	at net.wuffies.japi.Japize.processRootSet(Japize.java:471)
     [exec] 	at net.wuffies.japi.Japize.doJapize(Japize.java:443)
     [exec] 	at net.wuffies.japi.Japize.main(Japize.java:316)

     [exec] Failed to Japize javax.swing.JMenuItem$AccessibleJMenuItem: java.lang.ArrayIndexOutOfBoundsException
     [exec] java.lang.ArrayIndexOutOfBoundsException
     [exec] 	at java.util.Arrays.mergeSort(Arrays.java:2728)
     [exec] 	at java.util.Arrays.sort(Arrays.java:2642)
     [exec] 	at java.util.Arrays.sort(Arrays.java:261)
     [exec] 	at net.wuffies.japi.BoundMemberSet.getCalls(BoundMemberSet.java:46)

...

     [exec] 	at net.wuffies.japi.Japize.processRootSet(Japize.java:471)
     [exec] 	at net.wuffies.japi.Japize.doJapize(Japize.java:443)
     [exec] 	at net.wuffies.japi.Japize.main(Japize.java:316)

     [exec] Failed to Japize javax.swing.JOptionPane: java.lang.ArrayIndexOutOfBoundsException
     [exec] java.lang.ArrayIndexOutOfBoundsException
     [exec] 	at java.util.Arrays.mergeSort(Arrays.java:2728)
     [exec] 	at java.util.Arrays.sort(Arrays.java:2642)
     [exec] 	at java.util.Arrays.sort(Arrays.java:261)
     [exec] 	at net.wuffies.japi.BoundMemberSet.getFields(BoundMemberSet.java:33)

...

     [exec] 	at net.wuffies.japi.Japize.processRootSet(Japize.java:471)
     [exec] 	at net.wuffies.japi.Japize.doJapize(Japize.java:443)
     [exec] 	at net.wuffies.japi.Japize.main(Japize.java:316)

     [exec] Failed to Japize javax.swing.JOptionPane$AccessibleJOptionPane: java.lang.ArrayIndexOutOfBoundsException
     [exec] java.lang.ArrayIndexOutOfBoundsException
     [exec] 	at java.util.Arrays.mergeSort(Arrays.java:2728)
     [exec] 	at java.util.Arrays.mergeSort(Arrays.java:2699)
     [exec] 	at java.util.Arrays.sort(Arrays.java:2642)
     [exec] 	at java.util.Arrays.sort(Arrays.java:261)

...

     [exec] 	at net.wuffies.japi.Japize.processRootSet(Japize.java:471)
     [exec] 	at net.wuffies.japi.Japize.doJapize(Japize.java:443)
     [exec] 	at net.wuffies.japi.Japize.main(Japize.java:316)
     [exec] ---
     [exec] Failed to Japize javax.swing.JPanel: java.lang.ArrayIndexOutOfBoundsException
     [exec] java.lang.ArrayIndexOutOfBoundsException
     [exec] 	at java.util.Arrays.mergeSort(Arrays.java:2728)
     [exec] 	at java.util.Arrays.sort(Arrays.java:2642)
     [exec] 	at java.util.Arrays.sort(Arrays.java:261)
     [exec] 	at net.wuffies.japi.BoundMemberSet.getFields(BoundMemberSet.java:33)

...

     [exec] 	at net.wuffies.japi.Japize.processRootSet(Japize.java:471)
     [exec] 	at net.wuffies.japi.Japize.doJapize(Japize.java:443)
     [exec] 	at net.wuffies.japi.Japize.main(Japize.java:316)

     [exec] Failed to Japize javax.swing.JPanel$AccessibleJPanel: java.lang.ArrayIndexOutOfBoundsException
     [exec] java.lang.ArrayIndexOutOfBoundsException
     [exec] 	at java.util.Arrays.mergeSort(Arrays.java:2728)
     [exec] 	at java.util.Arrays.mergeSort(Arrays.java:2699)
     [exec] 	at java.util.Arrays.sort(Arrays.java:2642)
     [exec] 	at java.util.Arrays.sort(Arrays.java:261)

...

     [exec] 	at net.wuffies.japi.Japize.processRootSet(Japize.java:471)
     [exec] 	at net.wuffies.japi.Japize.doJapize(Japize.java:443)
     [exec] 	at net.wuffies.japi.Japize.main(Japize.java:316)

     [exec] Failed to Japize javax.swing.JPasswordField: java.lang.ArrayIndexOutOfBoundsException
     [exec] java.lang.ArrayIndexOutOfBoundsException
     [exec] 	at java.util.Arrays.mergeSort(Arrays.java:2728)
     [exec] 	at java.util.Arrays.mergeSort(Arrays.java:270)
     [exec] 	at java.util.Arrays.sort(Arrays.java:2642)
     [exec] 	at java.util.Arrays.sort(Arrays.java:261)

...

     [exec] 	at net.wuffies.japi.Japize.processRootSet(Japize.java:471)
     [exec] 	at net.wuffies.japi.Japize.doJapize(Japize.java:443)
     [exec] 	at net.wuffies.japi.Japize.main(Japize.java:316)

     [exec] Failed to Japize javax.swing.JPasswordField$AccessibleJPasswordField: java.lang.ArrayIndexOutOfBoundsException
     [exec] java.lang.ArrayIndexOutOfBoundsException
     [exec] 	at java.util.Arrays.mergeSort(Arrays.java:2728)
     [exec] 	at java.util.Arrays.sort(Arrays.java:2642)
     [exec] 	at java.util.Arrays.sort(Arrays.java:261)
     [exec] 	at net.wuffies.japi.BoundMemberSet.getCalls(BoundMemberSet.java:46)

...

     [exec] 	at net.wuffies.japi.Japize.processRootSet(Japize.java:471)
     [exec] 	at net.wuffies.japi.Japize.doJapize(Japize.java:443)
     [exec] 	at net.wuffies.japi.Japize.main(Japize.java:316)
     [exec] -
     [exec] Failed to Japize javax.swing.JPopupMenu: java.lang.ArrayIndexOutOfBoundsException
     [exec] java.lang.ArrayIndexOutOfBoundsException
     [exec] 	at java.util.Arrays.mergeSort(Arrays.java:2728)
     [exec] 	at java.util.Arrays.sort(Arrays.java:2642)
     [exec] 	at java.util.Arrays.sort(Arrays.java:261)
     [exec] 	at net.wuffies.japi.BoundMemberSet.getFields(BoundMemberSet.java:33)

...

     [exec] 	at net.wuffies.japi.Japize.processRootSet(Japize.java:471)
     [exec] 	at net.wuffies.japi.Japize.doJapize(Japize.java:443)
     [exec] 	at net.wuffies.japi.Japize.main(Japize.java:316)
     [exec] -
     [exec] Failed to Japize javax.swing.JPopupMenu$AccessibleJPopupMenu: java.lang.ArrayIndexOutOfBoundsException
     [exec] java.lang.ArrayIndexOutOfBoundsException
     [exec] 	at java.util.Arrays.mergeSort(Arrays.java:2728)
     [exec] 	at java.util.Arrays.mergeSort(Arrays.java:2699)
     [exec] 	at java.util.Arrays.sort(Arrays.java:2642)
     [exec] 	at java.util.Arrays.sort(Arrays.java:261)

...

     [exec] 	at net.wuffies.japi.Japize.processRootSet(Japize.java:471)
     [exec] 	at net.wuffies.japi.Japize.doJapize(Japize.java:443)
     [exec] 	at net.wuffies.japi.Japize.main(Japize.java:316)
     [exec] -
     [exec] Failed to Japize javax.swing.JPopupMenu$Separator: java.lang.ArrayIndexOutOfBoundsException
     [exec] java.lang.ArrayIndexOutOfBoundsException
     [exec] 	at java.util.Arrays.mergeSort(Arrays.java:2728)
     [exec] 	at java.util.Arrays.mergeSort(Arrays.java:270)
     [exec] 	at java.util.Arrays.sort(Arrays.java:2642)
     [exec] 	at java.util.Arrays.sort(Arrays.java:261)

...

     [exec] 	at net.wuffies.japi.Japize.processRootSet(Japize.java:471)
     [exec] 	at net.wuffies.japi.Japize.doJapize(Japize.java:443)
     [exec] 	at net.wuffies.japi.Japize.main(Japize.java:316)

     [exec] Failed to Japize javax.swing.JProgressBar: java.lang.ArrayIndexOutOfBoundsException
     [exec] java.lang.ArrayIndexOutOfBoundsException
     [exec] 	at java.util.Arrays.mergeSort(Arrays.java:2728)
     [exec] 	at java.util.Arrays.mergeSort(Arrays.java:270)
     [exec] 	at java.util.Arrays.sort(Arrays.java:2642)
     [exec] 	at java.util.Arrays.sort(Arrays.java:261)

...

     [exec] 	at net.wuffies.japi.Japize.processRootSet(Japize.java:471)
     [exec] 	at net.wuffies.japi.Japize.doJapize(Japize.java:443)
     [exec] 	at net.wuffies.japi.Japize.main(Japize.java:316)

     [exec] Failed to Japize javax.swing.JProgressBar$AccessibleJProgressBar: java.lang.ArrayIndexOutOfBoundsException
     [exec] java.lang.ArrayIndexOutOfBoundsException
     [exec] 	at java.util.Arrays.mergeSort(Arrays.java:2728)
     [exec] 	at java.util.Arrays.mergeSort(Arrays.java:2699)
     [exec] 	at java.util.Arrays.sort(Arrays.java:2642)
     [exec] 	at java.util.Arrays.sort(Arrays.java:261)

...

     [exec] 	at net.wuffies.japi.Japize.processRootSet(Japize.java:471)
     [exec] 	at net.wuffies.japi.Japize.doJapize(Japize.java:443)
     [exec] 	at net.wuffies.japi.Japize.main(Japize.java:316)
     [exec] -
     [exec] Failed to Japize javax.swing.JRadioButton: java.lang.ArrayIndexOutOfBoundsException
     [exec] java.lang.ArrayIndexOutOfBoundsException
     [exec] 	at java.util.Arrays.mergeSort(Arrays.java:2728)
     [exec] 	at java.util.Arrays.mergeSort(Arrays.java:270)
     [exec] 	at java.util.Arrays.sort(Arrays.java:2642)
     [exec] 	at java.util.Arrays.sort(Arrays.java:261)

...

     [exec] 	at net.wuffies.japi.Japize.processRootSet(Japize.java:471)
     [exec] 	at net.wuffies.japi.Japize.doJapize(Japize.java:443)
     [exec] 	at net.wuffies.japi.Japize.main(Japize.java:316)
     [exec] -
     [exec] Failed to Japize javax.swing.JRadioButton$AccessibleJRadioButton: java.lang.ArrayIndexOutOfBoundsException
     [exec] java.lang.ArrayIndexOutOfBoundsException
     [exec] 	at java.util.Arrays.mergeSort(Arrays.java:2728)
     [exec] 	at java.util.Arrays.sort(Arrays.java:2642)
     [exec] 	at java.util.Arrays.sort(Arrays.java:261)
     [exec] 	at net.wuffies.japi.BoundMemberSet.getCalls(BoundMemberSet.java:46)

...

     [exec] 	at net.wuffies.japi.Japize.processRootSet(Japize.java:471)
     [exec] 	at net.wuffies.japi.Japize.doJapize(Japize.java:443)
     [exec] 	at net.wuffies.japi.Japize.main(Japize.java:316)

     [exec] Failed to Japize javax.swing.JRadioButtonMenuItem: java.lang.ArrayIndexOutOfBoundsException
     [exec] java.lang.ArrayIndexOutOfBoundsException
     [exec] 	at java.util.Arrays.mergeSort(Arrays.java:2728)
     [exec] 	at java.util.Arrays.mergeSort(Arrays.java:270)
     [exec] 	at java.util.Arrays.sort(Arrays.java:2642)
     [exec] 	at java.util.Arrays.sort(Arrays.java:261)

...

     [exec] 	at net.wuffies.japi.Japize.processRootSet(Japize.java:471)
     [exec] 	at net.wuffies.japi.Japize.doJapize(Japize.java:443)
     [exec] 	at net.wuffies.japi.Japize.main(Japize.java:316)

     [exec] Failed to Japize javax.swing.JRadioButtonMenuItem$AccessibleJRadioButtonMenuItem:
java.lang.ArrayIndexOutOfBoundsException
     [exec] java.lang.ArrayIndexOutOfBoundsException
     [exec] 	at java.util.Arrays.mergeSort(Arrays.java:2728)
     [exec] 	at java.util.Arrays.sort(Arrays.java:2642)
     [exec] 	at java.util.Arrays.sort(Arrays.java:261)
     [exec] 	at net.wuffies.japi.BoundMemberSet.getCalls(BoundMemberSet.java:46)

...

     [exec] 	at net.wuffies.japi.Japize.processRootSet(Japize.java:471)
     [exec] 	at net.wuffies.japi.Japize.doJapize(Japize.java:443)
     [exec] 	at net.wuffies.japi.Japize.main(Japize.java:316)

     [exec] Failed to Japize javax.swing.JRootPane: java.lang.ArrayIndexOutOfBoundsException
     [exec] java.lang.ArrayIndexOutOfBoundsException
     [exec] 	at java.util.Arrays.mergeSort(Arrays.java:2728)
     [exec] 	at java.util.Arrays.sort(Arrays.java:2642)
     [exec] 	at java.util.Arrays.sort(Arrays.java:261)
     [exec] 	at net.wuffies.japi.BoundMemberSet.getFields(BoundMemberSet.java:33)

...

update-index:

test-result:

BUILD FAILED
/home/hybld/continuum-working-directory/22/build.xml:208: There were test errors.

Total time: 87 minutes 49 seconds

****************************************************************************

...

Mime
View raw message