harmony-alerts mailing list archives

Site index · List index
Message view « Date » · « Thread »
Top « Date » · « Thread »
From nbe...@kc.rr.com
Subject [build-test alert] BUILD FAILED Windows XP x86: drlvm-test
Date Mon, 09 Jul 2007 17:34:33 GMT
BUILD FAILED:
	Ant Error Message:
C:\harmony\buildtest2\scripts\cc-exec-adaptor.xml:101: The following error occurred while executing this line: C:\harmony\buildtest2\adaptors\drlvm-test\adaptor.xml:75: There were drlvm-test failures

Date of build:	07/09/2007 07:12:49
Time to build:	319 minutes 39 seconds
Last changed:	07/09/2007 06:20:56
Last log entry:	classlib

***********************************************************
Errors/Warnings:	(102)
            
[java] Java Result: 1
[java] Java Result: 1
[java] Java Result: 130
[java] Timeout: killed the sub-process
[java] 	at org.apache.tools.ant.taskdefs.Java.fork(Java.java:754)
[java] 	at org.apache.tools.ant.taskdefs.Java.executeJava(Java.java:171)
[java] 	at org.apache.tools.ant.taskdefs.Java.execute(Java.java:84)
[java] 	at org.apache.tools.ant.UnknownElement.execute(UnknownElement.java:275)
[java] 	at org.apache.tools.ant.Task.perform(Task.java:364)
[java] 	at org.apache.tools.ant.taskdefs.Sequential.execute(Sequential.java:64)
[java] 	at net.sf.antcontrib.logic.IfTask.execute(IfTask.java:197)
[java] 	at sun.reflect.GeneratedMethodAccessor154.invoke(Unknown Source)
[java] 	at sun.reflect.DelegatingMethodAccessorImpl.invoke(DelegatingMethodAccessorImpl.java:25)
[java] 	at java.lang.reflect.Method.invoke(Method.java:585)
[java] 	at org.apache.tools.ant.TaskAdapter.execute(TaskAdapter.java:123)
[java] 	at org.apache.tools.ant.UnknownElement.execute(UnknownElement.java:275)
[java] 	at org.apache.tools.ant.Task.perform(Task.java:364)
[java] 	at org.apache.tools.ant.taskdefs.Sequential.execute(Sequential.java:64)
[java] 	at org.apache.tools.ant.UnknownElement.execute(UnknownElement.java:275)
[java] 	at org.apache.tools.ant.Task.perform(Task.java:364)
[java] 	at org.apache.tools.ant.taskdefs.MacroInstance.execute(MacroInstance.java:378)
[java] 	at net.sf.antcontrib.logic.ForDelegate.doSequentialIteration(ForDelegate.java:228)
[java] 	at net.sf.antcontrib.logic.ForDelegate.doTheTasks(ForDelegate.java:281)
[java] 	at net.sf.antcontrib.logic.ForDelegate.execute(ForDelegate.java:213)
[java] 	at net.sf.antcontrib.logic.For.execute(For.java:166)
[java] 	at org.apache.tools.ant.UnknownElement.execute(UnknownElement.java:275)
[java] 	at org.apache.tools.ant.Task.perform(Task.java:364)
[java] 	at org.apache.tools.ant.Target.execute(Target.java:341)
[java] 	at org.apache.tools.ant.Target.performTasks(Target.java:369)
[java] 	at org.apache.tools.ant.Project.executeSortedTargets(Project.java:1216)
[java] 	at org.apache.tools.ant.helper.SingleCheckExecutor.executeTargets(SingleCheckExecutor.java:37)
[java] 	at org.apache.tools.ant.Project.executeTargets(Project.java:1068)
[java] 	at org.apache.tools.ant.taskdefs.Ant.execute(Ant.java:382)
[java] 	at org.apache.tools.ant.taskdefs.CallTarget.execute(CallTarget.java:107)
[java] 	at org.apache.tools.ant.UnknownElement.execute(UnknownElement.java:275)
[java] 	at org.apache.tools.ant.Task.perform(Task.java:364)
[java] 	at org.apache.tools.ant.taskdefs.Sequential.execute(Sequential.java:64)
[java] 	at org.apache.tools.ant.UnknownElement.execute(UnknownElement.java:275)
[java] 	at org.apache.tools.ant.Task.perform(Task.java:364)
[java] 	at org.apache.tools.ant.taskdefs.MacroInstance.execute(MacroInstance.java:378)
[java] 	at net.sf.antcontrib.logic.ForDelegate.doSequentialIteration(ForDelegate.java:228)
[java] 	at net.sf.antcontrib.logic.ForDelegate.doTheTasks(ForDelegate.java:253)
[java] 	at net.sf.antcontrib.logic.ForDelegate.execute(ForDelegate.java:213)
[java] 	at net.sf.antcontrib.logic.For.execute(For.java:166)
[java] 	at org.apache.tools.ant.UnknownElement.execute(UnknownElement.java:275)
[java] 	at org.apache.tools.ant.Task.perform(Task.java:364)
[java] 	at org.apache.tools.ant.Target.execute(Target.java:341)
[java] 	at org.apache.tools.ant.Target.performTasks(Target.java:369)
[java] 	at org.apache.tools.ant.Project.executeSortedTargets(Project.java:1216)
[java] 	at org.apache.tools.ant.Project.executeTarget(Project.java:1185)
[java] 	at net.sf.antcontrib.logic.AntFetch.execute(AntFetch.java:345)
[java] 	at org.apache.tools.ant.UnknownElement.execute(UnknownElement.java:275)
[java] 	at org.apache.tools.ant.Task.perform(Task.java:364)
[java] 	at org.apache.tools.ant.Target.execute(Target.java:341)
[java] 	at org.apache.tools.ant.Target.performTasks(Target.java:369)
[java] 	at org.apache.tools.ant.Project.executeSortedTargets(Project.java:1216)
[java] 	at org.apache.tools.ant.helper.SingleCheckExecutor.executeTargets(SingleCheckExecutor.java:37)
[java] 	at org.apache.tools.ant.Project.executeTargets(Project.java:1068)
[java] 	at org.apache.tools.ant.taskdefs.Ant.execute(Ant.java:382)
[java] 	at org.apache.tools.ant.UnknownElement.execute(UnknownElement.java:275)
[java] 	at org.apache.tools.ant.Task.perform(Task.java:364)
[java] 	at org.apache.tools.ant.Target.execute(Target.java:341)
[java] 	at org.apache.tools.ant.Target.performTasks(Target.java:369)
[java] 	at org.apache.tools.ant.Project.executeSortedTargets(Project.java:1216)
[java] 	at org.apache.tools.ant.helper.SingleCheckExecutor.executeTargets(SingleCheckExecutor.java:37)
[java] 	at org.apache.tools.ant.Project.executeTargets(Project.java:1068)
[java] 	at org.apache.tools.ant.taskdefs.Ant.execute(Ant.java:382)
[java] 	at org.apache.tools.ant.taskdefs.SubAnt.execute(SubAnt.java:277)
[java] 	at org.apache.tools.ant.taskdefs.SubAnt.execute(SubAnt.java:201)
[java] 	at org.apache.tools.ant.UnknownElement.execute(UnknownElement.java:275)
[java] 	at org.apache.tools.ant.Task.perform(Task.java:364)
[java] 	at org.apache.tools.ant.Target.execute(Target.java:341)
[java] 	at org.apache.tools.ant.Target.performTasks(Target.java:369)
[java] 	at org.apache.tools.ant.Project.executeSortedTargets(Project.java:1216)
[java] 	at org.apache.tools.ant.Project.executeTarget(Project.java:1185)
[java] 	at org.apache.tools.ant.helper.DefaultExecutor.executeTargets(DefaultExecutor.java:40)
[java] 	at org.apache.tools.ant.Project.executeTargets(Project.java:1068)
[java] 	at org.apache.tools.ant.Main.runBuild(Main.java:668)
[java] 	at org.apache.tools.ant.Main.startAnt(Main.java:187)
[java] 	at org.apache.tools.ant.launch.Launcher.run(Launcher.java:246)
[java] 	at org.apache.tools.ant.launch.Launcher.main(Launcher.java:67)
[java] Java Result: 1
[java] Java Result: 1
[java] Java Result: 130
[java] Java Result: 1
[java] Java Result: 1
[java] Java Result: 130
[java] Java Result: 1
[java] Java Result: 1
[java] Java Result: 130
[java] Java Result: 1
[java] Java Result: 1
[java] Java Result: 130
[junit] Tests FAILED
[junit] Tests FAILED
BUILD FAILED
C:\harmony\buildtest2\build\checkouts\drlvm\build\make\build.xml:398: The following error occurred while executing this line:
C:\harmony\buildtest2\build\checkouts\drlvm\build\make\build_component.xml:73: The following error occurred while executing this line:
C:\harmony\buildtest2\build\checkouts\drlvm\build\win_ia32_msvc_debug\semis\build\targets\test.xml:6: Some tests failed
Total time: 317 minutes 13 seconds
The execution FAILED with the following exception:
The following error occurred while executing this line:
C:\harmony\buildtest2\adaptors\drlvm-test\adaptor.xml:75: There were drlvm-test failures

***********************************************************
Unit Tests: (4338)
        
failure: test_exec_Str java.lang.RuntimeTest2
failure: test_exec_Str java.lang.RuntimeTest2
Unit Test Error Details:	(2)
                
Test: test_exec_StrClass: java.lang.RuntimeTest2junit.framework.AssertionFailedError: check001: the date's reply has not been received
	at junit.framework.Assert.fail(Assert.java:47)
	at java.lang.RuntimeTest2.exec_StrForWindows(RuntimeTest2.java:295)
	at java.lang.RuntimeTest2.test_exec_Str(RuntimeTest2.java:362)
	at java.lang.reflect.VMReflection.invokeMethod(VMReflection.java)
	at java.lang.reflect.Method.invoke(Method.java:317)
	at junit.framework.TestCase.runTest(TestCase.java:164)
	at junit.framework.TestCase.runBare(TestCase.java:130)
	at junit.framework.TestResult$1.protect(TestResult.java:106)
	at junit.framework.TestResult.runProtected(TestResult.java:124)
	at junit.framework.TestResult.run(TestResult.java:109)
	at junit.framework.TestCase.run(TestCase.java:120)
	at junit.framework.TestSuite.runTest(TestSuite.java:230)
	at junit.framework.TestSuite.run(TestSuite.java:225)
	at org.apache.tools.ant.taskdefs.optional.junit.JUnitTestRunner.run(JUnitTestRunner.java:297)
	at org.apache.tools.ant.taskdefs.optional.junit.JUnitTestRunner.launch(JUnitTestRunner.java:672)
	at org.apache.tools.ant.taskdefs.optional.junit.JUnitTestRunner.main(JUnitTestRunner.java:546)
Test: test_exec_StrClass: java.lang.RuntimeTest2junit.framework.AssertionFailedError: check001: the date's reply has not been received
	at junit.framework.Assert.fail(Assert.java:47)
	at java.lang.RuntimeTest2.exec_StrForWindows(RuntimeTest2.java:295)
	at java.lang.RuntimeTest2.test_exec_Str(RuntimeTest2.java:362)
	at java.lang.reflect.VMReflection.invokeMethod(VMReflection.java)
	at java.lang.reflect.Method.invoke(Method.java:317)
	at junit.framework.TestCase.runTest(TestCase.java:164)
	at junit.framework.TestCase.runBare(TestCase.java)
	at junit.framework.TestResult$1.protect(TestResult.java)
	at junit.framework.TestResult.runProtected(TestResult.java)
	at junit.framework.TestResult.run(TestResult.java)
	at junit.framework.TestCase.run(TestCase.java)
	at junit.framework.TestSuite.runTest(TestSuite.java:230)
	at junit.framework.TestSuite.run(TestSuite.java)
	at org.apache.tools.ant.taskdefs.optional.junit.JUnitTestRunner.run(JUnitTestRunner.java)
	at org.apache.tools.ant.taskdefs.optional.junit.JUnitTestRunner.launch(JUnitTestRunner.java:672)
	at org.apache.tools.ant.taskdefs.optional.junit.JUnitTestRunner.main(JUnitTestRunner.java:546)

***********************************************************
Modifications since last successful build:	(269)
            
add cc-classlib log20070709062056Lbuild.55 07/09/2007 06:20:56classlib
modified tonywu  /harmony/enhanced/classlib/trunk/modules/luni/src/main/java/java/util/GregorianCalendar.java 07/09/2007 05:31:42 Fix HARMONY-4372 ([classlib][luni] GregorianCalendar.roll() works incorrectly around end of year if MinimalDaysInFirstWeek is 4)
modified tonywu  /harmony/enhanced/classlib/trunk/modules/luni/src/test/api/common/tests/api/java/util/GregorianCalendarTest.java 07/09/2007 05:31:42 Fix HARMONY-4372 ([classlib][luni] GregorianCalendar.roll() works incorrectly around end of year if MinimalDaysInFirstWeek is 4)
modified tonywu  /harmony/enhanced/classlib/trunk/modules/luni/src/main/java/java/util/GregorianCalendar.java 07/09/2007 05:31:42 Fix HARMONY-4372 ([classlib][luni] GregorianCalendar.roll() works incorrectly around end of year if MinimalDaysInFirstWeek is 4)
modified tonywu  /harmony/enhanced/classlib/trunk/modules/luni/src/test/api/common/tests/api/java/util/GregorianCalendarTest.java 07/09/2007 05:31:42 Fix HARMONY-4372 ([classlib][luni] GregorianCalendar.roll() works incorrectly around end of year if MinimalDaysInFirstWeek is 4)
modified leoli  /harmony/enhanced/classlib/trunk/modules/luni/src/main/java/java/util/AbstractSequentialList.java 07/09/2007 05:25:36 Apply patch for HARMONY-4395([classlib][util]AbstractSequentialList.set should throw IndexOutOfBoundsException when no elements exists.).
modified leoli  /harmony/enhanced/classlib/trunk/modules/luni/src/test/api/common/tests/api/java/util/AbstractSequentialListTest.java 07/09/2007 05:25:36 Apply patch for HARMONY-4395([classlib][util]AbstractSequentialList.set should throw IndexOutOfBoundsException when no elements exists.).
modified leoli  /harmony/enhanced/classlib/trunk/modules/luni/src/main/java/java/util/AbstractSequentialList.java 07/09/2007 05:25:36 Apply patch for HARMONY-4395([classlib][util]AbstractSequentialList.set should throw IndexOutOfBoundsException when no elements exists.).
modified leoli  /harmony/enhanced/classlib/trunk/modules/luni/src/test/api/common/tests/api/java/util/AbstractSequentialListTest.java 07/09/2007 05:25:36 Apply patch for HARMONY-4395([classlib][util]AbstractSequentialList.set should throw IndexOutOfBoundsException when no elements exists.).
add cc-classlib log20070709052425Lbuild.54 07/09/2007 05:24:25classlib
modified hindessm  /harmony/enhanced/classlib/trunk/modules/portlib/src/test/native/hytime/shared/hytime.c 07/09/2007 03:49:09 Allow this to compile with -Dhy.no.thr=true.
modified hindessm  /harmony/enhanced/classlib/trunk/modules/portlib/src/test/native/hytime/shared/hytime.c 07/09/2007 03:49:09 Allow this to compile with -Dhy.no.thr=true.
modified leoli  /harmony/enhanced/classlib/trunk/modules/luni/src/main/java/java/net/ProxySelectorImpl.java 07/09/2007 03:23:12 Fix bug for HARMONY-4281([classlib][net] test tests.api.java.net.ProxySelectorTest failed if proxy defined in the classlib\depends\files\net.properties)
modified leoli  /harmony/enhanced/classlib/trunk/modules/luni/src/test/api/common/tests/api/java/net/ProxySelectorTest.java 07/09/2007 03:23:12 Fix bug for HARMONY-4281([classlib][net] test tests.api.java.net.ProxySelectorTest failed if proxy defined in the classlib\depends\files\net.properties)
modified leoli  /harmony/enhanced/classlib/trunk/modules/luni/src/main/java/java/net/ProxySelectorImpl.java 07/09/2007 03:23:12 Fix bug for HARMONY-4281([classlib][net] test tests.api.java.net.ProxySelectorTest failed if proxy defined in the classlib\depends\files\net.properties)
modified leoli  /harmony/enhanced/classlib/trunk/modules/luni/src/test/api/common/tests/api/java/net/ProxySelectorTest.java 07/09/2007 03:23:12 Fix bug for HARMONY-4281([classlib][net] test tests.api.java.net.ProxySelectorTest failed if proxy defined in the classlib\depends\files\net.properties)
add cc-classlib log20070709023515Lbuild.53 07/09/2007 02:35:15classlib
modified pyang  /harmony/enhanced/classlib/trunk/modules/beans/src/main/java/java/beans/SimpleBeanInfo.java 07/09/2007 01:49:57 SimpleBeanInfo.loadImage(String) should return null on given null parameter
modified pyang  /harmony/enhanced/classlib/trunk/modules/beans/src/test/java/org/apache/harmony/beans/tests/java/beans/SimpleBeanInfoTest.java 07/09/2007 01:49:57 SimpleBeanInfo.loadImage(String) should return null on given null parameter
modified pyang  /harmony/enhanced/classlib/trunk/modules/beans/src/main/java/java/beans/SimpleBeanInfo.java 07/09/2007 01:49:57 SimpleBeanInfo.loadImage(String) should return null on given null parameter
modified pyang  /harmony/enhanced/classlib/trunk/modules/beans/src/test/java/org/apache/harmony/beans/tests/java/beans/SimpleBeanInfoTest.java 07/09/2007 01:49:57 SimpleBeanInfo.loadImage(String) should return null on given null parameter
add cc-classlib log20070709014405Lbuild.52 07/09/2007 01:44:05classlib
modified pyang  /harmony/enhanced/classlib/trunk/modules/beans/src/main/java/java/beans/EventHandler.java 07/09/2007 01:41:16 1. modify EventHanderTest according to RI's behavior 2. fix java.beans.EventHandler
modified pyang  /harmony/enhanced/classlib/trunk/modules/beans/src/test/java/org/apache/harmony/beans/tests/java/beans/EventHandlerTest.java 07/09/2007 01:41:16 1. modify EventHanderTest according to RI's behavior 2. fix java.beans.EventHandler
modified pyang  /harmony/enhanced/classlib/trunk/modules/beans/src/main/java/java/beans/EventHandler.java 07/09/2007 01:41:16 1. modify EventHanderTest according to RI's behavior 2. fix java.beans.EventHandler
modified pyang  /harmony/enhanced/classlib/trunk/modules/beans/src/test/java/org/apache/harmony/beans/tests/java/beans/EventHandlerTest.java 07/09/2007 01:41:16 1. modify EventHanderTest according to RI's behavior 2. fix java.beans.EventHandler
add cc-drlvm log20070706114435Lbuild.32 07/06/2007 11:44:35drlvm
add cc-classlib log20070706043022Lbuild.51 07/06/2007 04:30:22classlib
modified pyang  /harmony/enhanced/classlib/trunk/modules/beans/src/test/java/org/apache/harmony/beans/tests/java/beans/VetoableChangeSupportTest.java 07/06/2007 02:11:41 1. Refine the VetoableChangeSupport against RI's behavior, the original version has 12 faiulres in RI; 2. add serialization test; 3. Fix VetoableChangeSupport to pass most of the tests, but there's still 1 failures left
modified pyang  /harmony/enhanced/classlib/trunk/modules/beans/src/main/java/java/beans/VetoableChangeSupport.java 07/06/2007 02:11:41 1. Refine the VetoableChangeSupport against RI's behavior, the original version has 12 faiulres in RI; 2. add serialization test; 3. Fix VetoableChangeSupport to pass most of the tests, but there's still 1 failures left
modified pyang  /harmony/enhanced/classlib/trunk/modules/beans/src/test/java/org/apache/harmony/beans/tests/java/beans/VetoableChangeSupportTest.java 07/06/2007 02:11:41 1. Refine the VetoableChangeSupport against RI's behavior, the original version has 12 faiulres in RI; 2. add serialization test; 3. Fix VetoableChangeSupport to pass most of the tests, but there's still 1 failures left
modified pyang  /harmony/enhanced/classlib/trunk/modules/beans/src/main/java/java/beans/VetoableChangeSupport.java 07/06/2007 02:11:41 1. Refine the VetoableChangeSupport against RI's behavior, the original version has 12 faiulres in RI; 2. add serialization test; 3. Fix VetoableChangeSupport to pass most of the tests, but there's still 1 failures left
modified tonywu  /harmony/enhanced/classlib/trunk/modules/luni/src/main/java/java/io/CharArrayReader.java 07/06/2007 01:26:09 Fix HARMONY-4357 ([classlib][luni] Compatibility: CharArrayReader.reset() behavior differs on Harmony and RI if the stream hasn't been marked)
modified tonywu  /harmony/enhanced/classlib/trunk/modules/luni/src/test/api/common/tests/api/java/io/CharArrayReaderTest.java 07/06/2007 01:26:09 Fix HARMONY-4357 ([classlib][luni] Compatibility: CharArrayReader.reset() behavior differs on Harmony and RI if the stream hasn't been marked)
modified tonywu  /harmony/enhanced/classlib/trunk/modules/luni/src/main/java/java/io/CharArrayReader.java 07/06/2007 01:26:09 Fix HARMONY-4357 ([classlib][luni] Compatibility: CharArrayReader.reset() behavior differs on Harmony and RI if the stream hasn't been marked)
modified tonywu  /harmony/enhanced/classlib/trunk/modules/luni/src/test/api/common/tests/api/java/io/CharArrayReaderTest.java 07/06/2007 01:26:09 Fix HARMONY-4357 ([classlib][luni] Compatibility: CharArrayReader.reset() behavior differs on Harmony and RI if the stream hasn't been marked)
modified pyang  /harmony/enhanced/classlib/trunk/modules/beans/src/main/java/java/beans/VetoableChangeListenerProxy.java 07/06/2007 01:17:02 Fix the VetoableChangeListenerProxy to enable VetoableChangeListenerProxyTest
modified pyang  /harmony/enhanced/classlib/trunk/modules/beans/make/exclude.common 07/06/2007 01:17:02 Fix the VetoableChangeListenerProxy to enable VetoableChangeListenerProxyTest
modified pyang  /harmony/enhanced/classlib/trunk/modules/beans/src/main/java/java/beans/VetoableChangeListenerProxy.java 07/06/2007 01:17:02 Fix the VetoableChangeListenerProxy to enable VetoableChangeListenerProxyTest
modified pyang  /harmony/enhanced/classlib/trunk/modules/beans/make/exclude.common 07/06/2007 01:17:02 Fix the VetoableChangeListenerProxy to enable VetoableChangeListenerProxyTest
modified tonywu  /harmony/enhanced/classlib/trunk/modules/luni/src/test/api/common/tests/api/java/net/MulticastSocketTest.java 07/06/2007 00:47:19 Remove the assertion since it fails on both RI and Harmony in IPv6 Env
modified tonywu  /harmony/enhanced/classlib/trunk/modules/luni/src/test/api/common/tests/api/java/net/MulticastSocketTest.java 07/06/2007 00:47:19 Remove the assertion since it fails on both RI and Harmony in IPv6 Env
add cc-classlib log20070705231653Lbuild.50 07/05/2007 23:16:53classlib
modified pyang  /harmony/enhanced/classlib/trunk/modules/beans/src/test/java/org/apache/harmony/beans/tests/java/beans/beancontext/BeanContextServiceRevokedEventTest.java 07/05/2007 22:41:59 In the BeanContextServiceRevokeEvent constructor, the propgatedFrom should not be set, fix this bug with regression test
modified pyang  /harmony/enhanced/classlib/trunk/modules/beans/src/main/java/java/beans/beancontext/BeanContextServiceRevokedEvent.java 07/05/2007 22:41:59 In the BeanContextServiceRevokeEvent constructor, the propgatedFrom should not be set, fix this bug with regression test
modified pyang  /harmony/enhanced/classlib/trunk/modules/beans/src/test/java/org/apache/harmony/beans/tests/java/beans/beancontext/BeanContextServiceRevokedEventTest.java 07/05/2007 22:41:59 In the BeanContextServiceRevokeEvent constructor, the propgatedFrom should not be set, fix this bug with regression test
modified pyang  /harmony/enhanced/classlib/trunk/modules/beans/src/main/java/java/beans/beancontext/BeanContextServiceRevokedEvent.java 07/05/2007 22:41:59 In the BeanContextServiceRevokeEvent constructor, the propgatedFrom should not be set, fix this bug with regression test
add cc-classlib log20070705222306Lbuild.49 07/05/2007 22:23:06classlib
modified leoli  /harmony/enhanced/classlib/trunk/modules/beans/src/test/java/org/apache/harmony/beans/tests/java/beans/beancontext/BeanContextServicesSupportTest.java 07/05/2007 22:21:21 Apply patch for HARMONY-4344([classlib][beans] BeanContextServicesSupport.serviceAvailable will add duplicate service class).
modified leoli  /harmony/enhanced/classlib/trunk/modules/beans/src/main/java/java/beans/beancontext/BeanContextServicesSupport.java 07/05/2007 22:21:21 Apply patch for HARMONY-4344([classlib][beans] BeanContextServicesSupport.serviceAvailable will add duplicate service class).
modified leoli  /harmony/enhanced/classlib/trunk/modules/beans/src/test/java/org/apache/harmony/beans/tests/java/beans/beancontext/BeanContextServicesSupportTest.java 07/05/2007 22:21:21 Apply patch for HARMONY-4344([classlib][beans] BeanContextServicesSupport.serviceAvailable will add duplicate service class).
modified leoli  /harmony/enhanced/classlib/trunk/modules/beans/src/main/java/java/beans/beancontext/BeanContextServicesSupport.java 07/05/2007 22:21:21 Apply patch for HARMONY-4344([classlib][beans] BeanContextServicesSupport.serviceAvailable will add duplicate service class).
add cc-drlvm log20070705095609Lbuild.31 07/05/2007 09:56:09drlvm
modified mfursov  /harmony/enhanced/drlvm/trunk/vm/jitrino/src/optimizer/Opnd.cpp 07/05/2007 07:51:20 Fix for HARMONY-4349  (error in lazy resolution helpers)Fix for HARMONY-4334  (support for unresolved compressed types in Jitrino.OPT)Fix for HARMONY-4181  (fix for x86_64 calling conventions support in Jitrino.JET)reenabling HARMONY-4267 regression test on x86_64 platforms
modified mfursov  /harmony/enhanced/drlvm/trunk/vm/jitrino/src/shared/Type.cpp 07/05/2007 07:51:20 Fix for HARMONY-4349  (error in lazy resolution helpers)Fix for HARMONY-4334  (support for unresolved compressed types in Jitrino.OPT)Fix for HARMONY-4181  (fix for x86_64 calling conventions support in Jitrino.JET)reenabling HARMONY-4267 regression test on x86_64 platforms
modified mfursov  /harmony/enhanced/drlvm/trunk/src/test/regression/excludes/exclude.windows.x86_64 07/05/2007 07:51:20 Fix for HARMONY-4349  (error in lazy resolution helpers)Fix for HARMONY-4334  (support for unresolved compressed types in Jitrino.OPT)Fix for HARMONY-4181  (fix for x86_64 calling conventions support in Jitrino.JET)reenabling HARMONY-4267 regression test on x86_64 platforms
modified mfursov  /harmony/enhanced/drlvm/trunk/vm/jitrino/src/jet/compiler.cpp 07/05/2007 07:51:20 Fix for HARMONY-4349  (error in lazy resolution helpers)Fix for HARMONY-4334  (support for unresolved compressed types in Jitrino.OPT)Fix for HARMONY-4181  (fix for x86_64 calling conventions support in Jitrino.JET)reenabling HARMONY-4267 regression test on x86_64 platforms
modified mfursov  /harmony/enhanced/drlvm/trunk/vm/jitrino/src/jet/csig.h 07/05/2007 07:51:20 Fix for HARMONY-4349  (error in lazy resolution helpers)Fix for HARMONY-4334  (support for unresolved compressed types in Jitrino.OPT)Fix for HARMONY-4181  (fix for x86_64 calling conventions support in Jitrino.JET)reenabling HARMONY-4267 regression test on x86_64 platforms
modified mfursov  /harmony/enhanced/drlvm/trunk/vm/jitrino/src/shared/Type.h 07/05/2007 07:51:20 Fix for HARMONY-4349  (error in lazy resolution helpers)Fix for HARMONY-4334  (support for unresolved compressed types in Jitrino.OPT)Fix for HARMONY-4181  (fix for x86_64 calling conventions support in Jitrino.JET)reenabling HARMONY-4267 regression test on x86_64 platforms
modified mfursov  /harmony/enhanced/drlvm/trunk/vm/vmcore/src/class_support/Resolve.cpp 07/05/2007 07:51:20 Fix for HARMONY-4349  (error in lazy resolution helpers)Fix for HARMONY-4334  (support for unresolved compressed types in Jitrino.OPT)Fix for HARMONY-4181  (fix for x86_64 calling conventions support in Jitrino.JET)reenabling HARMONY-4267 regression test on x86_64 platforms
modified mfursov  /harmony/enhanced/drlvm/trunk/src/test/regression/excludes/exclude.linux.x86_64 07/05/2007 07:51:20 Fix for HARMONY-4349  (error in lazy resolution helpers)Fix for HARMONY-4334  (support for unresolved compressed types in Jitrino.OPT)Fix for HARMONY-4181  (fix for x86_64 calling conventions support in Jitrino.JET)reenabling HARMONY-4267 regression test on x86_64 platforms
modified mfursov  /harmony/enhanced/drlvm/trunk/vm/jitrino/src/translator/java/JavaLabelPrepass.h 07/05/2007 07:51:20 Fix for HARMONY-4349  (error in lazy resolution helpers)Fix for HARMONY-4334  (support for unresolved compressed types in Jitrino.OPT)Fix for HARMONY-4181  (fix for x86_64 calling conventions support in Jitrino.JET)reenabling HARMONY-4267 regression test on x86_64 platforms
add cc-drlvm log20070705043415Lbuild.30 07/05/2007 04:34:15drlvm
add cc-classlib log20070705041923Lbuild.48 07/05/2007 04:19:23classlib
modified ivavladimir  /harmony/enhanced/drlvm/trunk/build/make/excludes/exclude.drlvm_smoke.windows.x86_64.jet 07/05/2007 02:41:45 exclude test exception/FinalizeStackTest on Win x86_64 due to HARMONY-2972
modified leoli  /harmony/enhanced/classlib/trunk/modules/sql/src/main/java/java/sql/DriverManager.java 07/05/2007 00:53:44 Apply patch for HARMONY-4303([classlib][sql] java.sql.DriverManager.getDrivers() will read System prpperty "jdbc.drivers" cause java.lang.ExceptionInInitializerError).
modified leoli  /harmony/enhanced/classlib/trunk/modules/sql/src/test/java/org/apache/harmony/sql/tests/java/sql/DriverManagerTest.java 07/05/2007 00:53:44 Apply patch for HARMONY-4303([classlib][sql] java.sql.DriverManager.getDrivers() will read System prpperty "jdbc.drivers" cause java.lang.ExceptionInInitializerError).
added leoli  /harmony/enhanced/classlib/trunk/modules/sql/src/test/java/org/apache/harmony/sql/tests/java/sql/TestMainForDriver.java 07/05/2007 00:53:44 Apply patch for HARMONY-4303([classlib][sql] java.sql.DriverManager.getDrivers() will read System prpperty "jdbc.drivers" cause java.lang.ExceptionInInitializerError).
modified leoli  /harmony/enhanced/classlib/trunk/modules/sql/META-INF/MANIFEST.MF 07/05/2007 00:53:44 Apply patch for HARMONY-4303([classlib][sql] java.sql.DriverManager.getDrivers() will read System prpperty "jdbc.drivers" cause java.lang.ExceptionInInitializerError).
modified leoli  /harmony/enhanced/classlib/trunk/modules/sql/src/main/java/java/sql/DriverManager.java 07/05/2007 00:53:44 Apply patch for HARMONY-4303([classlib][sql] java.sql.DriverManager.getDrivers() will read System prpperty "jdbc.drivers" cause java.lang.ExceptionInInitializerError).
modified leoli  /harmony/enhanced/classlib/trunk/modules/sql/src/test/java/org/apache/harmony/sql/tests/java/sql/DriverManagerTest.java 07/05/2007 00:53:44 Apply patch for HARMONY-4303([classlib][sql] java.sql.DriverManager.getDrivers() will read System prpperty "jdbc.drivers" cause java.lang.ExceptionInInitializerError).
added leoli  /harmony/enhanced/classlib/trunk/modules/sql/src/test/java/org/apache/harmony/sql/tests/java/sql/TestMainForDriver.java 07/05/2007 00:53:44 Apply patch for HARMONY-4303([classlib][sql] java.sql.DriverManager.getDrivers() will read System prpperty "jdbc.drivers" cause java.lang.ExceptionInInitializerError).
modified leoli  /harmony/enhanced/classlib/trunk/modules/sql/META-INF/MANIFEST.MF 07/05/2007 00:53:44 Apply patch for HARMONY-4303([classlib][sql] java.sql.DriverManager.getDrivers() will read System prpperty "jdbc.drivers" cause java.lang.ExceptionInInitializerError).
add cc-classlib log20070704234328Lbuild.47 07/04/2007 23:43:28classlib
modified leoli  /harmony/enhanced/classlib/trunk/modules/jndi/src/main/java/javax/naming/InitialContext.java 07/04/2007 22:28:47 Roll back the patch for HARMONY-4141 on javax.naming.InitialContext. The applied patch is not ready actually.
modified leoli  /harmony/enhanced/classlib/trunk/modules/jndi/src/main/java/javax/naming/InitialContext.java 07/04/2007 22:28:47 Roll back the patch for HARMONY-4141 on javax.naming.InitialContext. The applied patch is not ready actually.
add cc-drlvm log20070704191015Lbuild.29 07/04/2007 19:10:15drlvm
add cc-classlib log20070704132255Lbuild.46 07/04/2007 13:22:55classlib
modified tonywu  /harmony/enhanced/classlib/trunk/modules/luni/src/test/api/common/tests/api/java/io/SerializationStressTest5.java 07/04/2007 10:21:07 clean up compiler warnings in io module, no functional change.
modified tonywu  /harmony/enhanced/classlib/trunk/modules/luni/src/test/api/common/tests/api/java/io/StreamTokenizerTest.java 07/04/2007 10:21:07 clean up compiler warnings in io module, no functional change.
modified tonywu  /harmony/enhanced/classlib/trunk/modules/luni/src/test/api/common/tests/api/java/io/StringBufferInputStreamTest.java 07/04/2007 10:21:07 clean up compiler warnings in io module, no functional change.
modified tonywu  /harmony/enhanced/classlib/trunk/modules/luni/src/test/api/common/tests/api/java/io/SerializationStressTest.java 07/04/2007 10:21:07 clean up compiler warnings in io module, no functional change.
modified tonywu  /harmony/enhanced/classlib/trunk/modules/luni/src/test/api/common/tests/api/java/io/SerializationStressTest1.java 07/04/2007 10:21:07 clean up compiler warnings in io module, no functional change.
modified tonywu  /harmony/enhanced/classlib/trunk/modules/luni/src/test/api/common/tests/api/java/io/SerializationStressTest2.java 07/04/2007 10:21:07 clean up compiler warnings in io module, no functional change.
modified tonywu  /harmony/enhanced/classlib/trunk/modules/luni/src/test/api/common/tests/api/java/io/SerializationStressTest3.java 07/04/2007 10:21:07 clean up compiler warnings in io module, no functional change.
modified tonywu  /harmony/enhanced/classlib/trunk/modules/luni/src/test/api/common/tests/api/java/io/SerializationStressTest4.java 07/04/2007 10:21:07 clean up compiler warnings in io module, no functional change.
modified tonywu  /harmony/enhanced/classlib/trunk/modules/luni/src/test/api/common/tests/api/java/io/SerializationStressTest5.java 07/04/2007 10:21:07 clean up compiler warnings in io module, no functional change.
modified tonywu  /harmony/enhanced/classlib/trunk/modules/luni/src/test/api/common/tests/api/java/io/StreamTokenizerTest.java 07/04/2007 10:21:07 clean up compiler warnings in io module, no functional change.
modified tonywu  /harmony/enhanced/classlib/trunk/modules/luni/src/test/api/common/tests/api/java/io/StringBufferInputStreamTest.java 07/04/2007 10:21:07 clean up compiler warnings in io module, no functional change.
modified tonywu  /harmony/enhanced/classlib/trunk/modules/luni/src/test/api/common/tests/api/java/io/SerializationStressTest.java 07/04/2007 10:21:07 clean up compiler warnings in io module, no functional change.
modified tonywu  /harmony/enhanced/classlib/trunk/modules/luni/src/test/api/common/tests/api/java/io/SerializationStressTest1.java 07/04/2007 10:21:07 clean up compiler warnings in io module, no functional change.
modified tonywu  /harmony/enhanced/classlib/trunk/modules/luni/src/test/api/common/tests/api/java/io/SerializationStressTest2.java 07/04/2007 10:21:07 clean up compiler warnings in io module, no functional change.
modified tonywu  /harmony/enhanced/classlib/trunk/modules/luni/src/test/api/common/tests/api/java/io/SerializationStressTest3.java 07/04/2007 10:21:07 clean up compiler warnings in io module, no functional change.
modified tonywu  /harmony/enhanced/classlib/trunk/modules/luni/src/test/api/common/tests/api/java/io/SerializationStressTest4.java 07/04/2007 10:21:07 clean up compiler warnings in io module, no functional change.
add cc-drlvm log20070704085341Lbuild.28 07/04/2007 08:53:41drlvm
add cc-classlib log20070704082920Lbuild.45 07/04/2007 08:29:20classlib
added tonywu  /harmony/enhanced/classlib/trunk/modules/luni/src/test/api/common/tests/api/java/io/InputStreamTest.java 07/04/2007 07:59:54 Fix Harmony-4337 ([classlib][luni] Compatibility: InputStream.read(null, offset, len) exception throwing order differs on Harmony and RI if offset is negative)
modified tonywu  /harmony/enhanced/classlib/trunk/modules/luni/src/main/java/java/io/InputStream.java 07/04/2007 07:59:54 Fix Harmony-4337 ([classlib][luni] Compatibility: InputStream.read(null, offset, len) exception throwing order differs on Harmony and RI if offset is negative)
added tonywu  /harmony/enhanced/classlib/trunk/modules/luni/src/test/api/common/tests/api/java/io/InputStreamTest.java 07/04/2007 07:59:54 Fix Harmony-4337 ([classlib][luni] Compatibility: InputStream.read(null, offset, len) exception throwing order differs on Harmony and RI if offset is negative)
modified tonywu  /harmony/enhanced/classlib/trunk/modules/luni/src/main/java/java/io/InputStream.java 07/04/2007 07:59:54 Fix Harmony-4337 ([classlib][luni] Compatibility: InputStream.read(null, offset, len) exception throwing order differs on Harmony and RI if offset is negative)
add cc-classlib log20070704074931Lbuild.44 07/04/2007 07:49:31classlib
modified apetrenko  /harmony/enhanced/classlib/trunk/modules/awt/src/main/java/common/org/apache/harmony/awt/gl/CommonGraphics2DFactory.java 07/04/2007 05:54:26 Patch for HARMONY-3719 "Graphics.getFontMetrics() throws HeadlessExcetion if headless"
modified apetrenko  /harmony/enhanced/classlib/trunk/modules/awt/src/main/java/common/org/apache/harmony/awt/wtk/GraphicsFactory.java 07/04/2007 05:54:26 Patch for HARMONY-3719 "Graphics.getFontMetrics() throws HeadlessExcetion if headless"
modified apetrenko  /harmony/enhanced/classlib/trunk/modules/awt/src/main/java/common/java/awt/ToolkitImpl.java 07/04/2007 05:54:26 Patch for HARMONY-3719 "Graphics.getFontMetrics() throws HeadlessExcetion if headless"
modified apetrenko  /harmony/enhanced/classlib/trunk/modules/awt/src/main/java/common/org/apache/harmony/awt/gl/CommonGraphics2DFactory.java 07/04/2007 05:54:26 Patch for HARMONY-3719 "Graphics.getFontMetrics() throws HeadlessExcetion if headless"
modified apetrenko  /harmony/enhanced/classlib/trunk/modules/awt/src/main/java/common/org/apache/harmony/awt/wtk/GraphicsFactory.java 07/04/2007 05:54:26 Patch for HARMONY-3719 "Graphics.getFontMetrics() throws HeadlessExcetion if headless"
modified apetrenko  /harmony/enhanced/classlib/trunk/modules/awt/src/main/java/common/java/awt/ToolkitImpl.java 07/04/2007 05:54:26 Patch for HARMONY-3719 "Graphics.getFontMetrics() throws HeadlessExcetion if headless"
modified mfursov  /harmony/enhanced/drlvm/trunk/vm/jitrino/src/codegenerator/ia32/Ia32CodeEmitter.cpp 07/04/2007 04:01:12 Fix for HARMONY-4318Enabling lazy resolution mode in JET for 32-bit platforms by default
modified mfursov  /harmony/enhanced/drlvm/trunk/vm/jitrino/src/codegenerator/ia32/Ia32CodeLayout.cpp 07/04/2007 04:01:12 Fix for HARMONY-4318Enabling lazy resolution mode in JET for 32-bit platforms by default
modified mfursov  /harmony/enhanced/drlvm/trunk/vm/jitrino/src/jet/compiler.cpp 07/04/2007 04:01:12 Fix for HARMONY-4318Enabling lazy resolution mode in JET for 32-bit platforms by default
modified pyang  /harmony/enhanced/classlib/trunk/modules/beans/src/test/java/org/apache/harmony/beans/tests/java/beans/beancontext/BeanContextSupportTest.java 07/04/2007 03:47:04 BeanContextSupport.classEquals() should throw NPE on null parameters
modified pyang  /harmony/enhanced/classlib/trunk/modules/beans/src/main/java/java/beans/beancontext/BeanContextSupport.java 07/04/2007 03:47:04 BeanContextSupport.classEquals() should throw NPE on null parameters
modified pyang  /harmony/enhanced/classlib/trunk/modules/beans/src/test/java/org/apache/harmony/beans/tests/java/beans/beancontext/BeanContextSupportTest.java 07/04/2007 03:47:04 BeanContextSupport.classEquals() should throw NPE on null parameters
modified pyang  /harmony/enhanced/classlib/trunk/modules/beans/src/main/java/java/beans/beancontext/BeanContextSupport.java 07/04/2007 03:47:04 BeanContextSupport.classEquals() should throw NPE on null parameters
modified pyang  /harmony/enhanced/classlib/trunk/modules/beans/src/test/java/org/apache/harmony/beans/tests/java/beans/beancontext/BeanContextEventTest.java 07/04/2007 03:41:10 Add serialization test and golden file for java.beans.beancontext.BeanContextEvent
added pyang  /harmony/enhanced/classlib/trunk/modules/beans/src/test/resources/serialization/org/apache/harmony/beans/tests/java/beans/beancontext/BeanContextEventTest.golden.ser 07/04/2007 03:41:10 Add serialization test and golden file for java.beans.beancontext.BeanContextEvent
modified pyang  /harmony/enhanced/classlib/trunk/modules/beans/src/test/java/org/apache/harmony/beans/tests/java/beans/beancontext/BeanContextEventTest.java 07/04/2007 03:41:10 Add serialization test and golden file for java.beans.beancontext.BeanContextEvent
added pyang  /harmony/enhanced/classlib/trunk/modules/beans/src/test/resources/serialization/org/apache/harmony/beans/tests/java/beans/beancontext/BeanContextEventTest.golden.ser 07/04/2007 03:41:10 Add serialization test and golden file for java.beans.beancontext.BeanContextEvent
add cc-drlvm log20070704021937Lbuild.27 07/04/2007 02:19:37drlvm
add cc-classlib log20070704015908Lbuild.43 07/04/2007 01:59:08classlib
modified xli  /harmony/enhanced/drlvm/trunk/vm/gc_gen/src/los/lspace_alloc_collect.cpp 07/03/2007 23:38:21 Fix HARMONY-4325 : undefine verify macros in 01_mark_sweep.patch for Tick project
modified xli  /harmony/enhanced/drlvm/trunk/vm/gc_gen/src/mark_sweep/sspace_verify.h 07/03/2007 23:38:21 Fix HARMONY-4325 : undefine verify macros in 01_mark_sweep.patch for Tick project
modified xli  /harmony/enhanced/drlvm/trunk/vm/gc_gen/src/mark_sweep/sspace_alloc.cpp 07/03/2007 23:38:21 Fix HARMONY-4325 : undefine verify macros in 01_mark_sweep.patch for Tick project
modified xli  /harmony/enhanced/drlvm/trunk/vm/gc_gen/src/mark_sweep/sspace_mark_sweep.cpp 07/03/2007 23:38:21 Fix HARMONY-4325 : undefine verify macros in 01_mark_sweep.patch for Tick project
added xli  /harmony/enhanced/drlvm/trunk/vm/gc_gen/src/mark_sweep/sspace.cpp 07/03/2007 22:01:01 HARMONY-4325 : 01_mark_sweep.patch for Tick project
modified xli  /harmony/enhanced/drlvm/trunk/vm/gc_gen/src/finalizer_weakref/finalizer_weakref.cpp 07/03/2007 22:01:01 HARMONY-4325 : 01_mark_sweep.patch for Tick project
modified xli  /harmony/enhanced/drlvm/trunk/vm/gc_gen/src/mark_compact/mspace_alloc.cpp 07/03/2007 22:01:01 HARMONY-4325 : 01_mark_sweep.patch for Tick project
added xli  /harmony/enhanced/drlvm/trunk/vm/gc_gen/src/los/lspace_alloc_collect.cpp 07/03/2007 22:01:01 HARMONY-4325 : 01_mark_sweep.patch for Tick project
added xli  /harmony/enhanced/drlvm/trunk/vm/gc_gen/src/mark_sweep/sspace_mark.cpp 07/03/2007 22:01:01 HARMONY-4325 : 01_mark_sweep.patch for Tick project
modified xli  /harmony/enhanced/drlvm/trunk/vm/gc_gen/src/mark_compact/mspace_extend_compact.cpp 07/03/2007 22:01:01 HARMONY-4325 : 01_mark_sweep.patch for Tick project
modified xli  /harmony/enhanced/drlvm/trunk/vm/gc_gen/src/gen/gen.h 07/03/2007 22:01:01 HARMONY-4325 : 01_mark_sweep.patch for Tick project
modified xli  /harmony/enhanced/drlvm/trunk/vm/gc_gen/src/mark_compact/mspace_collect_compact.h 07/03/2007 22:01:01 HARMONY-4325 : 01_mark_sweep.patch for Tick project
modified xli  /harmony/enhanced/drlvm/trunk/build/make/components/vm/gc_gen.xml 07/03/2007 22:01:01 HARMONY-4325 : 01_mark_sweep.patch for Tick project
added xli  /harmony/enhanced/drlvm/trunk/vm/gc_gen/src/mark_sweep/sspace_mark_sweep.h 07/03/2007 22:01:01 HARMONY-4325 : 01_mark_sweep.patch for Tick project
modified xli  /harmony/enhanced/drlvm/trunk/vm/gc_gen/src/verify/verify_gc_effect.cpp 07/03/2007 22:01:01 HARMONY-4325 : 01_mark_sweep.patch for Tick project
modified xli  /harmony/enhanced/drlvm/trunk/vm/gc_gen/src/mark_compact/mspace_slide_compact.cpp 07/03/2007 22:01:01 HARMONY-4325 : 01_mark_sweep.patch for Tick project
modified xli  /harmony/enhanced/drlvm/trunk/vm/gc_gen/src/common/gc_common.h 07/03/2007 22:01:01 HARMONY-4325 : 01_mark_sweep.patch for Tick project
added xli  /harmony/enhanced/drlvm/trunk/vm/gc_gen/src/mark_sweep/sspace_verify.cpp 07/03/2007 22:01:01 HARMONY-4325 : 01_mark_sweep.patch for Tick project
added xli  /harmony/enhanced/drlvm/trunk/vm/gc_gen/src/los/free_area_pool.cpp 07/03/2007 22:01:01 HARMONY-4325 : 01_mark_sweep.patch for Tick project
modified xli  /harmony/enhanced/drlvm/trunk/vm/gc_gen/src/common/space_tuner.cpp 07/03/2007 22:01:01 HARMONY-4325 : 01_mark_sweep.patch for Tick project
modified xli  /harmony/enhanced/drlvm/trunk/vm/gc_gen/src/common/gc_block.h 07/03/2007 22:01:01 HARMONY-4325 : 01_mark_sweep.patch for Tick project
added xli  /harmony/enhanced/drlvm/trunk/vm/gc_gen/src/mark_sweep/sspace_chunk.cpp 07/03/2007 22:01:01 HARMONY-4325 : 01_mark_sweep.patch for Tick project
deleted xli  /harmony/enhanced/drlvm/trunk/vm/gc_gen/src/mark_sweep/lspace.cpp 07/03/2007 22:01:01 HARMONY-4325 : 01_mark_sweep.patch for Tick project
deleted xli  /harmony/enhanced/drlvm/trunk/vm/gc_gen/src/mark_sweep/free_area_pool.h 07/03/2007 22:01:01 HARMONY-4325 : 01_mark_sweep.patch for Tick project
modified xli  /harmony/enhanced/drlvm/trunk/vm/gc_gen/src/mark_compact/mspace.cpp 07/03/2007 22:01:01 HARMONY-4325 : 01_mark_sweep.patch for Tick project
added xli  /harmony/enhanced/drlvm/trunk/vm/gc_gen/src/los/lspace.h 07/03/2007 22:01:01 HARMONY-4325 : 01_mark_sweep.patch for Tick project
added xli  /harmony/enhanced/drlvm/trunk/vm/gc_gen/src/los 07/03/2007 22:01:01 HARMONY-4325 : 01_mark_sweep.patch for Tick project
modified xli  /harmony/enhanced/drlvm/trunk/vm/gc_gen/src/mark_compact/fallback_mark_scan.cpp 07/03/2007 22:01:01 HARMONY-4325 : 01_mark_sweep.patch for Tick project
added xli  /harmony/enhanced/drlvm/trunk/vm/gc_gen/src/mark_sweep/sspace_sweep.cpp 07/03/2007 22:01:01 HARMONY-4325 : 01_mark_sweep.patch for Tick project
added xli  /harmony/enhanced/drlvm/trunk/vm/gc_gen/src/mark_sweep/sspace.h 07/03/2007 22:01:01 HARMONY-4325 : 01_mark_sweep.patch for Tick project
modified xli  /harmony/enhanced/drlvm/trunk/vm/gc_gen/src/common/gc_metadata.cpp 07/03/2007 22:01:01 HARMONY-4325 : 01_mark_sweep.patch for Tick project
modified xli  /harmony/enhanced/drlvm/trunk/vm/gc_gen/src/gen/gen.cpp 07/03/2007 22:01:01 HARMONY-4325 : 01_mark_sweep.patch for Tick project
modified xli  /harmony/enhanced/drlvm/trunk/vm/gc_gen/src/mark_compact/mspace_collect_compact.cpp 07/03/2007 22:01:01 HARMONY-4325 : 01_mark_sweep.patch for Tick project
deleted xli  /harmony/enhanced/drlvm/trunk/vm/gc_gen/src/mark_sweep/lspace_alloc_collect.cpp 07/03/2007 22:01:01 HARMONY-4325 : 01_mark_sweep.patch for Tick project
modified xli  /harmony/enhanced/drlvm/trunk/vm/gc_gen/src/verify/verify_live_heap.cpp 07/03/2007 22:01:01 HARMONY-4325 : 01_mark_sweep.patch for Tick project
added xli  /harmony/enhanced/drlvm/trunk/vm/gc_gen/src/mark_sweep/sspace_alloc.cpp 07/03/2007 22:01:01 HARMONY-4325 : 01_mark_sweep.patch for Tick project
modified xli  /harmony/enhanced/drlvm/trunk/vm/gc_gen/src/verify/verifier_common.cpp 07/03/2007 22:01:01 HARMONY-4325 : 01_mark_sweep.patch for Tick project
modified xli  /harmony/enhanced/drlvm/trunk/vm/gc_gen/src/verify/verifier_scanner.cpp 07/03/2007 22:01:01 HARMONY-4325 : 01_mark_sweep.patch for Tick project
added xli  /harmony/enhanced/drlvm/trunk/vm/gc_gen/src/mark_sweep/sspace_mark_sweep.cpp 07/03/2007 22:01:01 HARMONY-4325 : 01_mark_sweep.patch for Tick project
modified xli  /harmony/enhanced/drlvm/trunk/vm/gc_gen/src/common/gc_common.cpp 07/03/2007 22:01:01 HARMONY-4325 : 01_mark_sweep.patch for Tick project
modified xli  /harmony/enhanced/drlvm/trunk/vm/gc_gen/src/verify/verify_mutator_effect.cpp 07/03/2007 22:01:01 HARMONY-4325 : 01_mark_sweep.patch for Tick project
deleted xli  /harmony/enhanced/drlvm/trunk/vm/gc_gen/src/mark_sweep/free_area_pool.cpp 07/03/2007 22:01:01 HARMONY-4325 : 01_mark_sweep.patch for Tick project
modified xli  /harmony/enhanced/drlvm/trunk/vm/gc_gen/src/verify/verify_gc_effect.h 07/03/2007 22:01:01 HARMONY-4325 : 01_mark_sweep.patch for Tick project
modified xli  /harmony/enhanced/drlvm/trunk/vm/gc_gen/src/thread/collector.h 07/03/2007 22:01:01 HARMONY-4325 : 01_mark_sweep.patch for Tick project
added xli  /harmony/enhanced/drlvm/trunk/vm/gc_gen/src/mark_sweep/sspace_verify.h 07/03/2007 22:01:01 HARMONY-4325 : 01_mark_sweep.patch for Tick project
added xli  /harmony/enhanced/drlvm/trunk/vm/gc_gen/src/los/lspace.cpp 07/03/2007 22:01:01 HARMONY-4325 : 01_mark_sweep.patch for Tick project
added xli  /harmony/enhanced/drlvm/trunk/vm/gc_gen/src/los/free_area_pool.h 07/03/2007 22:01:01 HARMONY-4325 : 01_mark_sweep.patch for Tick project
modified xli  /harmony/enhanced/drlvm/trunk/vm/gc_gen/src/mark_compact/mspace_move_compact.cpp 07/03/2007 22:01:01 HARMONY-4325 : 01_mark_sweep.patch for Tick project
modified xli  /harmony/enhanced/drlvm/trunk/vm/gc_gen/src/thread/mutator.h 07/03/2007 22:01:01 HARMONY-4325 : 01_mark_sweep.patch for Tick project
added xli  /harmony/enhanced/drlvm/trunk/vm/gc_gen/src/mark_sweep/sspace_chunk.h 07/03/2007 22:01:01 HARMONY-4325 : 01_mark_sweep.patch for Tick project
deleted xli  /harmony/enhanced/drlvm/trunk/vm/gc_gen/src/mark_sweep/lspace.h 07/03/2007 22:01:01 HARMONY-4325 : 01_mark_sweep.patch for Tick project
modified leoli  /harmony/enhanced/classlib/trunk/modules/jndi/src/main/java/javax/naming/InitialContext.java 07/03/2007 21:58:25 Apply patch for HARMONY-4141([classlib][jndi] InitialContext.getURLOrDefaultInitCtx() optimization)
modified leoli  /harmony/enhanced/classlib/trunk/modules/jndi/src/main/java/javax/naming/InitialContext.java 07/03/2007 21:58:25 Apply patch for HARMONY-4141([classlib][jndi] InitialContext.getURLOrDefaultInitCtx() optimization)
add cc-drlvm log20070703201439Lbuild.26 07/03/2007 20:14:39drlvm
add cc-classlib log20070703130936Lbuild.42 07/03/2007 13:09:36classlib
modified tonywu  /harmony/enhanced/classlib/trunk/modules/luni/src/test/api/common/tests/api/java/io/ObjectStreamFieldTest.java 07/03/2007 11:52:07 clean up compiler warnings in io module, no functional change.
modified tonywu  /harmony/enhanced/classlib/trunk/modules/luni/src/test/api/common/tests/api/java/io/NotActiveExceptionTest.java 07/03/2007 11:52:07 clean up compiler warnings in io module, no functional change.
modified tonywu  /harmony/enhanced/classlib/trunk/modules/luni/src/test/api/common/tests/api/java/io/LineNumberInputStreamTest.java 07/03/2007 11:52:07 clean up compiler warnings in io module, no functional change.
modified tonywu  /harmony/enhanced/classlib/trunk/modules/luni/src/test/api/common/tests/api/java/io/PipedInputStreamTest.java 07/03/2007 11:52:07 clean up compiler warnings in io module, no functional change.
modified tonywu  /harmony/enhanced/classlib/trunk/modules/luni/src/test/api/common/tests/api/java/io/InputStreamReaderTest.java 07/03/2007 11:52:07 clean up compiler warnings in io module, no functional change.
modified tonywu  /harmony/enhanced/classlib/trunk/modules/luni/src/test/api/common/tests/api/java/io/ByteArrayOutputStreamTest.java 07/03/2007 11:52:07 clean up compiler warnings in io module, no functional change.
modified tonywu  /harmony/enhanced/classlib/trunk/modules/luni/src/test/api/common/tests/api/java/io/ObjectInputStreamTest.java 07/03/2007 11:52:07 clean up compiler warnings in io module, no functional change.
modified tonywu  /harmony/enhanced/classlib/trunk/modules/luni/src/test/api/common/tests/api/java/io/ObjectOutputStreamTest.java 07/03/2007 11:52:07 clean up compiler warnings in io module, no functional change.
modified tonywu  /harmony/enhanced/classlib/trunk/modules/luni/src/test/api/common/tests/api/java/io/SequenceInputStreamTest.java 07/03/2007 11:52:07 clean up compiler warnings in io module, no functional change.
modified tonywu  /harmony/enhanced/classlib/trunk/modules/luni/src/test/api/common/org/apache/harmony/luni/tests/java/io/ObjectInputStreamTest.java 07/03/2007 11:52:07 clean up compiler warnings in io module, no functional change.
modified tonywu  /harmony/enhanced/classlib/trunk/modules/luni/src/test/api/common/tests/api/java/io/DataInputStreamTest.java 07/03/2007 11:52:07 clean up compiler warnings in io module, no functional change.
modified tonywu  /harmony/enhanced/classlib/trunk/modules/luni/src/test/api/common/tests/api/java/io/ObjectStreamFieldTest.java 07/03/2007 11:52:07 clean up compiler warnings in io module, no functional change.
modified tonywu  /harmony/enhanced/classlib/trunk/modules/luni/src/test/api/common/tests/api/java/io/NotActiveExceptionTest.java 07/03/2007 11:52:07 clean up compiler warnings in io module, no functional change.
modified tonywu  /harmony/enhanced/classlib/trunk/modules/luni/src/test/api/common/tests/api/java/io/LineNumberInputStreamTest.java 07/03/2007 11:52:07 clean up compiler warnings in io module, no functional change.
modified tonywu  /harmony/enhanced/classlib/trunk/modules/luni/src/test/api/common/tests/api/java/io/PipedInputStreamTest.java 07/03/2007 11:52:07 clean up compiler warnings in io module, no functional change.
modified tonywu  /harmony/enhanced/classlib/trunk/modules/luni/src/test/api/common/tests/api/java/io/InputStreamReaderTest.java 07/03/2007 11:52:07 clean up compiler warnings in io module, no functional change.
modified tonywu  /harmony/enhanced/classlib/trunk/modules/luni/src/test/api/common/tests/api/java/io/ByteArrayOutputStreamTest.java 07/03/2007 11:52:07 clean up compiler warnings in io module, no functional change.
modified tonywu  /harmony/enhanced/classlib/trunk/modules/luni/src/test/api/common/tests/api/java/io/ObjectInputStreamTest.java 07/03/2007 11:52:07 clean up compiler warnings in io module, no functional change.
modified tonywu  /harmony/enhanced/classlib/trunk/modules/luni/src/test/api/common/tests/api/java/io/ObjectOutputStreamTest.java 07/03/2007 11:52:07 clean up compiler warnings in io module, no functional change.
modified tonywu  /harmony/enhanced/classlib/trunk/modules/luni/src/test/api/common/tests/api/java/io/SequenceInputStreamTest.java 07/03/2007 11:52:07 clean up compiler warnings in io module, no functional change.
modified tonywu  /harmony/enhanced/classlib/trunk/modules/luni/src/test/api/common/org/apache/harmony/luni/tests/java/io/ObjectInputStreamTest.java 07/03/2007 11:52:07 clean up compiler warnings in io module, no functional change.
modified tonywu  /harmony/enhanced/classlib/trunk/modules/luni/src/test/api/common/tests/api/java/io/DataInputStreamTest.java 07/03/2007 11:52:07 clean up compiler warnings in io module, no functional change.
modified tonywu  /harmony/enhanced/classlib/trunk/modules/luni/.classpath 07/03/2007 11:38:48 correct output path for impl tests
modified tonywu  /harmony/enhanced/classlib/trunk/modules/luni/.classpath 07/03/2007 11:38:48 correct output path for impl tests
modified tonywu  /harmony/enhanced/classlib/trunk/modules/luni/src/main/java/java/io/LineNumberReader.java 07/03/2007 11:24:57 Fix Harmony-4294 ([classlib][io] LineNumberReader treats \r\n as two lines)
modified tonywu  /harmony/enhanced/classlib/trunk/modules/luni/src/test/api/common/tests/api/java/io/LineNumberReaderTest.java 07/03/2007 11:24:57 Fix Harmony-4294 ([classlib][io] LineNumberReader treats \r\n as two lines)
modified tonywu  /harmony/enhanced/classlib/trunk/modules/luni/src/main/java/java/io/LineNumberReader.java 07/03/2007 11:24:57 Fix Harmony-4294 ([classlib][io] LineNumberReader treats \r\n as two lines)
modified tonywu  /harmony/enhanced/classlib/trunk/modules/luni/src/test/api/common/tests/api/java/io/LineNumberReaderTest.java 07/03/2007 11:24:57 Fix Harmony-4294 ([classlib][io] LineNumberReader treats \r\n as two lines)
add cc-classlib log20070703083954Lbuild.41 07/03/2007 08:39:54classlib
modified tonywu  /harmony/enhanced/classlib/trunk/modules/luni/src/main/java/java/io/OutputStream.java 07/03/2007 08:27:48 Fix Harmony-4311 ([classlib][luni] Compatibility: OutputStream.write(null, off, len) exception throwing order differs on Harmony and RI)
modified tonywu  /harmony/enhanced/classlib/trunk/modules/luni/src/test/api/common/tests/api/java/io/PipedOutputStreamTest.java 07/03/2007 08:27:48 Fix Harmony-4311 ([classlib][luni] Compatibility: OutputStream.write(null, off, len) exception throwing order differs on Harmony and RI)
modified tonywu  /harmony/enhanced/classlib/trunk/modules/luni/src/main/java/java/io/OutputStream.java 07/03/2007 08:27:48 Fix Harmony-4311 ([classlib][luni] Compatibility: OutputStream.write(null, off, len) exception throwing order differs on Harmony and RI)
modified tonywu  /harmony/enhanced/classlib/trunk/modules/luni/src/test/api/common/tests/api/java/io/PipedOutputStreamTest.java 07/03/2007 08:27:48 Fix Harmony-4311 ([classlib][luni] Compatibility: OutputStream.write(null, off, len) exception throwing order differs on Harmony and RI)
add cc-classlib log20070703081753Lbuild.40 07/03/2007 08:17:53classlib
modified ivavladimir  /harmony/enhanced/classlib/trunk/modules/awt/make/exclude.linux.x86_64.drl 07/03/2007 03:19:32 exclude test due to HARMONY-4307
modified ivavladimir  /harmony/enhanced/classlib/trunk/modules/awt/make/exclude.linux.x86_64.drl 07/03/2007 03:19:32 exclude test due to HARMONY-4307
add cc-drlvm log20070703023646Lbuild.25 07/03/2007 02:36:46drlvm
modified mfursov  /harmony/enhanced/drlvm/trunk/src/test/regression/excludes/exclude.windows.x86_64 07/03/2007 02:13:40 Excluding HARMONY-4267 regression test for x86_64 platforms. JIT does not support unresolved types for compressed references today.
modified mfursov  /harmony/enhanced/drlvm/trunk/src/test/regression/excludes/exclude.linux.x86_64 07/03/2007 02:13:40 Excluding HARMONY-4267 regression test for x86_64 platforms. JIT does not support unresolved types for compressed references today.
add cc-drlvm log20070703020941Lbuild.24 07/03/2007 02:09:41drlvm
add cc-classlib log20070703014408Lbuild.39 07/03/2007 01:44:08classlib
added pyang  /harmony/enhanced/classlib/trunk/modules/luni/src/test/impl/org/apache/harmony/tests/internal/net 07/03/2007 01:08:23 Apply patch for HARMONY-617([classlib][luni] HttpURLConnection does not support persistent connections)
modified pyang  /harmony/enhanced/classlib/trunk/modules/luni/.classpath 07/03/2007 01:08:23 Apply patch for HARMONY-617([classlib][luni] HttpURLConnection does not support persistent connections)
modified pyang  /harmony/enhanced/classlib/trunk/modules/luni/src/main/java/org/apache/harmony/luni/internal/net/www/protocol/http/HttpURLConnection.java 07/03/2007 01:08:23 Apply patch for HARMONY-617([classlib][luni] HttpURLConnection does not support persistent connections)
added pyang  /harmony/enhanced/classlib/trunk/modules/luni/src/test/impl/org/apache/harmony/tests/internal/net/www/protocol/http 07/03/2007 01:08:23 Apply patch for HARMONY-617([classlib][luni] HttpURLConnection does not support persistent connections)
modified pyang  /harmony/enhanced/classlib/trunk/modules/luni/src/main/java/org/apache/harmony/luni/internal/net/www/protocol/https/HttpsURLConnection.java 07/03/2007 01:08:23 Apply patch for HARMONY-617([classlib][luni] HttpURLConnection does not support persistent connections)
added pyang  /harmony/enhanced/classlib/trunk/modules/luni/src/test/impl 07/03/2007 01:08:23 Apply patch for HARMONY-617([classlib][luni] HttpURLConnection does not support persistent connections)
added pyang  /harmony/enhanced/classlib/trunk/modules/luni/src/test/impl/org/apache/harmony/tests/internal/net/www/protocol/http/PersistenceTest.java 07/03/2007 01:08:23 Apply patch for HARMONY-617([classlib][luni] HttpURLConnection does not support persistent connections)
added pyang  /harmony/enhanced/classlib/trunk/modules/luni/src/main/java/org/apache/harmony/luni/internal/net/www/protocol/http/HttpConnectionManager.java 07/03/2007 01:08:23 Apply patch for HARMONY-617([classlib][luni] HttpURLConnection does not support persistent connections)
added pyang  /harmony/enhanced/classlib/trunk/modules/luni/src/test/impl/org/apache/harmony/tests/internal 07/03/2007 01:08:23 Apply patch for HARMONY-617([classlib][luni] HttpURLConnection does not support persistent connections)
modified pyang  /harmony/enhanced/classlib/trunk/modules/luni/src/test/api/common/org/apache/harmony/luni/tests/internal/net/www/protocol/http/HttpURLConnectionTest.java 07/03/2007 01:08:23 Apply patch for HARMONY-617([classlib][luni] HttpURLConnection does not support persistent connections)
added pyang  /harmony/enhanced/classlib/trunk/modules/luni/src/main/java/org/apache/harmony/luni/internal/net/www/protocol/http/HttpConnection.java 07/03/2007 01:08:23 Apply patch for HARMONY-617([classlib][luni] HttpURLConnection does not support persistent connections)
added pyang  /harmony/enhanced/classlib/trunk/modules/luni/src/test/impl/org/apache 07/03/2007 01:08:23 Apply patch for HARMONY-617([classlib][luni] HttpURLConnection does not support persistent connections)
modified pyang  /harmony/enhanced/classlib/trunk/modules/luni/src/test/api/common/org/apache/harmony/luni/tests/internal/net/www/protocol/https/HttpsURLConnectionTest.java 07/03/2007 01:08:23 Apply patch for HARMONY-617([classlib][luni] HttpURLConnection does not support persistent connections)
added pyang  /harmony/enhanced/classlib/trunk/modules/luni/src/test/impl/org/apache/harmony/tests/internal/net/www 07/03/2007 01:08:23 Apply patch for HARMONY-617([classlib][luni] HttpURLConnection does not support persistent connections)
added pyang  /harmony/enhanced/classlib/trunk/modules/luni/src/test/impl/org/apache/harmony/tests/internal/net/www/protocol 07/03/2007 01:08:23 Apply patch for HARMONY-617([classlib][luni] HttpURLConnection does not support persistent connections)
added pyang  /harmony/enhanced/classlib/trunk/modules/luni/src/main/java/org/apache/harmony/luni/internal/net/www/protocol/http/HttpConfiguration.java 07/03/2007 01:08:23 Apply patch for HARMONY-617([classlib][luni] HttpURLConnection does not support persistent connections)
added pyang  /harmony/enhanced/classlib/trunk/modules/luni/src/test/impl/org/apache/harmony 07/03/2007 01:08:23 Apply patch for HARMONY-617([classlib][luni] HttpURLConnection does not support persistent connections)
added pyang  /harmony/enhanced/classlib/trunk/modules/luni/src/test/impl/org/apache/harmony/tests 07/03/2007 01:08:23 Apply patch for HARMONY-617([classlib][luni] HttpURLConnection does not support persistent connections)
added pyang  /harmony/enhanced/classlib/trunk/modules/luni/src/test/impl/org 07/03/2007 01:08:23 Apply patch for HARMONY-617([classlib][luni] HttpURLConnection does not support persistent connections)
modified pyang  /harmony/enhanced/classlib/trunk/modules/luni/build.xml 07/03/2007 01:08:23 Apply patch for HARMONY-617([classlib][luni] HttpURLConnection does not support persistent connections)
added pyang  /harmony/enhanced/classlib/trunk/modules/luni/src/test/impl/org/apache/harmony/tests/internal/net 07/03/2007 01:08:23 Apply patch for HARMONY-617([classlib][luni] HttpURLConnection does not support persistent connections)
modified pyang  /harmony/enhanced/classlib/trunk/modules/luni/.classpath 07/03/2007 01:08:23 Apply patch for HARMONY-617([classlib][luni] HttpURLConnection does not support persistent connections)
modified pyang  /harmony/enhanced/classlib/trunk/modules/luni/src/main/java/org/apache/harmony/luni/internal/net/www/protocol/http/HttpURLConnection.java 07/03/2007 01:08:23 Apply patch for HARMONY-617([classlib][luni] HttpURLConnection does not support persistent connections)
added pyang  /harmony/enhanced/classlib/trunk/modules/luni/src/test/impl/org/apache/harmony/tests/internal/net/www/protocol/http 07/03/2007 01:08:23 Apply patch for HARMONY-617([classlib][luni] HttpURLConnection does not support persistent connections)
modified pyang  /harmony/enhanced/classlib/trunk/modules/luni/src/main/java/org/apache/harmony/luni/internal/net/www/protocol/https/HttpsURLConnection.java 07/03/2007 01:08:23 Apply patch for HARMONY-617([classlib][luni] HttpURLConnection does not support persistent connections)
added pyang  /harmony/enhanced/classlib/trunk/modules/luni/src/test/impl 07/03/2007 01:08:23 Apply patch for HARMONY-617([classlib][luni] HttpURLConnection does not support persistent connections)
added pyang  /harmony/enhanced/classlib/trunk/modules/luni/src/test/impl/org/apache/harmony/tests/internal/net/www/protocol/http/PersistenceTest.java 07/03/2007 01:08:23 Apply patch for HARMONY-617([classlib][luni] HttpURLConnection does not support persistent connections)
added pyang  /harmony/enhanced/classlib/trunk/modules/luni/src/main/java/org/apache/harmony/luni/internal/net/www/protocol/http/HttpConnectionManager.java 07/03/2007 01:08:23 Apply patch for HARMONY-617([classlib][luni] HttpURLConnection does not support persistent connections)
added pyang  /harmony/enhanced/classlib/trunk/modules/luni/src/test/impl/org/apache/harmony/tests/internal 07/03/2007 01:08:23 Apply patch for HARMONY-617([classlib][luni] HttpURLConnection does not support persistent connections)
modified pyang  /harmony/enhanced/classlib/trunk/modules/luni/src/test/api/common/org/apache/harmony/luni/tests/internal/net/www/protocol/http/HttpURLConnectionTest.java 07/03/2007 01:08:23 Apply patch for HARMONY-617([classlib][luni] HttpURLConnection does not support persistent connections)
added pyang  /harmony/enhanced/classlib/trunk/modules/luni/src/main/java/org/apache/harmony/luni/internal/net/www/protocol/http/HttpConnection.java 07/03/2007 01:08:23 Apply patch for HARMONY-617([classlib][luni] HttpURLConnection does not support persistent connections)
added pyang  /harmony/enhanced/classlib/trunk/modules/luni/src/test/impl/org/apache 07/03/2007 01:08:23 Apply patch for HARMONY-617([classlib][luni] HttpURLConnection does not support persistent connections)
modified pyang  /harmony/enhanced/classlib/trunk/modules/luni/src/test/api/common/org/apache/harmony/luni/tests/internal/net/www/protocol/https/HttpsURLConnectionTest.java 07/03/2007 01:08:23 Apply patch for HARMONY-617([classlib][luni] HttpURLConnection does not support persistent connections)
added pyang  /harmony/enhanced/classlib/trunk/modules/luni/src/test/impl/org/apache/harmony/tests/internal/net/www 07/03/2007 01:08:23 Apply patch for HARMONY-617([classlib][luni] HttpURLConnection does not support persistent connections)
added pyang  /harmony/enhanced/classlib/trunk/modules/luni/src/test/impl/org/apache/harmony/tests/internal/net/www/protocol 07/03/2007 01:08:23 Apply patch for HARMONY-617([classlib][luni] HttpURLConnection does not support persistent connections)
added pyang  /harmony/enhanced/classlib/trunk/modules/luni/src/main/java/org/apache/harmony/luni/internal/net/www/protocol/http/HttpConfiguration.java 07/03/2007 01:08:23 Apply patch for HARMONY-617([classlib][luni] HttpURLConnection does not support persistent connections)
added pyang  /harmony/enhanced/classlib/trunk/modules/luni/src/test/impl/org/apache/harmony 07/03/2007 01:08:23 Apply patch for HARMONY-617([classlib][luni] HttpURLConnection does not support persistent connections)
added pyang  /harmony/enhanced/classlib/trunk/modules/luni/src/test/impl/org/apache/harmony/tests 07/03/2007 01:08:23 Apply patch for HARMONY-617([classlib][luni] HttpURLConnection does not support persistent connections)
added pyang  /harmony/enhanced/classlib/trunk/modules/luni/src/test/impl/org 07/03/2007 01:08:23 Apply patch for HARMONY-617([classlib][luni] HttpURLConnection does not support persistent connections)
modified pyang  /harmony/enhanced/classlib/trunk/modules/luni/build.xml 07/03/2007 01:08:23 Apply patch for HARMONY-617([classlib][luni] HttpURLConnection does not support persistent connections)
modified xli  /harmony/enhanced/drlvm/trunk/vm/vmcore/include/init.h 07/02/2007 21:16:46 HARMONY-3934 : comments by Vladimir Beliaev: The attached patch does the following things:1. reports error if -XX propery format is broken (-XX:+key, -XX:-key or -XX:key=[value] is allowed), i.e. '-XX:gc.dll=' is a proper specification (of empty value) while '-XX:gc.dll' argument produces error ('initialize_properties' returnns the status code now).2. renamed 'vm.dlls' to 'gc.dll'". This required to do the following:    2.1 add a check that "gc.dll" property is always set (the vm_init code expects this property is set either to default value or it is set through command line)   2.2 remove "parsing cycle" of gc.dll (previously "vm.dlls" may contain the list of DLLs)I've tested DRLVM with different variants of related command line - works as expected.
modified xli  /harmony/enhanced/drlvm/trunk/vm/vmcore/src/init/vm_init.cpp 07/02/2007 21:16:46 HARMONY-3934 : comments by Vladimir Beliaev: The attached patch does the following things:1. reports error if -XX propery format is broken (-XX:+key, -XX:-key or -XX:key=[value] is allowed), i.e. '-XX:gc.dll=' is a proper specification (of empty value) while '-XX:gc.dll' argument produces error ('initialize_properties' returnns the status code now).2. renamed 'vm.dlls' to 'gc.dll'". This required to do the following:    2.1 add a check that "gc.dll" property is always set (the vm_init code expects this property is set either to default value or it is set through command line)   2.2 remove "parsing cycle" of gc.dll (previously "vm.dlls" may contain the list of DLLs)I've tested DRLVM with different variants of related command line - works as expected.
modified xli  /harmony/enhanced/drlvm/trunk/vm/vmcore/src/init/harmony.properties 07/02/2007 21:16:46 HARMONY-3934 : comments by Vladimir Beliaev: The attached patch does the following things:1. reports error if -XX propery format is broken (-XX:+key, -XX:-key or -XX:key=[value] is allowed), i.e. '-XX:gc.dll=' is a proper specification (of empty value) while '-XX:gc.dll' argument produces error ('initialize_properties' returnns the status code now).2. renamed 'vm.dlls' to 'gc.dll'". This required to do the following:    2.1 add a check that "gc.dll" property is always set (the vm_init code expects this property is set either to default value or it is set through command line)   2.2 remove "parsing cycle" of gc.dll (previously "vm.dlls" may contain the list of DLLs)I've tested DRLVM with different variants of related command line - works as expected.
modified xli  /harmony/enhanced/drlvm/trunk/vm/vmcore/src/init/vm_properties.cpp 07/02/2007 21:16:46 HARMONY-3934 : comments by Vladimir Beliaev: The attached patch does the following things:1. reports error if -XX propery format is broken (-XX:+key, -XX:-key or -XX:key=[value] is allowed), i.e. '-XX:gc.dll=' is a proper specification (of empty value) while '-XX:gc.dll' argument produces error ('initialize_properties' returnns the status code now).2. renamed 'vm.dlls' to 'gc.dll'". This required to do the following:    2.1 add a check that "gc.dll" property is always set (the vm_init code expects this property is set either to default value or it is set through command line)   2.2 remove "parsing cycle" of gc.dll (previously "vm.dlls" may contain the list of DLLs)I've tested DRLVM with different variants of related command line - works as expected.
add cc-classlib log20070702204825Lbuild.38 07/02/2007 20:48:25classlib
modified ndbeyer  /harmony/enhanced/common_resources/build/depends.properties 07/02/2007 20:39:54 Update Eclipse dependencies to v3.3 (final)Synchronize common_resources depends.properties and depends.xml with classlib's version
modified ndbeyer  /harmony/enhanced/common_resources/build/depends.xml 07/02/2007 20:39:54 Update Eclipse dependencies to v3.3 (final)Synchronize common_resources depends.properties and depends.xml with classlib's version
modified ndbeyer  /harmony/enhanced/jdktools/trunk/make/depends.properties 07/02/2007 20:39:54 Update Eclipse dependencies to v3.3 (final)Synchronize common_resources depends.properties and depends.xml with classlib's version
modified ndbeyer  /harmony/enhanced/classlib/trunk/make/depends.properties 07/02/2007 20:39:54 Update Eclipse dependencies to v3.3 (final)Synchronize common_resources depends.properties and depends.xml with classlib's version
modified ndbeyer  /harmony/enhanced/common_resources/build/depends.properties 07/02/2007 20:39:54 Update Eclipse dependencies to v3.3 (final)Synchronize common_resources depends.properties and depends.xml with classlib's version
modified ndbeyer  /harmony/enhanced/common_resources/build/depends.xml 07/02/2007 20:39:54 Update Eclipse dependencies to v3.3 (final)Synchronize common_resources depends.properties and depends.xml with classlib's version
modified ndbeyer  /harmony/enhanced/jdktools/trunk/make/depends.properties 07/02/2007 20:39:54 Update Eclipse dependencies to v3.3 (final)Synchronize common_resources depends.properties and depends.xml with classlib's version
modified ndbeyer  /harmony/enhanced/classlib/trunk/make/depends.properties 07/02/2007 20:39:54 Update Eclipse dependencies to v3.3 (final)Synchronize common_resources depends.properties and depends.xml with classlib's version

begin 644 execution_log.zip
M4$L#! H    ( "UDZ3:US#X6+R4  *Z. @ 2    97AE8W5T:6]N7VQO9RYH
M=&UL[5U[<]M&DO_[7)7O@*O<U2I;:XC@4]0FJ9)M.9'/LGRFDJTMV\6"P"$)
M"P1X>.B13W\S Y $27 P#6!(2&XF9?$Q_9B>GI[7;QH_3\.9\^O/-][H\=>?
MYS[Y]6=3"\)'A_SRM['GAB\#^R]RJITT_ON??_OUAQ=^Y)[^\$+3M,\CXI"0
M?-7>L+^V.]%Z?4,;VPX)M+'OS;37IU^FIC_SW,<O-Y'MC$(2A,WX[1>?!)$3
M!E]&OG,W>\E^X3PIUV_FG?E5>\5*,5ZGVLR\)3&5_C!SUHNM?PKNW)<CJI(5
MGN85F_O>7%B(/(3$=X<CLEDL?D^LJ4??_Q&P>K]^?S88O+]XI?TBK+,U)=:M
M%]%:6XX9!(Y](U(@KHCN!;KI6U/=>GC0K?%$J+/MVJ%^;[OYA2+7?A#;B(1Z
M0&9VH(]L/\@K&HEMR2NNA[.Y_LW,8<:T$QB<TVNA'Q$1DPE5WG1#BSJO;]\(
MY<V=:&*[LJ7CBM#"^AWQ ]L36YH;1J>>[D6^122,J,?\>1>2*,U\F/BAG5,X
M9AJY?]GS.1GIL6.;CIAH0ESBFR'1;3<NKM^9OFW>2&F6ZUER.L#:)BEMS>>A
M&=R6\K+7GCNV)Q&M_W83I\OQU^]>P(/?._HS#0"&WM$;0Z.I'0TB5[NT+=\+
M'H.0S +MPK7TG\3<%H%!\STO+!E.MC1=O;R \OZ7[8Z\^T"2B 4A2F2;K::L
M&!JR*,4LN+.D*<832C$B-]$DAX3&<,TG=S;KA)2DTVEW&XU<,98WFWLN<<. 
MBYD[WF.>JX:FS\))Z.G,]D*ORBU HVD\CE%_#F@0LT(R$G?=1;DAIQ.6S2_!
M]!O>S3;*O(GFCFW1KC[2:$#Y1L<<S35GA/81S:;6\D-=^YA\_^G\MT_G@\'%
MU0?M^GQP/= ^_?&!FG%LNY1X3,>)D%')^2P?^)-OZ9 U9(XU9+XRY,W_A0\^
MR>]Q&P1TTC#AK:#3.0B;"VBF.]+,B<E4+2*7SRQV,1>WRVQ.@_3+;W>ST.:S
MEX#.*,C<](DX1OEDF!%[MIC/ML+.%1UP?'O$ LV<^;T7!;'E;1:C-&],>\.8
M^,2UB!9Z"0\6#/5$5[\2?I5R<VSW=I-3;IS>+C!<]NH\LVZU&?L%3.328>%N
MLYW3P>;''^D(PNCXL/#GY?6%%M,$5-]3D)_2_[G0+UR!+Z]\8M[./3HF&QGB
MZ2?+^JH-J$?S$8D&..*.J-$?:4<QG<? IA-SS]>:\21=W\TB*4&#/M&B.6NR
M$9L+["9H) 2TY VAC9W8;10O!#(4$?(*O=!TUC@N^.FUBUW"&%(V0!4-C+6S
MTI.+\+R_Z61V0WUN9KKV>'MLWT^7_^C-W_JTM;##U\25L<-CAU?9X0>4HT,&
M(9ECEZ^),V.7QRZOLLO_>7E!US%ENKN1V]T-[.[8W;&[B[O[UFY-:N&_'1FV
M#\!&-NTGH><_5FK/6/$X8/B$M6[&INWGV2V5_E5[[1/N%O0#+":5UB++VAF&
MJX'K8@=_EAV<%DEOU F&\OSSB%]R7_D\/D5N,D_@^FA1?%CLV,0-M9DW(MJ[
MBVOMB#:5&3EASLE054K5(W)\^6:'NW6EAG.9J83;G9^_17321'O*^:L_?CO5
M?B-AN)J8$??.IM,4:FA=U[/JO$X\\ESRG[FE!HD(RYR;-W0:R$Y>%; G=^R 
MJD+&ER2<>J-S-Z3CDF4ZSHUIW6ITXLC>LQ!!YX\I2^OI]ZS1CC(\<T/"&SLP
M;_B\."V+5T2Z'M(M3.40S8WH..YK(3N1IB*JD;!H@9NE!>2:89M.\]Q8STY#
MH78K*1W5-I"B?4.H1WETU-K53!5YPJN4!2PKFMO4B^E0,XY<BY\WE?1F]8[V
MFD70;2N#*KYTL'QI#C%])BV<DF1"L));69VP\0_0^!U :$[15QR9%S$CB"R+
M! &=IW"(5G4"E/G6YHQ#<-I2Y7RC\$RBP!SAFOH][2+AE#;_B W[ =M,(J/\
M>0.?$#)I9Q,J[9HSD''4A6E8 =TQW8D>TVJEB#D&+&*K:P@;OF@*0A;^9,B6
M5399E1.C@0@GCG=C.BF\ YM>L=@#8+90?NF-^O+=?QD@*V9RT,.I[8^&U"WF
M1S]I,SYC@S M%!K7YQ62 P];04%;@F\YY(X2&899,TNN&*[6;G?5'VWBC$#F
MC15?#M:P(3HF7AAY=8:T#/6R'** ;>SRV0+,:1.#+$>W%#D=&#A7%GI"*6])
MF%VG>+#(%;.1B5T)@Y?LI1G+YN9KGOA;6194W61<DY;ZB001E96R -QKTPLU
MN65>92Q2WI/5=TZU@-!@O.@I?_XC1JV>:N^77>DX%6W^^3U[7O,[\KR4VRCS
M/#]R:^1Q%3E)JXR3+$GC&S5,#SXE'9Y_^G3U:?CA:GAY]>E\^/;3V>7Y .!'
M,^^NZ$BR&(6X41,/!ECUR?IPHO_*(7:0;2XZA(@/W.:L<)LS96D]_;Y.VYSG
MKO+U^I/<26VW]K&3VN[A3FIJF52RPSRIS;1V2[YO9@R+==_JVO3.[)$N#I9U
M:MB4HK%=/%=J$K)-QNH':&QLB?VT1!LP[C[]?H<1-SW8XO%%I<<7F4#2&D")
M$'"%@*L=ORQ>Z@!7WVQV_./I[\ZO]Z-&1F<^",2*(,2J1GL/"+%2M#& $"M$
MV6P70H@5-CY"K&K@6PBQ$CDJ0JP08E55:'QN$*OG 8@JU56K1YG5&"SS!&!:
ME5H/,5]U0> @3.LYP[3J&.L0\U51*,Y%6]6C'R'F"S%?NPLAY@LQ7[79W?NN
M$ B(^?J.D$:(^:I+2R#FZ[N-N(CY0LP78KX0\Z7M _-U]?%@F*]\,\0/CR(/
MEA.-",^-*?W$EZVF3+@$BS<Z+S&,<6'W\9->](>3KN[-0Z&Z^15*G?@?IT__
M6<G=5*EQ[3@]QHFIDN!VG/S-*9VQS9A#D6^'U2LC7A\"UD<;,']0$#\H0OY$
M'K1MA2,3CDPX,BUY9(],_'EJ<Y^$FT^^4:5&3<(6K7?)L(6[XHA&KO^6-:*1
M$9"Z70C1R-CXB$:N@6\A&EGDJ(A&1C1R5:$1T<C;D"%$(S\=A!ZBD;\?-')B
MR'^9=C*M8;8+DD<7 SL:(IL1V;PO)ZECW$1D\_/H$)C-LNY[N(AL?KK;Q(AL
M1IS==B%$-A?USN\<3XO(YKJT!"*;O]N(B\AF1#8C?@SQ8YI*_-B ^'>TKRT>
M'[P?58J8XB#HYL"_$ZJ;7R%$-R]C]B%@@K0!\P>&^J*;US]9;-#C%10$DQ]_
MU%Y[L[G-IP5CINF]Y]]FSD'8)\NBWL8.]%GQ$>%;M*[U2*.FZ3P&=";*=H8Z
MO+\% A9)"<WTB1;-M=#31FRW>#=!(R&@)6_8]JS%=69#A._-LA01\@J]T'36
M."[X99%E6>JUQHP;A\82EC+ZN:9:%'EJMGION[<;EHHWAH>L^- ,0U]@.:C<
M38/31KK=78R^E@ *Q[[Q3?]Q4S6=?L_G MX-GZ=L_DP>YF6J?V,&ME7/ZG/5
M=E<__KED]6WJ@*$]?JRG!1;:[3;"LD19.S XOA]EWJFI@R$6Z@DLL2Q2TA1T
M4+=#KZXQ8:'=;D,L2Y2TP]ST!5H>T@9,L]WUY[^6K7OH#RW/S9J#U:'^B78"
M&RQ*E+1#<OA=3S,DRNVVPJ) <2.X5/8=J>D@F58NTPAK!4H;86R&B]A25U.D
M5!09)%VLM%GJVD76U1.9H[)N$D[I&K?F+I+64624M7+%+1/:=&(2A'XTJYU!
M5JIEVB'U<ZGJLRUR9QA0,YJ3K,WN@QMA3<%=IE@O5,H@B5-1ZXZ].MHCK=\N
M<ZR5*66-.3%OZ50ERKP6>W!;K+3;98E4B5)V\,W[^JX\-O3;98NU,J6LP3&;
M=31##";=4?_XQU(5#^T9_:V.-8\UVU7UY->\NI\_$"L*"^S&)2PN/KR].N7G
M<PE-#,L<3D@XG/NVY]OA8WS/JQR/4^WCV6!P_@;.):A DP"D"34K9R%1+M?\
MNQ8Z.0K35C.M:='JQM3%33XB9:3'U'#IT\>$@<7/A:#B-\A+RQ_>V^%TN 2<
ME--FG5GQEF%=ZMV'BR%Q[\KTRH1%<3V^>3;8)&G:XI)I7"1R\E\F+WY?(0JT
M7[1&HV$81J^G'?7HV]Y/FM'(N/->:WK^THX:Y6@[[-USI,[WFN*>1QXL,F?=
MEZU:YD6]?YU+B6'1(:2P$IRX1(3D]S$+AT1.O=]A6' JE3MU<,;%IQW.N%RL
MM\%67J<N)WUQ[ZNX!O';/;>UX.0M1^4E:=$Z+QD4-[P=K+B0PL9?YU)<&XM=
M2Z]"H2U&^W4*P4Y CN*KG1F[L%ND>11OBP47PHQ85A7.I+PNH?]8C3Y+1A78
MYZ%\2S$>Y35Q/3;H#-EMU9+ZK#B5U^K>+&\?QJ,"[^'3LBKT67&J4BO^UHLJ
MU&[!<;_1;P?R($=[1C6,7/:GJ %2+(JW"V=2>FA>YU)V 5K&*"L.>_:"W1@,
MB:D<9U%^1IAB4VYRNCQ6+*O1&J/]MLCNH^Z\E45,./3C) !%UR=K7$JL11,^
M='1*>)49\K*Y[:UA<A J>8M;MN9CQ,7W+Y<<GOX6ZLQTP7OV63Q*:&+3@&_2
M,3A/C54Y^R]:<^'N6JZP"O0=CLC89)E*<O1>%)OX7C375@H8C8P+HV#I^^YU
M8DC4#NWYO"JP)ZX)CCDITGU7%1S[EXVT'B<+]Z]U-B5<=CMN5Z33(>)^#N0J
MOP(K\F(+8P&K4FV48E9XT9[#KBK]E@LE&I <ATS@_5J6;_4:5ZUI51JRR!JY
MCF?E+EOB@Y=3C9]152>VJHIP3V/KF) G$:NP>ZV8[BWH"-&,$FL7-D>./P9E
MED I-E6<&,3PK?+G!C&?<AK=,-\C%:BTQFB?#B+ >^Y#? ZZ4L)RRVZUX%6F
M&;:8%7>/J>>,@J%,2,SG4,Y)&8>A=^\6WT9?YU).&\9B:=Y2<66=TSX[S2X4
M[#YDYR!/<^R6HBZXC-_-J;A?I'F-Z ^^5QB,E\&J&KU*G4-M,:I&I]+G8YG,
M*K)7B7.R33[[[-N[L,P2 8F3#KLR4V"R@AXUM:/%NXS44L^92,*6^VSY+#!W
M8;F?1\0A(?FJO6%_>2X'VR?LL1"/E68CH46&JX0=BXPD7Z;A9M8@_E9U;A1I
M;>+,6O'/7[5KWW2#L>?/-+8J/=6,5L_HSP3#&S7^1X>P??"Q[8YX"P8<YQXG
M8*;OPRKK=7PW.T[7ZUCD) R+XFYG3MFG0P0S[Y:LIZ@1:AS?2-!79#Q#SZF(
M)E4VWMO2.?P$*"8F%:29265.46BC6(W@.)A&X8A.*X^OZ==O3$*E7;DLO7Z&
M@IILJI;\3"U/)%%+#;*S80Z[9YG#+NZ+9'9#?6YFNO:8"'-/'3 HO#5I9SGW
M?=&-:0P)&!+J9B4,"<I"PD5^+B:,"!@1ZF:EYQ@1\M8;PN+LWR'?"^ $&<%F
M+\OGW+7;U1T--S9__-+<)W>V%P6Q/]AA\NBOU4,=:5=E1#I_[I,^-\-I[?P0
M>^NS[*T;O2F^HOS-#H=><D^'^B[;:]X]I._^9?&J(D?T@&F7;"#1WO/:L=EC
M/!=YJK6C!*HFV,6L4ILBUMA#QNHX)J4S5M.6%*J;7R'^"(.\W-'$'\N4$VP4
M:K^??;J\^O#OE\U^3X WL;UC-H^;$#^H0%:K;PAD3:SCCU/3#;W9IT6@OE[L
MN0FI_D7,6PA)?O.L7KO++C)',Q?23K7?;0';>#,\I]0&0SHYMFY9;63X2A3>
M8,^'/L<S1\377[/WC/HW$KXA]!?V3%S^I8SLLIP$BITO[FU?N"P]MVTZ]E_$
MES5*64X"Q=Y[D_?\'50/"4*!V ]>^-:+1/C5;*GY= *A@] G05"LNG*T&\*7
MM_57K0;J#,7H=RKQUG:YMQ34 4"^4X4/'\]A0H4$&V(F%M/QC#T%1D:(5/%,
M$7&?DY>15SY#B.=;@D/J=0'BLAG,?7/"'F<IRS^W>)8((JV^L.@VZ_=7 TG.
MPI(9C&VY'I%;=)OUI? &Y1IK<=$,UG3R:E_'Z$M9$5(DVZ(D.V]>R6W&F[.E
M_XU(1&0#5#'Z;24H-7\@KZS?2I3/$!*YRW@07+GG#W8(J">8>EN!>!RCNDN*
ME"B?(>31M::^YU(]1RN% 14MPF!;C=C%!\NGIDL*ER?;$,EV:'1^=K0V-\NB
MC]^_H__R)S&SJU*"9[NLU .(V*WB53B5&[UD2F\*\/0SWS<?98.I7/D-(=]<
M6V=3L?=Q3D09.=(D&Z+H,MH;SV@_]Q_U-UYTXTB%!PB50."%W!@M32(0]=$Q
M;:D. B 2B),,0-(D E&T.WOW4&$Y1 )Q?W+(#U1>'E6NP&*^*4>;*[R GTH0
MYHHMX$02A!MBY\0?Z_&!P*7I/BX78E*3K0+$LN*'(_IF6DJ)/!99JJ3GC@-[
M-I?S.3!IEN@!N2.^Z0#FNB"R3)%\]O/:\UWB#^A *R]4FE!&[%"P!Y@C6$2:
M)9H'/N8FTA(E*(2""O0H$*VD<&!_*L!!J$A1\4"A/AD[- 3JOY'PDH133VH#
M#D"T(6Z!H] E\)9;8@L0B\0+D5UBX6)2V%Q>I*((:9(IIB5(,[&C+D(9^2J^
M]RRIG0P T:8X'L'T5_:$QC+Z_:MH/)9;KD ILP6#]O?D:;*%\=:0FG=+$F2+
MN;0? #*$I;,%\#UA@(B<\CN$/+I2&[M2Q;-% "87LA39@N27"9($V6+8B>+O
M9C"=F7/9[1<HY8;@^(J/SO:F!DD,^-WSI'P#3)HM^L+E6!D"ZLAPVEW"D_ J
M.\K!Z+*%LHE XH>RK0RES!8\8)F@ >)RRF<+B?63&+>VQ$E3B@1?75V"10II
M-H1%H>WH;X1W$E=2) IGLO<^^O8=<<B$2,WX $19XC[ZGI172!3.8A^/[O)#
M)X!H\])9? 9,E-\]2X$"-^Z>U0";A@@^1/!E]A9!YTM>"A!\5$/:DSW]W?GU
M?N07J?]A,'L$,7N[92%F#S%[(,40LX>8/<3L(69/6@AB]G:Q1LS>]XW9B]]?
M+QY><<ORI](%]I1H073SDJ[8+)(]2,?O_X.NN#U_HIMSD\Z3]=#SG$"GXO70
M#&[ITBW0V;&(/O;\VR/^CI&=]CKMS%L]()Z$IQ0B['V*M=$S*F.=8GM22.$_
MW%O7NW?/'<)Z_)+MQM=<0+/7*2+AFNJMLW-'SY\=\0^<6ZM;SL #\G\1>[":
MZ2R53GW%1>1*<$FH!V/&EZ5V].T;W?$FMJ5?C+F>"[[)Q[CQ^KT<I@%=/*\.
M/5V6U)R,XJ//,XNYJN<;G;9NNW=T";8PM#;P(AK4 :Q9HJ )?[KO.N^+V=Q9
M,!>6B=LTKTG9.]TQW<E2<,QJ(2+YQ)EU3@H[R-G(G(=TUK4P>?J[V.[-%KHW
MT+V?ET4N3<OW+MP@-.F L=1[_=M84.^D8+^G$ZNDRQ!]Y*WL?<$?34!GIT?I
M$K&-FM4(NYX29JH@0\))WG A(V%AKVWV1E['$K!/LTWZ:;?[/7CE-=\R384K
M_C'FV"XTO"<L$@UC7UACV^T789ML7"\T'7@^'8UBOL'1XL<DPAJ%FFY*G#E;
M+]-1QB%\;R_.I+CRCH6XK"))CZV@:MF5:G3S^J<XZIREO/%LX8*MD^S$E;),
M7YN.L^%!J:\2Q0O9Y*GU(QSO<+S;E- I,2#A>(?CG>+Q+G/8V6!MY*Z$=CD9
M'6/>DM":I@>=^(O$V(6< =WMR;H;3J_0R=')T<FW)LS139IO\C'Q[D*VD&+=
M*.28V#6?;->L9KHCZO5OXB1JNWK\YL]<9+M1M]Y^:=HN \Z]8MBK(_XI7K66
M8,<?%4+[7HJ=<5*H;SMFY-(YY'O^A]J<*GJT_!#WNW8A]]AD/*.:;G#N9FN<
M<8J(J3BD%<!4'+G",14'IN+ 5!PRPC 5!Z;BP%0< M&8B@-3<6 J#DS%D:\(
MIN+8$KO75!Q%)^3@;!^8BB-/'*;B$$C"5!SR,C 5!Z;BP%0<0K&8BB-7,*;B
MP%0<F(H#4W%@*HZMWB+H?,E+82J.JX^8BF,]%8<WQU0<NV5A*@Y,Q0%2#%-Q
M8"H.3,6!J3BDA6 JCEVL,17']YV*(T,<8O:D%4#,7J[P?6#V-L4J@_LA9@\Q
M>S*B$+.'F+W"PA&SMT,T8O80LX>8/<3LY2N"F+TML8C9R]40,7MK,A&SAY@]
MV>*(V1/+0\P>8O9R!2-F#S%[B-E#S!YB]A"SM][YDI<"S%Y*M?W(+U+_@V#V
MJ&6$ZN97:%^8O< 1[:Y/K&-V"HZ8P&HQ@3]JUU,[2.;W\>A&/]X1_Y&WAW3?
MBAD<QT-I86WRW73UDIX>('81L8L2>B!V,5\X8A<1NXC8Q5SVWP%V$0&&"#"4
M5P !AKG",2D@ @P18"@C# &&"#!$@*% - (,$6"( $,$&.8K@@##+;$(,,S5
M$ &&:S*?'L 0D7^2(A#YA\@_1/Y)"T;D'R+_$/F'R#]$_B'R;[WS)2\%R+\!
M\>^(K\V\$='>76#&OG7T7^#?"=7-K]"SSMC7:PF6VTM8R/>  ]Q^20_"E>/K
M$ "' #@YH0B 0P < N 0 +>+,2;O$XM";!UBZ^2$(+8.D_<AM@ZQ=8BMDY2'
MV+H"8A%;A]BZ?+&(K8.(1FQ=81406X?8.L36(;8.(@R3]T&$((0/*@8A? CA
M$XE%"%^N8(3P(83O@!"^]4^<U] G#)66@:WZ/+L=V?Y7+5[MCS3ZX;12-!HM
MDM;U2ZQ)\&4:;L+%/G^+:""-?_^J7?NF&XP]?Z:%]HR<:IV^T6O.!*/F]31&
M;6DQ!Y9FJF)@G:@J7VC[DP=]NU;KGU;DIZ)BEC>;VPYY>4M=CS@O,\HOWUJT
M[7AIYO,M+? BWXKA7X$6>I76/]8FJ7SBYEM:?1[1_A^2K]H;]I<I15V*ST0>
ME2OSQ?7"\3;88_W3RSEM-]//,>Y!JI$XU %Z:;X:ZY_\R!78KP;P6 01/TL0
M\<L-QWMY8X;6]."883KGT&*M$N!PQ,&XKQV;N.$2.ZP=T28SZ83@I_UH5<0J
M>T 1)[$F#2/^9I=-(OHC2S1)@@5PF\9W.OIY.3D_V3?'CNE.CFD#LFG&V6AD
MLYU9TV%KF[\7!^9N:Q.Y06C>4'.RKC.E,C5O'!+!Q#)'.</(T2Z'OM4N2=\O
M1]]NE*0O6?]VLPHP>;O3$A1<J3!X#$(R8W*5(J@/,D_X0GNOSF)<U@R53>E7
M:S+/G^CFW*12]40EG9E'GQ"7^+85Q"#J&#.;O;NPX'C-.Q8=#4ZUIO$/[:UI
M.Q%=;9UJC7]H?#\]?GM-VUTCCCD/R(B6U$^:)UI ,C;YLOAV9?DV]%:GG\.7
MKDY^>TT;9*3122H;\.]L&F GUM <C8;WQ+P=^IX7#@,2#NF8X3\>90P2&4H:
M'5DE6WJC)U_Y$UFV7=UH=J39MN1-VC/R3+IB*VV$IMYH&=5K:^C]9E.:K;2_
M4K_JRVMK].6M8'2Z\E9HR[M8NRO?:  S--H])6R[\HTF;=P&J)]!?*$GW\^:
M &T!'4(16VD'8[:5=S#I&-8 Q3# L*#("$9#W@@ ;149P3B1[PX] -NVBE$'
MTF(01P $,(BV +8 _X)$&H"VAKQI(=$68 .(U\J[%R"&-T_4C#B @>SP 4%1
MBS5:\D8 #61JV*HQ0K/1JIYM2^\ ' PR 3/DIZ&*AEW B /Q!*.AQA4@04'%
M2@?69I")'< (D#8#S,4AVD)<04W -:2GMP9H&=D$>&[S!+ \!4S'>RW Z"OM
M#49;;QF =EMK.$/$F&J<.["?#Z[YAF"\XY7L23)Q3>WMV<7[\S=5.U,'XJ.J
M%N/2\:JK]_J R:RT,YWH_1,EL]D.( [VY;<H^_J)FMDW9&9@  ;;KI)U&$1;
M^0W@AGX"B(2 L;9[HF8V!]CQD>X13;T%V067WP25]P/I>;*AMP$;JXJVIP#N
MU6X!+*LFE,L[ L "TB8P0.$+T!4@?B!M@9;>!6R$ [3M= '!%A /#"GWRII/
MU !M@I@<Q.0<')/SS6:P7D]_=_Y]Y_++0N$01.$@"N>IH'"V7[7!PY G@H<Q
M((LW"!PF?_5V<#A,$W1H(CVC[.G-KH+ENP%9"@)L -D/DU:V"=L7!,RJ^X!M
M0<#J_43^.!T$AFDJL8(J,$P;L)^E!K"AR B0;0% 3 "QE5\.0DXA5$0PF+:0
M4SF MB C*-+VX$: '',!(B/DK$\-K@!B6Y"V!^]EBFP+@H*H\5LUF$:(M@ C
M* +(U2 F*-*V!D.D(AB7"@A34^]V%,W!U""C% TZD$WNAII8HP@D5X-1YVGA
M8=0,#T\-#P,9=R!XF YDR2>/AVG!%)9NN*[>5;+R;0(0(B!$"\1[(8@6 (Q)
M>M/&  'J(4"9D[:2140'$LXA0!DUR!/0K@WDBB @YD" ,@"("*!+] #X&\ 8
M#+E9  $'-.3WK@#X"$5 F89^DGM=M A8AK8:8.\9P%;170A = 0HV^RJ\06(
M$0 G,"U T(6<P  \ 0"747,AI'VBQ,$R8U@-$!Z(@T$<3&UP,%<?$0>S@8/Q
MYHB#01P,XF#*XF!H/WHB.)@^[#P9,+7I=VJ/A.FVZ=JT^LEBNZ?W6PINO3?U
MCJ$ "]/5>P#0BCQPIZUWU%PUZ )V@>0WK=A5-L NFSP<I@/B"[I##-@C5G.B
M#CF9;!\<$P0YE /8%L(6@ E2=&0"R0VC*-L*@"TD-XR:"RVJ3M0!O:P.<!@U
MY_^*M#U\\B%%J6P4Q5M%3:8H'T8-C*"F.R@#[QP<MP)A"W P@!&47,YLMD$'
M,,\6#P,Z3&^H&=(5187#YR2#!!M%;79X/$Q7$1ZF#SD_!7@NY"Q.7M\6"*D@
MCX?I-4L@3$3Y85I=B<3#>\X/TY/8FBJ&I@&-!=+QJ@?9I +=@ + ]^1S;+34
M)%$T8%-$Z59K-U0,!0 +R"-IFJJN#T""J_S><EM-SL<F*"4?9(8(@;P LH0W
M6P#K C:#(2.M/)3F!.*[$'"*FHN1$$0@!$ZD(OV0 7(Q^8&GHPKKK^267:NI
M!@MG@-*=0< T?:EQ!U//(.0&(3?9D!N;/4IR[I-0^(#9"O5X.I ;:AJAOODU
M0L@-0FX0<D/[T=. W+1!.]SRB!LZ7>O7'G%CT,E?6WX-*S^I[+5 .UC2RZQN
M"X13!QBBK>;1&/TF*+.C_*TCP-Q:>BW?@9T 2V]#&PQ\I")QOP&[^@M@J^(0
MV%!S6FN MAX &6^5G"C"V,J[F!K0#>BV#6!M#'$$B U4'(3#_$L16_F[Q&I0
M+##_ AE! 8K%4'.<:*A)76"H2?D%\P10YU4SY@!@4@ C*$&Q*+.MDJU3=2/D
MX0=>@!$@R1OD'\G4@H$!U/0'11X&&74@0(N&FGX&B0J O$&00*XBJPLLABF:
M*2B:A4'Z V38@3R$0]ZV\I ; W0Y!@ 1:H,><0)[)A/D&<?2#=>'@8\ !H:X
M&8 OX.F8\EL+)Z!M$ !L!F(%>=A,'Y890QXP!ADKY5$SK0[H*5#2^K9!.7/D
MH3,=-<\$;(.R34#VB"%I]J3[1!OD#=+&;2MZ6A-P0TA^BQ2V8I>>1W=@S^Y2
M<V  @6<!-LP!VH(@.?+C< \$6(2@9R#7,P&= G*K5MX,?1 $6%K=+EVL*9@T
MM/63K#S[-4!\("X&<3$'Q\4,B']'?(V=6VOO+C =S08V)O#OA/KFUPBQ,8B-
MV1<VYD?M][-/EU<?_OVRV>ZT! 57*@P>@Y#,F-QGB,BAO?=I('(,V"H9D@2G
MEXO]/S@DIZ,H?42KIQL]-<]8:B@ Y'34W HUFGJ_J^0Y0)#]%TCJ9HBZ\HB<
M+NCZ%N2BM)H<0TK.1H'70M5<$5;TJ&A%S]&H01(<0!!3]'@.1=>O%3T$Y_#I
M"$ WX]3T,D5&>%K9"&KP3"@UR40@VAY^T%%FA(-W!PA;P/8F:(A4DUL' -*#
M7'$&//14'N'2T=MJ;EZJ<ER *SS?AT)!+N>#<J^IF=P!0J.B-E,T%07T!\A-
M%$@2',@C3T /A8)<1)'6%W:6#P#D-$&&@ !R()U"_D:.HF=8P98\D#PVD*T%
M>>B,T0+=]8$\K ;0WP#8&=CCO 'Z0O(JR&-G#!"22I&Z\KNY35#"%0""%9+!
M!/)T+$6Y1D"9S2"IC0"()WGL3 NFKYI]%D6YMT&/<%+A# W8E5#("*0FOZHJ
MZ P$7 A05U6>^XQ!8OU3?-26QCML(!UB!>)B5 W?=(.QY\\T=O#)5F[&26\6
MP$A.FB=0DFZC#R3I]OI0Q7JM?F.39/T3/]44&"M^OSA6_?ON5PZ9]C]II$<0
MFF$4:/ED<M+R3H)?.S9QPR6D1#L:D;$9.>%/.W,IKM,OGH[T[OQ:^W@V&,A3
M7'V\EI212@<C*6,#*)-)M9O'1X>8 8.MN"-M1$+:_<B(]IV FB70(G=$.:LZ
M#3].3L/9F3NQ0L]_U$5:ITA/\UTYKH*PX*L_+MZ_R6R6@N@=_I:AL$Y;_9-3
M?GX]]AS'N^< (1;,-,^R(M^G)KZ?,J 0>2!6%+*?PZD=:([MDM/J5!E:WFSN
MN=3GN5*]UL%TDL7*<2@;T[5[J@V\V0(--.9N*6K+:R\TG23<M8R>-K/=B-)J
M,2S6<T<;T>\=_5?[%/N(9BQ^L[SY(ZT>_9=5O]<W.)PKT$)/6.>DN\0UYM$S
M8:A]_LN>4T=CI1A'^DD,+MGF-&PV&CWZ7W_8Z!EMG7+XX<4+UHI),WENXL':
MO1U.:9.MM>^#1>:LS.F+P@V?K:XY,N>TQZ8U77P7^UJ'^YI/M'OVSZH4;TLV
MPK_XX<7/Q^:O/Q_38$?_O?%&C_3/-)PYO_X_4$L! A0#"@    @ +63I-K7,
M/A8O)0  KHX" !(              *2!     &5X96-U=&EO;E]L;V<N:'1M
7;%!+!08      0 ! $    !?)0     ! 
end


Mime
View raw message