harmony-alerts mailing list archives

Site index · List index
Message view « Date » · « Thread »
Top « Date » · « Thread »
From nom...@hursley.ibm.com
Subject [continuum] BUILD FAILURE: Classlib/linux.ia32 Build/Test
Date Mon, 09 Jul 2007 16:38:48 GMT
Online report : http://people.apache.org/~hindessm/continuum/classlib/linux.ia32_build/test/2007/07/09/20070709-163848.failure.log.gz
Build statistics:
  State: Failed
  Previous State: Failed
  Started at: Mon, 9 Jul 2007 16:24:04 +0100
  Finished at: Mon, 9 Jul 2007 17:38:46 +0100
  Total time: 1h 14m 41s
  Build Trigger: Schedule
  Exit code: 1
  Building machine hostname: hy2
  Operating system : Linux(unknown)
  Java version : 1.5.0_06(Sun Microsystems Inc.)

Changes
                            classlib/modules/luni/src/main/java/java/util/HashMap.java
        
****************************************************************************
Output:
****************************************************************************
Buildfile: build.xml

svn-prop:

build:
   [delete] Deleting directory /home/hybld/continuum-working-directory/6/classlib/deploy
     [echo] Classlib revision is 554681
     [echo] Post process: true
     [echo] JAPI: true
     [echo] Building with reference jdk/javac
     [exec] Buildfile: build.xml

     [exec] -init-hdk-for-clean:
     [exec]     [mkdir] Created dir: /home/hybld/continuum-working-directory/6/classlib/deploy/build/ant
     [exec]      [copy] Copying 1 file to /home/hybld/continuum-working-directory/6/classlib/deploy/build/ant

     [exec] clean-java:

     [exec] -modules-clean-bin:

     [exec] clean:
     [exec]    [delete] Deleting 30 files from /home/hybld/continuum-working-directory/6/classlib/build/classes
     [exec]    [delete] Deleting 12 files from /home/hybld/continuum-working-directory/6/classlib/modules/accessibility/bin/test

     [exec] clean:
     [exec]    [delete] Deleting 13 files from /home/hybld/continuum-working-directory/6/classlib/build/classes
     [exec]    [delete] Deleting 5 files from /home/hybld/continuum-working-directory/6/classlib/modules/annotation/bin/test

     [exec] clean:
     [exec]    [delete] Deleting 35 files from /home/hybld/continuum-working-directory/6/classlib/build/classes
     [exec]    [delete] Deleting 1 files from /home/hybld/continuum-working-directory/6/classlib/modules/applet/bin/test

     [exec] clean:
     [exec]    [delete] Deleting 42 files from /home/hybld/continuum-working-directory/6/classlib/build/classes
     [exec]    [delete] Deleting 36 files from /home/hybld/continuum-working-directory/6/classlib/modules/archive/bin/test

     [exec] clean-native-includes:
     [exec]    [delete] /home/hybld/continuum-working-directory/6/classlib/deploy/include
not found.

     [exec] clean:
     [exec]    [delete] Deleting 112 files from /home/hybld/continuum-working-directory/6/classlib/build/classes
     [exec]    [delete] Deleting 226 files from /home/hybld/continuum-working-directory/6/classlib/modules/auth/bin/test

     [exec] clean:
     [exec]    [delete] Deleting 922 files from /home/hybld/continuum-working-directory/6/classlib/build/classes
     [exec]    [delete] Deleting 540 files from /home/hybld/continuum-working-directory/6/classlib/modules/awt/bin/test

     [exec] clean:
     [exec]    [delete] Deleting 107 files from /home/hybld/continuum-working-directory/6/classlib/build/classes
     [exec]    [delete] Deleting 268 files from /home/hybld/continuum-working-directory/6/classlib/modules/beans/bin/test

     [exec] clean:
     [exec]    [delete] Deleting 125 files from /home/hybld/continuum-working-directory/6/classlib/build/classes
     [exec]    [delete] /home/hybld/continuum-working-directory/6/classlib/modules/concurrent/bin/test
not found.

     [exec] clean:
     [exec]    [delete] Deleting 48 files from /home/hybld/continuum-working-directory/6/classlib/build/classes
     [exec]    [delete] Deleting 90 files from /home/hybld/continuum-working-directory/6/classlib/modules/crypto/bin/test

     [exec] clean:
     [exec]    [delete] Deleting 93 files from /home/hybld/continuum-working-directory/6/classlib/build/classes
     [exec]    [delete] Deleting 3 files from /home/hybld/continuum-working-directory/6/classlib/modules/imageio/bin/test

     [exec] clean:
     [exec]    [delete] Deleting 9 files from /home/hybld/continuum-working-directory/6/classlib/build/classes
     [exec]    [delete] Deleting 20 files from /home/hybld/continuum-working-directory/6/classlib/modules/instrument/bin/test

     [exec] clean:
     [exec]    [delete] Deleting 176 files from /home/hybld/continuum-working-directory/6/classlib/build/classes
     [exec]    [delete] Deleting 198 files from /home/hybld/continuum-working-directory/6/classlib/modules/jndi/bin/test

     [exec] clean:
     [exec]    [delete] Deleting 43 files from /home/hybld/continuum-working-directory/6/classlib/build/classes
     [exec]    [delete] Deleting 18 files from /home/hybld/continuum-working-directory/6/classlib/modules/lang-management/bin/api
     [exec]    [delete] Deleting 16 files from /home/hybld/continuum-working-directory/6/classlib/modules/lang-management/bin/impl

     [exec] clean:
     [exec]    [delete] Deleting 34 files from /home/hybld/continuum-working-directory/6/classlib/build/classes
     [exec]    [delete] Deleting 100 files from /home/hybld/continuum-working-directory/6/classlib/modules/logging/bin/test

     [exec] clean:
     [exec]    [delete] Deleting 975 files from /home/hybld/continuum-working-directory/6/classlib/build/classes
     [exec]    [delete] Deleting 966 files from /home/hybld/continuum-working-directory/6/classlib/modules/luni/bin/test

     [exec] clean-native-includes:
     [exec]    [delete] /home/hybld/continuum-working-directory/6/classlib/deploy/include
not found.
     [exec]    [delete] /home/hybld/continuum-working-directory/6/classlib/deploy/jdk/include
not found.

     [exec] clean:
     [exec]    [delete] Deleting 29 files from /home/hybld/continuum-working-directory/6/classlib/build/classes

     [exec] clean:
     [exec]    [delete] Deleting 14 files from /home/hybld/continuum-working-directory/6/classlib/build/classes
     [exec]    [delete] Deleting 25 files from /home/hybld/continuum-working-directory/6/classlib/modules/math/bin/test

     [exec] clean:
     [exec]    [delete] Deleting 14 files from /home/hybld/continuum-working-directory/6/classlib/build/classes
     [exec]    [delete] Deleting 1 files from /home/hybld/continuum-working-directory/6/classlib/modules/misc/bin/test

     [exec] clean:
     [exec]    [delete] Deleting 142 files from /home/hybld/continuum-working-directory/6/classlib/build/classes
     [exec]    [delete] Deleted 5 directories from /home/hybld/continuum-working-directory/6/classlib/build/classes
     [exec]    [delete] Deleting 157 files from /home/hybld/continuum-working-directory/6/classlib/modules/nio/bin/test
     [exec]    [delete] Deleted 19 directories from /home/hybld/continuum-working-directory/6/classlib/modules/nio/bin/test

     [exec] clean:
     [exec]    [delete] Deleting 303 files from /home/hybld/continuum-working-directory/6/classlib/build/classes
     [exec]    [delete] Deleting 79 files from /home/hybld/continuum-working-directory/6/classlib/modules/nio_char/bin/test

     [exec] clean:
     [exec]    [delete] Deleting 44 files from /home/hybld/continuum-working-directory/6/classlib/build/classes
     [exec]    [delete] Deleting 19 files from /home/hybld/continuum-working-directory/6/classlib/modules/pack200/bin/test

     [exec] clean-native-includes:
     [exec]    [delete] /home/hybld/continuum-working-directory/6/classlib/deploy/include
not found.

     [exec] clean:

     [exec] clean:
     [exec]    [delete] Deleting 32 files from /home/hybld/continuum-working-directory/6/classlib/build/classes
     [exec]    [delete] Deleting 32 files from /home/hybld/continuum-working-directory/6/classlib/modules/prefs/bin/test

     [exec] clean:
     [exec]    [delete] Deleting 205 files from /home/hybld/continuum-working-directory/6/classlib/build/classes
     [exec]    [delete] Deleting 60 files from /home/hybld/continuum-working-directory/6/classlib/modules/print/bin/test

     [exec] clean:
     [exec]    [delete] Deleting 177 files from /home/hybld/continuum-working-directory/6/classlib/build/classes
     [exec]    [delete] Deleting 14 files from /home/hybld/continuum-working-directory/6/classlib/modules/regex/bin/test

     [exec] clean:
     [exec]    [delete] Deleting 230 files from /home/hybld/continuum-working-directory/6/classlib/build/classes
     [exec]    [delete] Deleting 53 files from /home/hybld/continuum-working-directory/6/classlib/modules/rmi/bin/test

     [exec] clean:
     [exec]    [delete] Deleting 429 files from /home/hybld/continuum-working-directory/6/classlib/build/classes
     [exec]    [delete] Deleting 623 files from /home/hybld/continuum-working-directory/6/classlib/modules/security/bin/test

     [exec] clean:
     [exec]    [delete] Deleting 2 files from /home/hybld/continuum-working-directory/6/classlib/build/classes

     [exec] clean:
     [exec]    [delete] Deleting 74 files from /home/hybld/continuum-working-directory/6/classlib/build/classes
     [exec]    [delete] Deleting 54 files from /home/hybld/continuum-working-directory/6/classlib/modules/sound/bin/test

     [exec] clean:
     [exec]    [delete] Deleting 84 files from /home/hybld/continuum-working-directory/6/classlib/build/classes
     [exec]    [delete] Deleting 81 files from /home/hybld/continuum-working-directory/6/classlib/modules/sql/bin/test

     [exec] clean:
     [exec]    [delete] Deleting 6 files from /home/hybld/continuum-working-directory/6/classlib/build/classes

     [exec] clean:
     [exec]    [delete] Deleting 1666 files from /home/hybld/continuum-working-directory/6/classlib/build/classes
     [exec]    [delete] Deleting 4 files from /home/hybld/continuum-working-directory/6/classlib/build/classes
     [exec]    [delete] Deleting 1880 files from /home/hybld/continuum-working-directory/6/classlib/modules/swing/bin/test

     [exec] clean:
     [exec]    [delete] Deleting 40 files from /home/hybld/continuum-working-directory/6/classlib/build/classes
     [exec]    [delete] Deleting 32 files from /home/hybld/continuum-working-directory/6/classlib/modules/text/bin/test

     [exec] clean:
     [exec]    [delete] Deleting 123 files from /home/hybld/continuum-working-directory/6/classlib/build/classes

...

     [exec]     [javac] ----------
     [exec]     [javac] 1. WARNING in /home/hybld/continuum-working-directory/6/classlib/modules/annotation/src/test/java/org/apache/harmony/annotation/tests/java/lang/annotation/IncompleteAnnotationExceptionTest.java
     [exec]     [javac]  (at line 53)
     [exec]     [javac] 	clazz, elementName);
     [exec]     [javac] 	^^^^^
     [exec]     [javac] Type safety: The expression of type Class needs unchecked conversion
to conform to Class<? extends Annotation>
     [exec]     [javac] ----------
     [exec]     [javac] 1 problem (1 warning)

     [exec] prepare-exclude:

...

     [exec]     [junit] Tests run: 21, Failures: 0, Errors: 0, Time elapsed: 0.228 sec
     [exec]     [junit] Tests run: 13, Failures: 0, Errors: 0, Time elapsed: 0.031 sec
     [exec]     [junit] Tests run: 2, Failures: 0, Errors: 0, Time elapsed: 0.003 sec
     [exec]     [junit] Tests run: 20, Failures: 0, Errors: 1, Time elapsed: 18.972 sec
     [exec]     [junit] TEST tests.api.java.net.MulticastSocketTest FAILED
     [exec]     [junit] Tests run: 2, Failures: 0, Errors: 0, Time elapsed: 0.003 sec
     [exec]     [junit] Tests run: 9, Failures: 0, Errors: 0, Time elapsed: 0.028 sec
     [exec]     [junit] Tests run: 2, Failures: 0, Errors: 0, Time elapsed: 0.003 sec
     [exec]     [junit] Tests run: 3, Failures: 0, Errors: 0, Time elapsed: 0.003 sec
     [exec]     [junit] Tests run: 2, Failures: 0, Errors: 0, Time elapsed: 0.003 sec

...

     [exec]     [junit] Tests run: 24, Failures: 0, Errors: 0, Time elapsed: 0.111 sec
     [exec]     [junit] Tests run: 20, Failures: 0, Errors: 0, Time elapsed: 0.067 sec
     [exec]     [junit] Tests run: 48, Failures: 0, Errors: 0, Time elapsed: 0.28 sec
     [exec]     [junit] Tests run: 17, Failures: 0, Errors: 0, Time elapsed: 0.499 sec
     [exec]     [junit] Tests FAILED

     [exec] touch-failures-file:

     [exec] touch-errors-file:


...

     [exec]     [junit] org.apache.harmony.rmi.test.MyException: MyRemoteObject.test_Exception
     [exec]     [junit] Done.

     [exec]     [junit] Testing test_Error...
     [exec]     [junit] java.rmi.ServerError: Error occurred while remote method invocation;
nested exception is:
     [exec]     [junit] 	java.lang.Error: MyRemoteObject.test_Error
     [exec]     [junit] Done.

     [exec]     [junit] Testing test_RuntimeException...
     [exec]     [junit] java.lang.RuntimeException: MyRemoteObject.text_RuntimeException
     [exec]     [junit] Done.

...

     [exec]     [junit] org.apache.harmony.rmi.test.MyException: MyRemoteObject.test_Exception
     [exec]     [junit] Done.

     [exec]     [junit] Testing test_Error...
     [exec]     [junit] java.rmi.ServerError: Error occurred while remote method invocation;
nested exception is:
     [exec]     [junit] 	java.lang.Error: MyRemoteObject.test_Error
     [exec]     [junit] Done.

     [exec]     [junit] Testing test_RuntimeException...
     [exec]     [junit] java.lang.RuntimeException: MyRemoteObject.text_RuntimeException
     [exec]     [junit] Done.

...

     [exec] gen-report:

     [exec] check-test-result:

     [exec] BUILD FAILED
     [exec] /home/hybld/continuum-working-directory/6/classlib/build.xml:169: The following
error occurred while executing this line:
     [exec] /home/hybld/continuum-working-directory/6/classlib/make/build-test.xml:147: There
were test errors.

     [exec] Total time: 56 minutes 13 seconds
     [exec] Result: 1
     [echo] Tests.failed is set to true

japi:

     [exec] Processing class java.lang,Object:+
     [exec] Processing package java.lang,:=============================================================================+-+++++++++++-+++++++++++++-+++++++++++++++++-+++++-+++++++++++++++++++++++-++++--^+^+++++++++--++++++++++

...

     [exec] Processing package java.lang.management,:=============================================================================++++-+++++++++++
     [exec] Processing package java.lang.ref,:=============================================================================+++++
     [exec] Processing package java.lang.reflect,:=============================================================================+++++++++++++++++++++
     [exec] Processing class ,java:
     [exec] Failed to Japize java: java.lang.RuntimeException: NoClassDefFoundError: java
     [exec] java.lang.RuntimeException: NoClassDefFoundError: java
     [exec] 	at net.wuffies.japi.ClassFile.forName(ClassFile.java:1626)
     [exec] 	at net.wuffies.japi.Japize.getClassWrapper(Japize.java:1425)
     [exec] 	at net.wuffies.japi.Japize.japizeClass(Japize.java:748)
     [exec] 	at net.wuffies.japi.Japize.processClass(Japize.java:516)

...

     [exec] 	at net.wuffies.japi.Japize.doJapize(Japize.java:443)
     [exec] 	at net.wuffies.japi.Japize.main(Japize.java:316)

     [exec] Processing class ,javax:
     [exec] Failed to Japize javax: java.lang.RuntimeException: NoClassDefFoundError: javax
     [exec] java.lang.RuntimeException: NoClassDefFoundError: javax
     [exec] 	at net.wuffies.japi.ClassFile.forName(ClassFile.java:1626)
     [exec] 	at net.wuffies.japi.Japize.getClassWrapper(Japize.java:1425)
     [exec] 	at net.wuffies.japi.Japize.japizeClass(Japize.java:748)
     [exec] 	at net.wuffies.japi.Japize.processClass(Japize.java:516)

...

     [exec] 	at net.wuffies.japi.Japize.doJapize(Japize.java:443)
     [exec] 	at net.wuffies.japi.Japize.main(Japize.java:316)

     [exec] Processing class ,org:
     [exec] Failed to Japize org: java.lang.RuntimeException: NoClassDefFoundError: org
     [exec] java.lang.RuntimeException: NoClassDefFoundError: org
     [exec] 	at net.wuffies.japi.ClassFile.forName(ClassFile.java:1626)
     [exec] 	at net.wuffies.japi.Japize.getClassWrapper(Japize.java:1425)
     [exec] 	at net.wuffies.japi.Japize.japizeClass(Japize.java:748)
     [exec] 	at net.wuffies.japi.Japize.processClass(Japize.java:516)

...

     [exec] Processing package javax.sql.rowset,:=============================================================================++++++++-+-+
     [exec] Processing package javax.sql.rowset.serial,:=============================================================================+++++++++++
     [exec] Processing package javax.sql.rowset.spi,:=============================================================================-++++++++
     [exec] Processing package javax.swing,:=============================================================================++--+-++++++--
     [exec] Failed to Japize javax.swing.BorderFactory: java.lang.ArrayIndexOutOfBoundsException
     [exec] java.lang.ArrayIndexOutOfBoundsException
     [exec] 	at java.util.Arrays.mergeSort(Arrays.java:2451)
     [exec] 	at java.util.Arrays.sort(Arrays.java:2367)
     [exec] 	at java.util.Arrays.sort(Arrays.java:2326)
     [exec] 	at net.wuffies.japi.BoundMemberSet.getCalls(BoundMemberSet.java:46)

...

     [exec] 	at net.wuffies.japi.Japize.processRootSet(Japize.java:471)
     [exec] 	at net.wuffies.japi.Japize.doJapize(Japize.java:443)
     [exec] 	at net.wuffies.japi.Japize.main(Japize.java:316)

     [exec] Failed to Japize javax.swing.BoundedRangeModel: java.lang.ArrayIndexOutOfBoundsException
     [exec] java.lang.ArrayIndexOutOfBoundsException
     [exec] 	at java.util.Arrays.mergeSort(Arrays.java:2453)
     [exec] 	at java.util.Arrays.sort(Arrays.java:2367)
     [exec] 	at java.util.Arrays.sort(Arrays.java:2326)
     [exec] 	at net.wuffies.japi.BoundMemberSet.getCalls(BoundMemberSet.java:46)

...

     [exec] 	at net.wuffies.japi.Japize.processRootSet(Japize.java:471)
     [exec] 	at net.wuffies.japi.Japize.doJapize(Japize.java:443)
     [exec] 	at net.wuffies.japi.Japize.main(Japize.java:316)

     [exec] Failed to Japize javax.swing.Box: java.lang.ArrayIndexOutOfBoundsException
     [exec] java.lang.ArrayIndexOutOfBoundsException
     [exec] 	at java.util.Arrays.mergeSort(Arrays.java:2453)
     [exec] 	at java.util.Arrays.sort(Arrays.java:2367)
     [exec] 	at java.util.Arrays.sort(Arrays.java:2326)
     [exec] 	at net.wuffies.japi.BoundMemberSet.getFields(BoundMemberSet.java:33)

...

     [exec] 	at net.wuffies.japi.Japize.processRootSet(Japize.java:471)
     [exec] 	at net.wuffies.japi.Japize.doJapize(Japize.java:443)
     [exec] 	at net.wuffies.japi.Japize.main(Japize.java:316)

     [exec] Failed to Japize javax.swing.Box$AccessibleBox: java.lang.ArrayIndexOutOfBoundsException
     [exec] java.lang.ArrayIndexOutOfBoundsException
     [exec] 	at java.util.Arrays.mergeSort(Arrays.java:2453)
     [exec] 	at java.util.Arrays.mergeSort(Arrays.java:2424)
     [exec] 	at java.util.Arrays.sort(Arrays.java:2367)
     [exec] 	at java.util.Arrays.sort(Arrays.java:2326)

...

     [exec] 	at net.wuffies.japi.Japize.processRootSet(Japize.java:471)
     [exec] 	at net.wuffies.japi.Japize.doJapize(Japize.java:443)
     [exec] 	at net.wuffies.japi.Japize.main(Japize.java:316)

     [exec] Failed to Japize javax.swing.Box$Filler: java.lang.ArrayIndexOutOfBoundsException
     [exec] java.lang.ArrayIndexOutOfBoundsException
     [exec] 	at java.util.Arrays.mergeSort(Arrays.java:2453)
     [exec] 	at java.util.Arrays.sort(Arrays.java:2367)
     [exec] 	at java.util.Arrays.sort(Arrays.java:2326)
     [exec] 	at net.wuffies.japi.BoundMemberSet.getFields(BoundMemberSet.java:33)

...

     [exec] 	at net.wuffies.japi.Japize.processRootSet(Japize.java:471)
     [exec] 	at net.wuffies.japi.Japize.doJapize(Japize.java:443)
     [exec] 	at net.wuffies.japi.Japize.main(Japize.java:316)

     [exec] Failed to Japize javax.swing.Box$Filler$AccessibleBoxFiller: java.lang.ArrayIndexOutOfBoundsException
     [exec] java.lang.ArrayIndexOutOfBoundsException
     [exec] 	at java.util.Arrays.mergeSort(Arrays.java:2453)
     [exec] 	at java.util.Arrays.mergeSort(Arrays.java:2424)
     [exec] 	at java.util.Arrays.sort(Arrays.java:2367)
     [exec] 	at java.util.Arrays.sort(Arrays.java:2326)

...

     [exec] 	at net.wuffies.japi.Japize.processRootSet(Japize.java:471)
     [exec] 	at net.wuffies.japi.Japize.doJapize(Japize.java:443)
     [exec] 	at net.wuffies.japi.Japize.main(Japize.java:316)

     [exec] Failed to Japize javax.swing.BoxLayout: java.lang.ArrayIndexOutOfBoundsException
     [exec] java.lang.ArrayIndexOutOfBoundsException
     [exec] 	at java.util.Arrays.mergeSort(Arrays.java:2453)
     [exec] 	at java.util.Arrays.sort(Arrays.java:2367)
     [exec] 	at java.util.Arrays.sort(Arrays.java:2326)
     [exec] 	at net.wuffies.japi.BoundMemberSet.getCalls(BoundMemberSet.java:46)

...

     [exec] 	at net.wuffies.japi.Japize.processRootSet(Japize.java:471)
     [exec] 	at net.wuffies.japi.Japize.doJapize(Japize.java:443)
     [exec] 	at net.wuffies.japi.Japize.main(Japize.java:316)

     [exec] Failed to Japize javax.swing.ButtonGroup: java.lang.ArrayIndexOutOfBoundsException
     [exec] java.lang.ArrayIndexOutOfBoundsException
     [exec] 	at java.util.Arrays.mergeSort(Arrays.java:2451)
     [exec] 	at java.util.Arrays.sort(Arrays.java:2367)
     [exec] 	at java.util.Arrays.sort(Arrays.java:2326)
     [exec] 	at net.wuffies.japi.BoundMemberSet.getCalls(BoundMemberSet.java:46)

...

     [exec] 	at net.wuffies.japi.Japize.processRootSet(Japize.java:471)
     [exec] 	at net.wuffies.japi.Japize.doJapize(Japize.java:443)
     [exec] 	at net.wuffies.japi.Japize.main(Japize.java:316)

     [exec] Failed to Japize javax.swing.ButtonModel: java.lang.ArrayIndexOutOfBoundsException
     [exec] java.lang.ArrayIndexOutOfBoundsException
     [exec] 	at java.util.Arrays.mergeSort(Arrays.java:2453)
     [exec] 	at java.util.Arrays.mergeSort(Arrays.java:2424)
     [exec] 	at java.util.Arrays.sort(Arrays.java:2367)
     [exec] 	at java.util.Arrays.sort(Arrays.java:2326)

...

     [exec] 	at net.wuffies.japi.Japize.processRootSet(Japize.java:471)
     [exec] 	at net.wuffies.japi.Japize.doJapize(Japize.java:443)
     [exec] 	at net.wuffies.japi.Japize.main(Japize.java:316)
     [exec] +
     [exec] Failed to Japize javax.swing.CellRendererPane: java.lang.ArrayIndexOutOfBoundsException
     [exec] java.lang.ArrayIndexOutOfBoundsException
     [exec] 	at java.util.Arrays.mergeSort(Arrays.java:2453)
     [exec] 	at java.util.Arrays.sort(Arrays.java:2367)
     [exec] 	at java.util.Arrays.sort(Arrays.java:2326)
     [exec] 	at net.wuffies.japi.BoundMemberSet.getFields(BoundMemberSet.java:33)

...

     [exec] 	at net.wuffies.japi.Japize.processRootSet(Japize.java:471)
     [exec] 	at net.wuffies.japi.Japize.doJapize(Japize.java:443)
     [exec] 	at net.wuffies.japi.Japize.main(Japize.java:316)

     [exec] Failed to Japize javax.swing.CellRendererPane$AccessibleCellRendererPane: java.lang.ArrayIndexOutOfBoundsException
     [exec] java.lang.ArrayIndexOutOfBoundsException
     [exec] 	at java.util.Arrays.mergeSort(Arrays.java:2453)
     [exec] 	at java.util.Arrays.mergeSort(Arrays.java:2424)
     [exec] 	at java.util.Arrays.sort(Arrays.java:2367)
     [exec] 	at java.util.Arrays.sort(Arrays.java:2326)

...

     [exec] 	at net.wuffies.japi.Japize.processRootSet(Japize.java:471)
     [exec] 	at net.wuffies.japi.Japize.doJapize(Japize.java:443)
     [exec] 	at net.wuffies.japi.Japize.main(Japize.java:316)
     [exec] ++
     [exec] Failed to Japize javax.swing.ComponentInputMap: java.lang.ArrayIndexOutOfBoundsException
     [exec] java.lang.ArrayIndexOutOfBoundsException
     [exec] 	at java.util.Arrays.mergeSort(Arrays.java:2451)
     [exec] 	at java.util.Arrays.sort(Arrays.java:2367)
     [exec] 	at java.util.Arrays.sort(Arrays.java:2326)
     [exec] 	at net.wuffies.japi.BoundMemberSet.getCalls(BoundMemberSet.java:46)

...

     [exec] 	at net.wuffies.japi.Japize.processRootSet(Japize.java:471)
     [exec] 	at net.wuffies.japi.Japize.doJapize(Japize.java:443)
     [exec] 	at net.wuffies.japi.Japize.main(Japize.java:316)

     [exec] Failed to Japize javax.swing.DebugGraphics: java.lang.ArrayIndexOutOfBoundsException
     [exec] java.lang.ArrayIndexOutOfBoundsException
     [exec] 	at java.util.Arrays.mergeSort(Arrays.java:2451)
     [exec] 	at java.util.Arrays.sort(Arrays.java:2367)
     [exec] 	at java.util.Arrays.sort(Arrays.java:2326)
     [exec] 	at net.wuffies.japi.BoundMemberSet.getCalls(BoundMemberSet.java:46)

...

     [exec] 	at net.wuffies.japi.Japize.processRootSet(Japize.java:471)
     [exec] 	at net.wuffies.japi.Japize.doJapize(Japize.java:443)
     [exec] 	at net.wuffies.japi.Japize.main(Japize.java:316)
     [exec] --------------------------------
     [exec] Failed to Japize javax.swing.DefaultBoundedRangeModel: java.lang.ArrayIndexOutOfBoundsException
     [exec] java.lang.ArrayIndexOutOfBoundsException
     [exec] 	at java.util.Arrays.mergeSort(Arrays.java:2453)
     [exec] 	at java.util.Arrays.sort(Arrays.java:2367)
     [exec] 	at java.util.Arrays.sort(Arrays.java:2326)
     [exec] 	at net.wuffies.japi.BoundMemberSet.getCalls(BoundMemberSet.java:46)

...

     [exec] 	at net.wuffies.japi.Japize.processRootSet(Japize.java:471)
     [exec] 	at net.wuffies.japi.Japize.doJapize(Japize.java:443)
     [exec] 	at net.wuffies.japi.Japize.main(Japize.java:316)

     [exec] Failed to Japize javax.swing.DefaultButtonModel: java.lang.ArrayIndexOutOfBoundsException
     [exec] java.lang.ArrayIndexOutOfBoundsException
     [exec] 	at java.util.Arrays.mergeSort(Arrays.java:2453)
     [exec] 	at java.util.Arrays.mergeSort(Arrays.java:2424)
     [exec] 	at java.util.Arrays.sort(Arrays.java:2367)
     [exec] 	at java.util.Arrays.sort(Arrays.java:2326)

...

     [exec] 	at net.wuffies.japi.Japize.processRootSet(Japize.java:471)
     [exec] 	at net.wuffies.japi.Japize.doJapize(Japize.java:443)
     [exec] 	at net.wuffies.japi.Japize.main(Japize.java:316)

     [exec] Failed to Japize javax.swing.DefaultCellEditor: java.lang.ArrayIndexOutOfBoundsException
     [exec] java.lang.ArrayIndexOutOfBoundsException
     [exec] 	at java.util.Arrays.mergeSort(Arrays.java:2453)
     [exec] 	at java.util.Arrays.sort(Arrays.java:2367)
     [exec] 	at java.util.Arrays.sort(Arrays.java:2326)
     [exec] 	at net.wuffies.japi.BoundMemberSet.getCalls(BoundMemberSet.java:46)

...

     [exec] 	at net.wuffies.japi.Japize.processRootSet(Japize.java:471)
     [exec] 	at net.wuffies.japi.Japize.doJapize(Japize.java:443)
     [exec] 	at net.wuffies.japi.Japize.main(Japize.java:316)
     [exec] ---
     [exec] Failed to Japize javax.swing.DefaultCellEditor$EditorDelegate: java.lang.ArrayIndexOutOfBoundsException
     [exec] java.lang.ArrayIndexOutOfBoundsException
     [exec] 	at java.util.Arrays.mergeSort(Arrays.java:2451)
     [exec] 	at java.util.Arrays.sort(Arrays.java:2367)
     [exec] 	at java.util.Arrays.sort(Arrays.java:2326)
     [exec] 	at net.wuffies.japi.BoundMemberSet.getCalls(BoundMemberSet.java:46)

...

     [exec] 	at net.wuffies.japi.Japize.processRootSet(Japize.java:471)
     [exec] 	at net.wuffies.japi.Japize.doJapize(Japize.java:443)
     [exec] 	at net.wuffies.japi.Japize.main(Japize.java:316)

     [exec] Failed to Japize javax.swing.DefaultComboBoxModel: java.lang.ArrayIndexOutOfBoundsException
     [exec] java.lang.ArrayIndexOutOfBoundsException
     [exec] 	at java.util.Arrays.mergeSort(Arrays.java:2453)
     [exec] 	at java.util.Arrays.sort(Arrays.java:2367)
     [exec] 	at java.util.Arrays.sort(Arrays.java:2326)
     [exec] 	at net.wuffies.japi.BoundMemberSet.getCalls(BoundMemberSet.java:46)

...

     [exec] 	at net.wuffies.japi.Japize.processRootSet(Japize.java:471)
     [exec] 	at net.wuffies.japi.Japize.doJapize(Japize.java:443)
     [exec] 	at net.wuffies.japi.Japize.main(Japize.java:316)

     [exec] Failed to Japize javax.swing.DefaultDesktopManager: java.lang.ArrayIndexOutOfBoundsException
     [exec] java.lang.ArrayIndexOutOfBoundsException
     [exec] 	at java.util.Arrays.mergeSort(Arrays.java:2453)
     [exec] 	at java.util.Arrays.mergeSort(Arrays.java:2425)
     [exec] 	at java.util.Arrays.sort(Arrays.java:2367)
     [exec] 	at java.util.Arrays.sort(Arrays.java:2326)

...

     [exec] 	at net.wuffies.japi.Japize.processRootSet(Japize.java:471)
     [exec] 	at net.wuffies.japi.Japize.doJapize(Japize.java:443)
     [exec] 	at net.wuffies.japi.Japize.main(Japize.java:316)

     [exec] Failed to Japize javax.swing.DefaultFocusManager: java.lang.ArrayIndexOutOfBoundsException
     [exec] java.lang.ArrayIndexOutOfBoundsException
     [exec] 	at java.util.Arrays.mergeSort(Arrays.java:2451)
     [exec] 	at java.util.Arrays.sort(Arrays.java:2367)
     [exec] 	at java.util.Arrays.sort(Arrays.java:2326)
     [exec] 	at net.wuffies.japi.BoundMemberSet.getCalls(BoundMemberSet.java:46)

...

     [exec] 	at net.wuffies.japi.Japize.processRootSet(Japize.java:471)
     [exec] 	at net.wuffies.japi.Japize.doJapize(Japize.java:443)
     [exec] 	at net.wuffies.japi.Japize.main(Japize.java:316)

     [exec] Failed to Japize javax.swing.DefaultListCellRenderer: java.lang.ArrayIndexOutOfBoundsException
     [exec] java.lang.ArrayIndexOutOfBoundsException
     [exec] 	at java.util.Arrays.mergeSort(Arrays.java:2453)
     [exec] 	at java.util.Arrays.mergeSort(Arrays.java:2425)
     [exec] 	at java.util.Arrays.sort(Arrays.java:2367)
     [exec] 	at java.util.Arrays.sort(Arrays.java:2326)

...

     [exec] 	at net.wuffies.japi.Japize.processRootSet(Japize.java:471)
     [exec] 	at net.wuffies.japi.Japize.doJapize(Japize.java:443)
     [exec] 	at net.wuffies.japi.Japize.main(Japize.java:316)

     [exec] Failed to Japize javax.swing.DefaultListCellRenderer$UIResource: java.lang.ArrayIndexOutOfBoundsException
     [exec] java.lang.ArrayIndexOutOfBoundsException
     [exec] 	at java.util.Arrays.mergeSort(Arrays.java:2453)
     [exec] 	at java.util.Arrays.mergeSort(Arrays.java:2425)
     [exec] 	at java.util.Arrays.sort(Arrays.java:2367)
     [exec] 	at java.util.Arrays.sort(Arrays.java:2326)

...

     [exec] 	at net.wuffies.japi.Japize.processRootSet(Japize.java:471)
     [exec] 	at net.wuffies.japi.Japize.doJapize(Japize.java:443)
     [exec] 	at net.wuffies.japi.Japize.main(Japize.java:316)

     [exec] Failed to Japize javax.swing.DefaultListModel: java.lang.ArrayIndexOutOfBoundsException
     [exec] java.lang.ArrayIndexOutOfBoundsException
     [exec] 	at java.util.Arrays.mergeSort(Arrays.java:2451)
     [exec] 	at java.util.Arrays.sort(Arrays.java:2367)
     [exec] 	at java.util.Arrays.sort(Arrays.java:2326)
     [exec] 	at net.wuffies.japi.BoundMemberSet.getCalls(BoundMemberSet.java:46)

...

     [exec] 	at net.wuffies.japi.Japize.processRootSet(Japize.java:471)
     [exec] 	at net.wuffies.japi.Japize.doJapize(Japize.java:443)
     [exec] 	at net.wuffies.japi.Japize.main(Japize.java:316)

     [exec] Failed to Japize javax.swing.DefaultListSelectionModel: java.lang.ArrayIndexOutOfBoundsException
     [exec] java.lang.ArrayIndexOutOfBoundsException
     [exec] 	at java.util.Arrays.mergeSort(Arrays.java:2453)
     [exec] 	at java.util.Arrays.mergeSort(Arrays.java:2424)
     [exec] 	at java.util.Arrays.sort(Arrays.java:2367)
     [exec] 	at java.util.Arrays.sort(Arrays.java:2326)

...

     [exec] 	at net.wuffies.japi.Japize.processRootSet(Japize.java:471)
     [exec] 	at net.wuffies.japi.Japize.doJapize(Japize.java:443)
     [exec] 	at net.wuffies.japi.Japize.main(Japize.java:316)
     [exec] --
     [exec] Failed to Japize javax.swing.DefaultSingleSelectionModel: java.lang.ArrayIndexOutOfBoundsException
     [exec] java.lang.ArrayIndexOutOfBoundsException
     [exec] 	at java.util.Arrays.mergeSort(Arrays.java:2451)
     [exec] 	at java.util.Arrays.sort(Arrays.java:2367)
     [exec] 	at java.util.Arrays.sort(Arrays.java:2326)
     [exec] 	at net.wuffies.japi.BoundMemberSet.getCalls(BoundMemberSet.java:46)

...

     [exec] 	at net.wuffies.japi.Japize.processRootSet(Japize.java:471)
     [exec] 	at net.wuffies.japi.Japize.doJapize(Japize.java:443)
     [exec] 	at net.wuffies.japi.Japize.main(Japize.java:316)

     [exec] Failed to Japize javax.swing.DesktopManager: java.lang.ArrayIndexOutOfBoundsException
     [exec] java.lang.ArrayIndexOutOfBoundsException
     [exec] 	at java.util.Arrays.mergeSort(Arrays.java:2453)
     [exec] 	at java.util.Arrays.mergeSort(Arrays.java:2425)
     [exec] 	at java.util.Arrays.sort(Arrays.java:2367)
     [exec] 	at java.util.Arrays.sort(Arrays.java:2326)

...

     [exec] 	at net.wuffies.japi.Japize.processRootSet(Japize.java:471)
     [exec] 	at net.wuffies.japi.Japize.doJapize(Japize.java:443)
     [exec] 	at net.wuffies.japi.Japize.main(Japize.java:316)

     [exec] Failed to Japize javax.swing.FocusManager: java.lang.ArrayIndexOutOfBoundsException
     [exec] java.lang.ArrayIndexOutOfBoundsException
     [exec] 	at java.util.Arrays.mergeSort(Arrays.java:2451)
     [exec] 	at java.util.Arrays.sort(Arrays.java:2367)
     [exec] 	at java.util.Arrays.sort(Arrays.java:2326)
     [exec] 	at net.wuffies.japi.BoundMemberSet.getCalls(BoundMemberSet.java:46)

...

     [exec] 	at net.wuffies.japi.Japize.processRootSet(Japize.java:471)
     [exec] 	at net.wuffies.japi.Japize.doJapize(Japize.java:443)
     [exec] 	at net.wuffies.japi.Japize.main(Japize.java:316)

     [exec] Failed to Japize javax.swing.GrayFilter: java.lang.ArrayIndexOutOfBoundsException
     [exec] java.lang.ArrayIndexOutOfBoundsException
     [exec] 	at java.util.Arrays.mergeSort(Arrays.java:2453)
     [exec] 	at java.util.Arrays.sort(Arrays.java:2367)
     [exec] 	at java.util.Arrays.sort(Arrays.java:2326)
     [exec] 	at net.wuffies.japi.BoundMemberSet.getFields(BoundMemberSet.java:33)

...

     [exec] 	at net.wuffies.japi.Japize.processRootSet(Japize.java:471)
     [exec] 	at net.wuffies.japi.Japize.doJapize(Japize.java:443)
     [exec] 	at net.wuffies.japi.Japize.main(Japize.java:316)
     [exec] ---+
     [exec] Failed to Japize javax.swing.ImageIcon: java.lang.ArrayIndexOutOfBoundsException
     [exec] java.lang.ArrayIndexOutOfBoundsException
     [exec] 	at java.util.Arrays.mergeSort(Arrays.java:2451)
     [exec] 	at java.util.Arrays.sort(Arrays.java:2367)
     [exec] 	at java.util.Arrays.sort(Arrays.java:2326)
     [exec] 	at net.wuffies.japi.BoundMemberSet.getCalls(BoundMemberSet.java:46)

...

     [exec] 	at net.wuffies.japi.Japize.processRootSet(Japize.java:471)
     [exec] 	at net.wuffies.japi.Japize.doJapize(Japize.java:443)
     [exec] 	at net.wuffies.japi.Japize.main(Japize.java:316)

     [exec] Failed to Japize javax.swing.ImageIcon$AccessibleImageIcon: java.lang.ArrayIndexOutOfBoundsException
     [exec] java.lang.ArrayIndexOutOfBoundsException
     [exec] 	at java.util.Arrays.mergeSort(Arrays.java:2451)
     [exec] 	at java.util.Arrays.sort(Arrays.java:2367)
     [exec] 	at java.util.Arrays.sort(Arrays.java:2326)
     [exec] 	at net.wuffies.japi.BoundMemberSet.getCalls(BoundMemberSet.java:46)

...

     [exec] 	at net.wuffies.japi.Japize.processRootSet(Japize.java:471)
     [exec] 	at net.wuffies.japi.Japize.doJapize(Japize.java:443)
     [exec] 	at net.wuffies.japi.Japize.main(Japize.java:316)

     [exec] Failed to Japize javax.swing.InputMap: java.lang.ArrayIndexOutOfBoundsException
     [exec] java.lang.ArrayIndexOutOfBoundsException
     [exec] 	at java.util.Arrays.mergeSort(Arrays.java:2451)
     [exec] 	at java.util.Arrays.sort(Arrays.java:2367)
     [exec] 	at java.util.Arrays.sort(Arrays.java:2326)
     [exec] 	at net.wuffies.japi.BoundMemberSet.getCalls(BoundMemberSet.java:46)

...

     [exec] 	at net.wuffies.japi.Japize.processRootSet(Japize.java:471)
     [exec] 	at net.wuffies.japi.Japize.doJapize(Japize.java:443)
     [exec] 	at net.wuffies.japi.Japize.main(Japize.java:316)

     [exec] Failed to Japize javax.swing.InputVerifier: java.lang.ArrayIndexOutOfBoundsException
     [exec] java.lang.ArrayIndexOutOfBoundsException
     [exec] 	at java.util.Arrays.mergeSort(Arrays.java:2451)
     [exec] 	at java.util.Arrays.sort(Arrays.java:2367)
     [exec] 	at java.util.Arrays.sort(Arrays.java:2326)
     [exec] 	at net.wuffies.japi.BoundMemberSet.getCalls(BoundMemberSet.java:46)

...

     [exec] 	at net.wuffies.japi.Japize.processRootSet(Japize.java:471)
     [exec] 	at net.wuffies.japi.Japize.doJapize(Japize.java:443)
     [exec] 	at net.wuffies.japi.Japize.main(Japize.java:316)

     [exec] Failed to Japize javax.swing.InternalFrameFocusTraversalPolicy: java.lang.ArrayIndexOutOfBoundsException
     [exec] java.lang.ArrayIndexOutOfBoundsException
     [exec] 	at java.util.Arrays.mergeSort(Arrays.java:2451)
     [exec] 	at java.util.Arrays.sort(Arrays.java:2367)
     [exec] 	at java.util.Arrays.sort(Arrays.java:2326)
     [exec] 	at net.wuffies.japi.BoundMemberSet.getCalls(BoundMemberSet.java:46)

...

update-index:

test-result:

BUILD FAILED
/home/hybld/continuum-working-directory/6/build.xml:205: There were test errors.

Total time: 74 minutes 40 seconds

****************************************************************************

...

Mime
View raw message