harmony-alerts mailing list archives

Site index · List index
Message view « Date » · « Thread »
Top « Date » · « Thread »
From nom...@hursley.ibm.com
Subject [continuum] BUILD FAILURE: Java6 Classlib/linux.ia32 Build/Test
Date Fri, 06 Jul 2007 06:48:51 GMT
Online report : http://people.apache.org/~hindessm/continuum/java6_classlib/linux.ia32_build/test/2007/07/06/20070706-064851.failure.log.gz
Build statistics:
  State: Failed
  Previous State: Failed
  Started at: Fri, 6 Jul 2007 06:28:35 +0100
  Finished at: Fri, 6 Jul 2007 07:48:51 +0100
  Total time: 1h 20m 15s
  Build Trigger: Schedule
  Exit code: 1
  Building machine hostname: hy2
  Operating system : Linux(unknown)
  Java version : 1.5.0_06(Sun Microsystems Inc.)

Changes
                            classlib/modules/beans/src/test/java/org/apache/harmony/beans/tests/java/beans/beancontext/BeanContextSupportTest.java
            classlib/modules/beans/src/test/java/org/apache/harmony/beans/tests/java/beans/beancontext/BeanContextServicesSupportTest.java
            classlib/modules/beans/src/test/java/org/apache/harmony/beans/tests/java/beans/beancontext/BeanContextEventTest.java
            classlib/modules/beans/src/main/java/java/beans/beancontext/BeanContextSupport.java
            classlib/modules/beans/src/main/java/java/beans/beancontext/BeanContextServicesSupport.java
            classlib/modules/awt/src/main/java/common/java/awt/ToolkitImpl.java
            classlib/modules/awt/src/main/java/common/org/apache/harmony/awt/gl/CommonGraphics2DFactory.java
            classlib/modules/awt/src/main/java/common/org/apache/harmony/awt/wtk/GraphicsFactory.java
            classlib/modules/awt/make/exclude.linux.x86_64.drl
            classlib/modules/sql/META-INF/MANIFEST.MF
            classlib/modules/sql/src/test/java/org/apache/harmony/sql/tests/java/sql/DriverManagerTest.java
            classlib/modules/sql/src/main/java/java/sql/DriverManager.java
            classlib/modules/luni/.classpath
            classlib/modules/luni/src/test/api/common/tests/api/java/io/ByteArrayOutputStreamTest.java
            classlib/modules/luni/src/test/api/common/tests/api/java/io/SerializationStressTest2.java
            classlib/modules/luni/src/test/api/common/tests/api/java/io/PipedInputStreamTest.java
            classlib/modules/luni/src/test/api/common/tests/api/java/io/InputStreamReaderTest.java
            classlib/modules/luni/src/test/api/common/tests/api/java/io/ObjectOutputStreamTest.java
            classlib/modules/luni/src/test/api/common/tests/api/java/io/SerializationStressTest3.java
            classlib/modules/luni/src/test/api/common/tests/api/java/io/SequenceInputStreamTest.java
            classlib/modules/luni/src/test/api/common/tests/api/java/io/ObjectInputStreamTest.java
            classlib/modules/luni/src/test/api/common/tests/api/java/io/SerializationStressTest4.java
            classlib/modules/luni/src/test/api/common/tests/api/java/io/SerializationStressTest.java
            classlib/modules/luni/src/test/api/common/tests/api/java/io/LineNumberReaderTest.java
            classlib/modules/luni/src/test/api/common/tests/api/java/io/StreamTokenizerTest.java
            classlib/modules/luni/src/test/api/common/tests/api/java/io/ObjectStreamFieldTest.java
            classlib/modules/luni/src/test/api/common/tests/api/java/io/LineNumberInputStreamTest.java
            classlib/modules/luni/src/test/api/common/tests/api/java/io/PipedOutputStreamTest.java
            classlib/modules/luni/src/test/api/common/tests/api/java/io/SerializationStressTest1.java
            classlib/modules/luni/src/test/api/common/tests/api/java/io/DataInputStreamTest.java
            classlib/modules/luni/src/test/api/common/tests/api/java/io/SerializationStressTest5.java
            classlib/modules/luni/src/test/api/common/tests/api/java/io/NotActiveExceptionTest.java
            classlib/modules/luni/src/test/api/common/tests/api/java/io/StringBufferInputStreamTest.java
            classlib/modules/luni/src/test/api/common/org/apache/harmony/luni/tests/java/io/ObjectInputStreamTest.java
            classlib/modules/luni/src/main/java/java/io/LineNumberReader.java
            classlib/modules/luni/src/main/java/java/io/InputStream.java
            classlib/modules/luni/src/main/java/java/io/OutputStream.java
        
****************************************************************************
Output:
****************************************************************************
Buildfile: build.xml

svn-prop:

build:
   [delete] Deleting directory /home/hybld/continuum-working-directory/22/classlib/deploy
     [echo] Classlib revision is 553738
     [echo] Post process: true
     [echo] JAPI: true
     [echo] Building with reference jdk/javac
     [exec] Buildfile: build.xml

     [exec] -init-hdk-for-clean:
     [exec]     [mkdir] Created dir: /home/hybld/continuum-working-directory/22/classlib/deploy/build/ant
     [exec]      [copy] Copying 1 file to /home/hybld/continuum-working-directory/22/classlib/deploy/build/ant

     [exec] clean-java:

     [exec] -modules-clean-bin:

     [exec] clean:
     [exec]    [delete] Deleting 30 files from /home/hybld/continuum-working-directory/22/classlib/build/classes
     [exec]    [delete] Deleting 12 files from /home/hybld/continuum-working-directory/22/classlib/modules/accessibility/bin/test

     [exec] clean:
     [exec]    [delete] Deleting 13 files from /home/hybld/continuum-working-directory/22/classlib/build/classes
     [exec]    [delete] Deleting 5 files from /home/hybld/continuum-working-directory/22/classlib/modules/annotation/bin/test

     [exec] clean:
     [exec]    [delete] Deleting 35 files from /home/hybld/continuum-working-directory/22/classlib/build/classes
     [exec]    [delete] Deleting 1 files from /home/hybld/continuum-working-directory/22/classlib/modules/applet/bin/test

     [exec] clean:
     [exec]    [delete] Deleting 45 files from /home/hybld/continuum-working-directory/22/classlib/build/classes
     [exec]    [delete] Deleting 40 files from /home/hybld/continuum-working-directory/22/classlib/modules/archive/bin/test

     [exec] clean-native-includes:
     [exec]    [delete] /home/hybld/continuum-working-directory/22/classlib/deploy/include
not found.

     [exec] clean:
     [exec]    [delete] Deleting 113 files from /home/hybld/continuum-working-directory/22/classlib/build/classes
     [exec]    [delete] Deleting 226 files from /home/hybld/continuum-working-directory/22/classlib/modules/auth/bin/test

     [exec] clean:
     [exec]    [delete] Deleting 922 files from /home/hybld/continuum-working-directory/22/classlib/build/classes
     [exec]    [delete] Deleting 540 files from /home/hybld/continuum-working-directory/22/classlib/modules/awt/bin/test

     [exec] clean:
     [exec]    [delete] Deleting 108 files from /home/hybld/continuum-working-directory/22/classlib/build/classes
     [exec]    [delete] Deleting 262 files from /home/hybld/continuum-working-directory/22/classlib/modules/beans/bin/test

     [exec] clean:
     [exec]    [delete] Deleting 125 files from /home/hybld/continuum-working-directory/22/classlib/build/classes
     [exec]    [delete] /home/hybld/continuum-working-directory/22/classlib/modules/concurrent/bin/test
not found.

     [exec] clean:
     [exec]    [delete] Deleting 48 files from /home/hybld/continuum-working-directory/22/classlib/build/classes
     [exec]    [delete] Deleting 90 files from /home/hybld/continuum-working-directory/22/classlib/modules/crypto/bin/test

     [exec] clean:
     [exec]    [delete] Deleting 93 files from /home/hybld/continuum-working-directory/22/classlib/build/classes
     [exec]    [delete] Deleting 3 files from /home/hybld/continuum-working-directory/22/classlib/modules/imageio/bin/test

     [exec] clean:
     [exec]    [delete] Deleting 9 files from /home/hybld/continuum-working-directory/22/classlib/build/classes
     [exec]    [delete] Deleting 20 files from /home/hybld/continuum-working-directory/22/classlib/modules/instrument/bin/test

     [exec] clean:
     [exec]    [delete] Deleting 176 files from /home/hybld/continuum-working-directory/22/classlib/build/classes
     [exec]    [delete] Deleting 198 files from /home/hybld/continuum-working-directory/22/classlib/modules/jndi/bin/test

     [exec] clean:
     [exec]    [delete] Deleting 43 files from /home/hybld/continuum-working-directory/22/classlib/build/classes
     [exec]    [delete] Deleting 18 files from /home/hybld/continuum-working-directory/22/classlib/modules/lang-management/bin/api
     [exec]    [delete] Deleting 16 files from /home/hybld/continuum-working-directory/22/classlib/modules/lang-management/bin/impl

     [exec] clean:
     [exec]    [delete] Deleting 34 files from /home/hybld/continuum-working-directory/22/classlib/build/classes
     [exec]    [delete] Deleting 100 files from /home/hybld/continuum-working-directory/22/classlib/modules/logging/bin/test

     [exec] clean:
     [exec]    [delete] Deleting 1021 files from /home/hybld/continuum-working-directory/22/classlib/build/classes
     [exec]    [delete] Deleting 1010 files from /home/hybld/continuum-working-directory/22/classlib/modules/luni/bin/test

     [exec] clean-native-includes:
     [exec]    [delete] /home/hybld/continuum-working-directory/22/classlib/deploy/include
not found.
     [exec]    [delete] /home/hybld/continuum-working-directory/22/classlib/deploy/jdk/include
not found.

     [exec] clean:
     [exec]    [delete] Deleting 29 files from /home/hybld/continuum-working-directory/22/classlib/build/classes

     [exec] clean:
     [exec]    [delete] Deleting 14 files from /home/hybld/continuum-working-directory/22/classlib/build/classes
     [exec]    [delete] Deleting 25 files from /home/hybld/continuum-working-directory/22/classlib/modules/math/bin/test

     [exec] clean:
     [exec]    [delete] Deleting 14 files from /home/hybld/continuum-working-directory/22/classlib/build/classes
     [exec]    [delete] Deleting 1 files from /home/hybld/continuum-working-directory/22/classlib/modules/misc/bin/test

     [exec] clean:
     [exec]    [delete] Deleting 142 files from /home/hybld/continuum-working-directory/22/classlib/build/classes
     [exec]    [delete] Deleted 5 directories from /home/hybld/continuum-working-directory/22/classlib/build/classes
     [exec]    [delete] Deleting 157 files from /home/hybld/continuum-working-directory/22/classlib/modules/nio/bin/test

...

     [exec]     [javac] ----------
     [exec]     [javac] 1. WARNING in /home/hybld/continuum-working-directory/22/classlib/modules/annotation/src/test/java/org/apache/harmony/annotation/tests/java/lang/annotation/IncompleteAnnotationExceptionTest.java
     [exec]     [javac]  (at line 53)
     [exec]     [javac] 	clazz, elementName);
     [exec]     [javac] 	^^^^^
     [exec]     [javac] Type safety: The expression of type Class needs unchecked conversion
to conform to Class<? extends Annotation>
     [exec]     [javac] ----------
     [exec]     [javac] 1 problem (1 warning)

     [exec] prepare-exclude:

...

     [exec]     [junit] Tests run: 21, Failures: 0, Errors: 0, Time elapsed: 0.192 sec
     [exec]     [junit] Tests run: 13, Failures: 0, Errors: 0, Time elapsed: 0.032 sec
     [exec]     [junit] Tests run: 2, Failures: 0, Errors: 0, Time elapsed: 0.003 sec
     [exec]     [junit] Tests run: 20, Failures: 1, Errors: 0, Time elapsed: 20.631 sec
     [exec]     [junit] TEST tests.api.java.net.MulticastSocketTest FAILED
     [exec]     [junit] Tests run: 2, Failures: 0, Errors: 0, Time elapsed: 0.003 sec
     [exec]     [junit] Tests run: 13, Failures: 0, Errors: 0, Time elapsed: 0.345 sec
     [exec]     [junit] Tests run: 2, Failures: 0, Errors: 0, Time elapsed: 0.003 sec
     [exec]     [junit] Tests run: 3, Failures: 0, Errors: 0, Time elapsed: 0.003 sec
     [exec]     [junit] Tests run: 2, Failures: 0, Errors: 0, Time elapsed: 0.004 sec

...

     [exec]     [junit] Tests run: 20, Failures: 0, Errors: 0, Time elapsed: 0.049 sec
     [exec]     [junit] Tests run: 48, Failures: 0, Errors: 0, Time elapsed: 0.238 sec
     [exec]     [junit] Tests run: 17, Failures: 0, Errors: 0, Time elapsed: 0.421 sec
     [exec]     [junit] Tests run: 3, Failures: 0, Errors: 0, Time elapsed: 0.006 sec
     [exec]     [junit] Tests FAILED

     [exec] touch-failures-file:

     [exec] touch-errors-file:


...

     [exec]     [junit] org.apache.harmony.rmi.test.MyException: MyRemoteObject.test_Exception
     [exec]     [junit] Done.

     [exec]     [junit] Testing test_Error...
     [exec]     [junit] java.rmi.ServerError: Error occurred while remote method invocation;
nested exception is:
     [exec]     [junit] 	java.lang.Error: MyRemoteObject.test_Error
     [exec]     [junit] Done.

     [exec]     [junit] Testing test_RuntimeException...
     [exec]     [junit] java.lang.RuntimeException: MyRemoteObject.text_RuntimeException
     [exec]     [junit] Done.

...

     [exec]     [junit] org.apache.harmony.rmi.test.MyException: MyRemoteObject.test_Exception
     [exec]     [junit] Done.

     [exec]     [junit] Testing test_Error...
     [exec]     [junit] java.rmi.ServerError: Error occurred while remote method invocation;
nested exception is:
     [exec]     [junit] 	java.lang.Error: MyRemoteObject.test_Error
     [exec]     [junit] Done.

     [exec]     [junit] Testing test_RuntimeException...
     [exec]     [junit] java.lang.RuntimeException: MyRemoteObject.text_RuntimeException
     [exec]     [junit] Done.

...

     [exec] gen-report:

     [exec] check-test-result:

     [exec] BUILD FAILED
     [exec] /home/hybld/continuum-working-directory/22/classlib/build.xml:169: The following
error occurred while executing this line:
     [exec] /home/hybld/continuum-working-directory/22/classlib/make/build-test.xml:148: There
were test failures.

     [exec] Total time: 59 minutes 4 seconds
     [exec] Result: 1
     [echo] Tests.failed is set to true

japi:

     [exec] Processing class java.lang,Object:+
     [exec] Processing package java.lang,:===============================================================================+-+++++++++++-+++++++++++++-+++++++++++++++++-+++++-+++++++++++++++++++++++-++++--^+^+++++++++--++++++++++

...

     [exec] Processing package java.lang.management,:===============================================================================++++-+++++++++++
     [exec] Processing package java.lang.ref,:===============================================================================+++++
     [exec] Processing package java.lang.reflect,:===============================================================================+++++++++++++++++++++
     [exec] Processing class ,java:
     [exec] Failed to Japize java: java.lang.RuntimeException: NoClassDefFoundError: java
     [exec] java.lang.RuntimeException: NoClassDefFoundError: java
     [exec] 	at net.wuffies.japi.ClassFile.forName(ClassFile.java:1626)
     [exec] 	at net.wuffies.japi.Japize.getClassWrapper(Japize.java:1425)
     [exec] 	at net.wuffies.japi.Japize.japizeClass(Japize.java:748)
     [exec] 	at net.wuffies.japi.Japize.processClass(Japize.java:516)

...

     [exec] 	at net.wuffies.japi.Japize.doJapize(Japize.java:443)
     [exec] 	at net.wuffies.japi.Japize.main(Japize.java:316)

     [exec] Processing class ,javax:
     [exec] Failed to Japize javax: java.lang.RuntimeException: NoClassDefFoundError: javax
     [exec] java.lang.RuntimeException: NoClassDefFoundError: javax
     [exec] 	at net.wuffies.japi.ClassFile.forName(ClassFile.java:1626)
     [exec] 	at net.wuffies.japi.Japize.getClassWrapper(Japize.java:1425)
     [exec] 	at net.wuffies.japi.Japize.japizeClass(Japize.java:748)
     [exec] 	at net.wuffies.japi.Japize.processClass(Japize.java:516)

...

     [exec] 	at net.wuffies.japi.Japize.doJapize(Japize.java:443)
     [exec] 	at net.wuffies.japi.Japize.main(Japize.java:316)

     [exec] Processing class ,org:
     [exec] Failed to Japize org: java.lang.RuntimeException: NoClassDefFoundError: org
     [exec] java.lang.RuntimeException: NoClassDefFoundError: org
     [exec] 	at net.wuffies.japi.ClassFile.forName(ClassFile.java:1626)
     [exec] 	at net.wuffies.japi.Japize.getClassWrapper(Japize.java:1425)
     [exec] 	at net.wuffies.japi.Japize.japizeClass(Japize.java:748)
     [exec] 	at net.wuffies.japi.Japize.processClass(Japize.java:516)

...

     [exec] Processing package javax.sql.rowset,:===============================================================================++++++++-+-+
     [exec] Processing package javax.sql.rowset.serial,:===============================================================================+++++++++++
     [exec] Processing package javax.sql.rowset.spi,:===============================================================================-++++++++
     [exec] Processing package javax.swing,:===============================================================================++--+-++++++--++++++++++++++++--------------------------------+++---++++
     [exec] Failed to Japize javax.swing.DefaultListCellRenderer: java.lang.ArrayIndexOutOfBoundsException
     [exec] java.lang.ArrayIndexOutOfBoundsException
     [exec] 	at java.util.Arrays.mergeSort(Arrays.java:2728)
     [exec] 	at java.util.Arrays.mergeSort(Arrays.java:270)
     [exec] 	at java.util.Arrays.sort(Arrays.java:2642)
     [exec] 	at java.util.Arrays.sort(Arrays.java:261)

...

     [exec] 	at net.wuffies.japi.Japize.processRootSet(Japize.java:471)
     [exec] 	at net.wuffies.japi.Japize.doJapize(Japize.java:443)
     [exec] 	at net.wuffies.japi.Japize.main(Japize.java:316)

     [exec] Failed to Japize javax.swing.DefaultListCellRenderer$UIResource: java.lang.ArrayIndexOutOfBoundsException
     [exec] java.lang.ArrayIndexOutOfBoundsException
     [exec] 	at java.util.Arrays.mergeSort(Arrays.java:2728)
     [exec] 	at java.util.Arrays.mergeSort(Arrays.java:270)
     [exec] 	at java.util.Arrays.sort(Arrays.java:2642)
     [exec] 	at java.util.Arrays.sort(Arrays.java:261)

...

     [exec] 	at net.wuffies.japi.Japize.processRootSet(Japize.java:471)
     [exec] 	at net.wuffies.japi.Japize.doJapize(Japize.java:443)
     [exec] 	at net.wuffies.japi.Japize.main(Japize.java:316)

     [exec] Failed to Japize javax.swing.DefaultListModel: java.lang.ArrayIndexOutOfBoundsException
     [exec] java.lang.ArrayIndexOutOfBoundsException
     [exec] 	at java.util.Arrays.mergeSort(Arrays.java:2726)
     [exec] 	at java.util.Arrays.sort(Arrays.java:2642)
     [exec] 	at java.util.Arrays.sort(Arrays.java:261)
     [exec] 	at net.wuffies.japi.BoundMemberSet.getCalls(BoundMemberSet.java:46)

...

     [exec] 	at net.wuffies.japi.Japize.processRootSet(Japize.java:471)
     [exec] 	at net.wuffies.japi.Japize.doJapize(Japize.java:443)
     [exec] 	at net.wuffies.japi.Japize.main(Japize.java:316)

     [exec] Failed to Japize javax.swing.DefaultListSelectionModel: java.lang.ArrayIndexOutOfBoundsException
     [exec] java.lang.ArrayIndexOutOfBoundsException
     [exec] 	at java.util.Arrays.mergeSort(Arrays.java:2728)
     [exec] 	at java.util.Arrays.mergeSort(Arrays.java:2699)
     [exec] 	at java.util.Arrays.sort(Arrays.java:2642)
     [exec] 	at java.util.Arrays.sort(Arrays.java:261)

...

     [exec] 	at net.wuffies.japi.Japize.processRootSet(Japize.java:471)
     [exec] 	at net.wuffies.japi.Japize.doJapize(Japize.java:443)
     [exec] 	at net.wuffies.japi.Japize.main(Japize.java:316)
     [exec] --
     [exec] Failed to Japize javax.swing.DefaultSingleSelectionModel: java.lang.ArrayIndexOutOfBoundsException
     [exec] java.lang.ArrayIndexOutOfBoundsException
     [exec] 	at java.util.Arrays.mergeSort(Arrays.java:2726)
     [exec] 	at java.util.Arrays.sort(Arrays.java:2642)
     [exec] 	at java.util.Arrays.sort(Arrays.java:261)
     [exec] 	at net.wuffies.japi.BoundMemberSet.getCalls(BoundMemberSet.java:46)

...

     [exec] 	at net.wuffies.japi.Japize.processRootSet(Japize.java:471)
     [exec] 	at net.wuffies.japi.Japize.doJapize(Japize.java:443)
     [exec] 	at net.wuffies.japi.Japize.main(Japize.java:316)

     [exec] Failed to Japize javax.swing.DesktopManager: java.lang.ArrayIndexOutOfBoundsException
     [exec] java.lang.ArrayIndexOutOfBoundsException
     [exec] 	at java.util.Arrays.mergeSort(Arrays.java:2728)
     [exec] 	at java.util.Arrays.sort(Arrays.java:2642)
     [exec] 	at java.util.Arrays.sort(Arrays.java:261)
     [exec] 	at net.wuffies.japi.BoundMemberSet.getCalls(BoundMemberSet.java:46)

...

     [exec] 	at net.wuffies.japi.Japize.processRootSet(Japize.java:471)
     [exec] 	at net.wuffies.japi.Japize.doJapize(Japize.java:443)
     [exec] 	at net.wuffies.japi.Japize.main(Japize.java:316)

     [exec] Failed to Japize javax.swing.FocusManager: java.lang.ArrayIndexOutOfBoundsException
     [exec] java.lang.ArrayIndexOutOfBoundsException
     [exec] 	at java.util.Arrays.mergeSort(Arrays.java:2726)
     [exec] 	at java.util.Arrays.sort(Arrays.java:2642)
     [exec] 	at java.util.Arrays.sort(Arrays.java:261)
     [exec] 	at net.wuffies.japi.BoundMemberSet.getCalls(BoundMemberSet.java:46)

...

     [exec] 	at net.wuffies.japi.Japize.processRootSet(Japize.java:471)
     [exec] 	at net.wuffies.japi.Japize.doJapize(Japize.java:443)
     [exec] 	at net.wuffies.japi.Japize.main(Japize.java:316)

     [exec] Failed to Japize javax.swing.GrayFilter: java.lang.ArrayIndexOutOfBoundsException
     [exec] java.lang.ArrayIndexOutOfBoundsException
     [exec] 	at java.util.Arrays.mergeSort(Arrays.java:2728)
     [exec] 	at java.util.Arrays.sort(Arrays.java:2642)
     [exec] 	at java.util.Arrays.sort(Arrays.java:261)
     [exec] 	at net.wuffies.japi.BoundMemberSet.getFields(BoundMemberSet.java:33)

...

     [exec] 	at net.wuffies.japi.Japize.processRootSet(Japize.java:471)
     [exec] 	at net.wuffies.japi.Japize.doJapize(Japize.java:443)
     [exec] 	at net.wuffies.japi.Japize.main(Japize.java:316)
     [exec] ---+
     [exec] Failed to Japize javax.swing.ImageIcon: java.lang.ArrayIndexOutOfBoundsException
     [exec] java.lang.ArrayIndexOutOfBoundsException
     [exec] 	at java.util.Arrays.mergeSort(Arrays.java:2726)
     [exec] 	at java.util.Arrays.sort(Arrays.java:2642)
     [exec] 	at java.util.Arrays.sort(Arrays.java:261)
     [exec] 	at net.wuffies.japi.BoundMemberSet.getCalls(BoundMemberSet.java:46)

...

     [exec] 	at net.wuffies.japi.Japize.processRootSet(Japize.java:471)
     [exec] 	at net.wuffies.japi.Japize.doJapize(Japize.java:443)
     [exec] 	at net.wuffies.japi.Japize.main(Japize.java:316)

     [exec] Failed to Japize javax.swing.ImageIcon$AccessibleImageIcon: java.lang.ArrayIndexOutOfBoundsException
     [exec] java.lang.ArrayIndexOutOfBoundsException
     [exec] 	at java.util.Arrays.mergeSort(Arrays.java:2726)
     [exec] 	at java.util.Arrays.sort(Arrays.java:2642)
     [exec] 	at java.util.Arrays.sort(Arrays.java:261)
     [exec] 	at net.wuffies.japi.BoundMemberSet.getCalls(BoundMemberSet.java:46)

...

     [exec] 	at net.wuffies.japi.Japize.processRootSet(Japize.java:471)
     [exec] 	at net.wuffies.japi.Japize.doJapize(Japize.java:443)
     [exec] 	at net.wuffies.japi.Japize.main(Japize.java:316)

     [exec] Failed to Japize javax.swing.InputMap: java.lang.ArrayIndexOutOfBoundsException
     [exec] java.lang.ArrayIndexOutOfBoundsException
     [exec] 	at java.util.Arrays.mergeSort(Arrays.java:2726)
     [exec] 	at java.util.Arrays.sort(Arrays.java:2642)
     [exec] 	at java.util.Arrays.sort(Arrays.java:261)
     [exec] 	at net.wuffies.japi.BoundMemberSet.getCalls(BoundMemberSet.java:46)

...

     [exec] 	at net.wuffies.japi.Japize.processRootSet(Japize.java:471)
     [exec] 	at net.wuffies.japi.Japize.doJapize(Japize.java:443)
     [exec] 	at net.wuffies.japi.Japize.main(Japize.java:316)

     [exec] Failed to Japize javax.swing.InputVerifier: java.lang.ArrayIndexOutOfBoundsException
     [exec] java.lang.ArrayIndexOutOfBoundsException
     [exec] 	at java.util.Arrays.mergeSort(Arrays.java:2726)
     [exec] 	at java.util.Arrays.sort(Arrays.java:2642)
     [exec] 	at java.util.Arrays.sort(Arrays.java:261)
     [exec] 	at net.wuffies.japi.BoundMemberSet.getCalls(BoundMemberSet.java:46)

...

     [exec] 	at net.wuffies.japi.Japize.processRootSet(Japize.java:471)
     [exec] 	at net.wuffies.japi.Japize.doJapize(Japize.java:443)
     [exec] 	at net.wuffies.japi.Japize.main(Japize.java:316)

     [exec] Failed to Japize javax.swing.InternalFrameFocusTraversalPolicy: java.lang.ArrayIndexOutOfBoundsException
     [exec] java.lang.ArrayIndexOutOfBoundsException
     [exec] 	at java.util.Arrays.mergeSort(Arrays.java:2726)
     [exec] 	at java.util.Arrays.sort(Arrays.java:2642)
     [exec] 	at java.util.Arrays.sort(Arrays.java:261)
     [exec] 	at net.wuffies.japi.BoundMemberSet.getCalls(BoundMemberSet.java:46)

...

     [exec] 	at net.wuffies.japi.Japize.processRootSet(Japize.java:471)
     [exec] 	at net.wuffies.japi.Japize.doJapize(Japize.java:443)
     [exec] 	at net.wuffies.japi.Japize.main(Japize.java:316)

     [exec] Failed to Japize javax.swing.JApplet: java.lang.ArrayIndexOutOfBoundsException
     [exec] java.lang.ArrayIndexOutOfBoundsException
     [exec] 	at java.util.Arrays.mergeSort(Arrays.java:2728)
     [exec] 	at java.util.Arrays.sort(Arrays.java:2642)
     [exec] 	at java.util.Arrays.sort(Arrays.java:261)
     [exec] 	at net.wuffies.japi.BoundMemberSet.getFields(BoundMemberSet.java:33)

...

     [exec] 	at net.wuffies.japi.Japize.processRootSet(Japize.java:471)
     [exec] 	at net.wuffies.japi.Japize.doJapize(Japize.java:443)
     [exec] 	at net.wuffies.japi.Japize.main(Japize.java:316)

     [exec] Failed to Japize javax.swing.JApplet$AccessibleJApplet: java.lang.ArrayIndexOutOfBoundsException
     [exec] java.lang.ArrayIndexOutOfBoundsException
     [exec] 	at java.util.Arrays.mergeSort(Arrays.java:2736)
     [exec] 	at java.util.Arrays.mergeSort(Arrays.java:2699)
     [exec] 	at java.util.Arrays.sort(Arrays.java:2642)
     [exec] 	at java.util.Arrays.sort(Arrays.java:261)

...

     [exec] 	at net.wuffies.japi.Japize.processRootSet(Japize.java:471)
     [exec] 	at net.wuffies.japi.Japize.doJapize(Japize.java:443)
     [exec] 	at net.wuffies.japi.Japize.main(Japize.java:316)

     [exec] Failed to Japize javax.swing.JButton: java.lang.ArrayIndexOutOfBoundsException
     [exec] java.lang.ArrayIndexOutOfBoundsException
     [exec] 	at java.util.Arrays.mergeSort(Arrays.java:2728)
     [exec] 	at java.util.Arrays.mergeSort(Arrays.java:270)
     [exec] 	at java.util.Arrays.sort(Arrays.java:2642)
     [exec] 	at java.util.Arrays.sort(Arrays.java:261)

...

     [exec] 	at net.wuffies.japi.Japize.processRootSet(Japize.java:471)
     [exec] 	at net.wuffies.japi.Japize.doJapize(Japize.java:443)
     [exec] 	at net.wuffies.japi.Japize.main(Japize.java:316)

     [exec] Failed to Japize javax.swing.JButton$AccessibleJButton: java.lang.ArrayIndexOutOfBoundsException
     [exec] java.lang.ArrayIndexOutOfBoundsException
     [exec] 	at java.util.Arrays.mergeSort(Arrays.java:2728)
     [exec] 	at java.util.Arrays.sort(Arrays.java:2642)
     [exec] 	at java.util.Arrays.sort(Arrays.java:261)
     [exec] 	at net.wuffies.japi.BoundMemberSet.getCalls(BoundMemberSet.java:46)

...

     [exec] 	at net.wuffies.japi.Japize.processRootSet(Japize.java:471)
     [exec] 	at net.wuffies.japi.Japize.doJapize(Japize.java:443)
     [exec] 	at net.wuffies.japi.Japize.main(Japize.java:316)

     [exec] Failed to Japize javax.swing.JCheckBox: java.lang.ArrayIndexOutOfBoundsException
     [exec] java.lang.ArrayIndexOutOfBoundsException
     [exec] 	at java.util.Arrays.mergeSort(Arrays.java:2728)
     [exec] 	at java.util.Arrays.mergeSort(Arrays.java:270)
     [exec] 	at java.util.Arrays.sort(Arrays.java:2642)
     [exec] 	at java.util.Arrays.sort(Arrays.java:261)

...

     [exec] 	at net.wuffies.japi.Japize.processRootSet(Japize.java:471)
     [exec] 	at net.wuffies.japi.Japize.doJapize(Japize.java:443)
     [exec] 	at net.wuffies.japi.Japize.main(Japize.java:316)

     [exec] Failed to Japize javax.swing.JCheckBox$AccessibleJCheckBox: java.lang.ArrayIndexOutOfBoundsException
     [exec] java.lang.ArrayIndexOutOfBoundsException
     [exec] 	at java.util.Arrays.mergeSort(Arrays.java:2728)
     [exec] 	at java.util.Arrays.sort(Arrays.java:2642)
     [exec] 	at java.util.Arrays.sort(Arrays.java:261)
     [exec] 	at net.wuffies.japi.BoundMemberSet.getCalls(BoundMemberSet.java:46)

...

     [exec] 	at net.wuffies.japi.Japize.processRootSet(Japize.java:471)
     [exec] 	at net.wuffies.japi.Japize.doJapize(Japize.java:443)
     [exec] 	at net.wuffies.japi.Japize.main(Japize.java:316)

     [exec] Failed to Japize javax.swing.JCheckBoxMenuItem: java.lang.ArrayIndexOutOfBoundsException
     [exec] java.lang.ArrayIndexOutOfBoundsException
     [exec] 	at java.util.Arrays.mergeSort(Arrays.java:2728)
     [exec] 	at java.util.Arrays.mergeSort(Arrays.java:270)
     [exec] 	at java.util.Arrays.sort(Arrays.java:2642)
     [exec] 	at java.util.Arrays.sort(Arrays.java:261)

...

     [exec] 	at net.wuffies.japi.Japize.processRootSet(Japize.java:471)
     [exec] 	at net.wuffies.japi.Japize.doJapize(Japize.java:443)
     [exec] 	at net.wuffies.japi.Japize.main(Japize.java:316)

     [exec] Failed to Japize javax.swing.JCheckBoxMenuItem$AccessibleJCheckBoxMenuItem: java.lang.ArrayIndexOutOfBoundsException
     [exec] java.lang.ArrayIndexOutOfBoundsException
     [exec] 	at java.util.Arrays.mergeSort(Arrays.java:2728)
     [exec] 	at java.util.Arrays.sort(Arrays.java:2642)
     [exec] 	at java.util.Arrays.sort(Arrays.java:261)
     [exec] 	at net.wuffies.japi.BoundMemberSet.getCalls(BoundMemberSet.java:46)

...

     [exec] 	at net.wuffies.japi.Japize.processRootSet(Japize.java:471)
     [exec] 	at net.wuffies.japi.Japize.doJapize(Japize.java:443)
     [exec] 	at net.wuffies.japi.Japize.main(Japize.java:316)

     [exec] Failed to Japize javax.swing.JColorChooser: java.lang.ArrayIndexOutOfBoundsException
     [exec] java.lang.ArrayIndexOutOfBoundsException
     [exec] 	at java.util.Arrays.mergeSort(Arrays.java:2728)
     [exec] 	at java.util.Arrays.sort(Arrays.java:2642)
     [exec] 	at java.util.Arrays.sort(Arrays.java:261)
     [exec] 	at net.wuffies.japi.BoundMemberSet.getFields(BoundMemberSet.java:33)

...

     [exec] 	at net.wuffies.japi.Japize.processRootSet(Japize.java:471)
     [exec] 	at net.wuffies.japi.Japize.doJapize(Japize.java:443)
     [exec] 	at net.wuffies.japi.Japize.main(Japize.java:316)
     [exec] -----
     [exec] Failed to Japize javax.swing.JColorChooser$AccessibleJColorChooser: java.lang.ArrayIndexOutOfBoundsException
     [exec] java.lang.ArrayIndexOutOfBoundsException
     [exec] 	at java.util.Arrays.mergeSort(Arrays.java:2736)
     [exec] 	at java.util.Arrays.mergeSort(Arrays.java:2699)
     [exec] 	at java.util.Arrays.sort(Arrays.java:2642)
     [exec] 	at java.util.Arrays.sort(Arrays.java:261)

...

     [exec] 	at net.wuffies.japi.Japize.processRootSet(Japize.java:471)
     [exec] 	at net.wuffies.japi.Japize.doJapize(Japize.java:443)
     [exec] 	at net.wuffies.japi.Japize.main(Japize.java:316)

     [exec] Failed to Japize javax.swing.JComboBox: java.lang.ArrayIndexOutOfBoundsException
     [exec] java.lang.ArrayIndexOutOfBoundsException
     [exec] 	at java.util.Arrays.mergeSort(Arrays.java:2728)
     [exec] 	at java.util.Arrays.sort(Arrays.java:2642)
     [exec] 	at java.util.Arrays.sort(Arrays.java:261)
     [exec] 	at net.wuffies.japi.BoundMemberSet.getFields(BoundMemberSet.java:33)

...

     [exec] 	at net.wuffies.japi.Japize.processRootSet(Japize.java:471)
     [exec] 	at net.wuffies.japi.Japize.doJapize(Japize.java:443)
     [exec] 	at net.wuffies.japi.Japize.main(Japize.java:316)
     [exec] -
     [exec] Failed to Japize javax.swing.JComboBox$AccessibleJComboBox: java.lang.ArrayIndexOutOfBoundsException
     [exec] java.lang.ArrayIndexOutOfBoundsException
     [exec] 	at java.util.Arrays.mergeSort(Arrays.java:2736)
     [exec] 	at java.util.Arrays.mergeSort(Arrays.java:2699)
     [exec] 	at java.util.Arrays.sort(Arrays.java:2642)
     [exec] 	at java.util.Arrays.sort(Arrays.java:261)

...

     [exec] 	at net.wuffies.japi.Japize.processRootSet(Japize.java:471)
     [exec] 	at net.wuffies.japi.Japize.doJapize(Japize.java:443)
     [exec] 	at net.wuffies.japi.Japize.main(Japize.java:316)
     [exec] --+
     [exec] Failed to Japize javax.swing.JComponent: java.lang.ArrayIndexOutOfBoundsException
     [exec] java.lang.ArrayIndexOutOfBoundsException
     [exec] 	at java.util.Arrays.mergeSort(Arrays.java:2728)
     [exec] 	at java.util.Arrays.sort(Arrays.java:2642)
     [exec] 	at java.util.Arrays.sort(Arrays.java:261)
     [exec] 	at net.wuffies.japi.BoundMemberSet.getFields(BoundMemberSet.java:33)

...

     [exec] 	at net.wuffies.japi.Japize.processRootSet(Japize.java:471)
     [exec] 	at net.wuffies.japi.Japize.doJapize(Japize.java:443)
     [exec] 	at net.wuffies.japi.Japize.main(Japize.java:316)
     [exec] -
     [exec] Failed to Japize javax.swing.JComponent$AccessibleJComponent: java.lang.ArrayIndexOutOfBoundsException
     [exec] java.lang.ArrayIndexOutOfBoundsException
     [exec] 	at java.util.Arrays.mergeSort(Arrays.java:2736)
     [exec] 	at java.util.Arrays.mergeSort(Arrays.java:2699)
     [exec] 	at java.util.Arrays.sort(Arrays.java:2642)
     [exec] 	at java.util.Arrays.sort(Arrays.java:261)

...

     [exec] 	at net.wuffies.japi.Japize.processRootSet(Japize.java:471)
     [exec] 	at net.wuffies.japi.Japize.doJapize(Japize.java:443)
     [exec] 	at net.wuffies.japi.Japize.main(Japize.java:316)

     [exec] Failed to Japize javax.swing.JComponent$AccessibleJComponent$AccessibleContainerHandler:
java.lang.ArrayIndexOutOfBoundsException
     [exec] java.lang.ArrayIndexOutOfBoundsException
     [exec] 	at java.util.Arrays.mergeSort(Arrays.java:2726)
     [exec] 	at java.util.Arrays.sort(Arrays.java:2642)
     [exec] 	at java.util.Arrays.sort(Arrays.java:261)
     [exec] 	at net.wuffies.japi.BoundMemberSet.getCalls(BoundMemberSet.java:46)

...

     [exec] 	at net.wuffies.japi.Japize.processRootSet(Japize.java:471)
     [exec] 	at net.wuffies.japi.Japize.doJapize(Japize.java:443)
     [exec] 	at net.wuffies.japi.Japize.main(Japize.java:316)

     [exec] Failed to Japize javax.swing.JComponent$AccessibleJComponent$AccessibleFocusHandler:
java.lang.ArrayIndexOutOfBoundsException
     [exec] java.lang.ArrayIndexOutOfBoundsException
     [exec] 	at java.util.Arrays.mergeSort(Arrays.java:2726)
     [exec] 	at java.util.Arrays.sort(Arrays.java:2642)
     [exec] 	at java.util.Arrays.sort(Arrays.java:261)
     [exec] 	at net.wuffies.japi.BoundMemberSet.getCalls(BoundMemberSet.java:46)

...

     [exec] 	at net.wuffies.japi.Japize.processRootSet(Japize.java:471)
     [exec] 	at net.wuffies.japi.Japize.doJapize(Japize.java:443)
     [exec] 	at net.wuffies.japi.Japize.main(Japize.java:316)
     [exec] -
     [exec] Failed to Japize javax.swing.JDesktopPane: java.lang.ArrayIndexOutOfBoundsException
     [exec] java.lang.ArrayIndexOutOfBoundsException
     [exec] 	at java.util.Arrays.mergeSort(Arrays.java:2728)
     [exec] 	at java.util.Arrays.sort(Arrays.java:2642)
     [exec] 	at java.util.Arrays.sort(Arrays.java:261)
     [exec] 	at net.wuffies.japi.BoundMemberSet.getFields(BoundMemberSet.java:33)

...

     [exec] 	at net.wuffies.japi.Japize.processRootSet(Japize.java:471)
     [exec] 	at net.wuffies.japi.Japize.doJapize(Japize.java:443)
     [exec] 	at net.wuffies.japi.Japize.main(Japize.java:316)

     [exec] Failed to Japize javax.swing.JDesktopPane$AccessibleJDesktopPane: java.lang.ArrayIndexOutOfBoundsException
     [exec] java.lang.ArrayIndexOutOfBoundsException
     [exec] 	at java.util.Arrays.mergeSort(Arrays.java:2736)
     [exec] 	at java.util.Arrays.mergeSort(Arrays.java:2699)
     [exec] 	at java.util.Arrays.sort(Arrays.java:2642)
     [exec] 	at java.util.Arrays.sort(Arrays.java:261)

...

     [exec] 	at net.wuffies.japi.Japize.processRootSet(Japize.java:471)
     [exec] 	at net.wuffies.japi.Japize.doJapize(Japize.java:443)
     [exec] 	at net.wuffies.japi.Japize.main(Japize.java:316)

     [exec] Failed to Japize javax.swing.JDialog: java.lang.ArrayIndexOutOfBoundsException
     [exec] java.lang.ArrayIndexOutOfBoundsException
     [exec] 	at java.util.Arrays.mergeSort(Arrays.java:2728)
     [exec] 	at java.util.Arrays.sort(Arrays.java:2642)
     [exec] 	at java.util.Arrays.sort(Arrays.java:261)
     [exec] 	at net.wuffies.japi.BoundMemberSet.getFields(BoundMemberSet.java:33)

...

     [exec] 	at net.wuffies.japi.Japize.processRootSet(Japize.java:471)
     [exec] 	at net.wuffies.japi.Japize.doJapize(Japize.java:443)
     [exec] 	at net.wuffies.japi.Japize.main(Japize.java:316)

     [exec] Failed to Japize javax.swing.JDialog$AccessibleJDialog: java.lang.ArrayIndexOutOfBoundsException
     [exec] java.lang.ArrayIndexOutOfBoundsException
     [exec] 	at java.util.Arrays.mergeSort(Arrays.java:2736)
     [exec] 	at java.util.Arrays.mergeSort(Arrays.java:2699)
     [exec] 	at java.util.Arrays.sort(Arrays.java:2642)
     [exec] 	at java.util.Arrays.sort(Arrays.java:261)

...

     [exec] 	at net.wuffies.japi.Japize.processRootSet(Japize.java:471)
     [exec] 	at net.wuffies.japi.Japize.doJapize(Japize.java:443)
     [exec] 	at net.wuffies.japi.Japize.main(Japize.java:316)

     [exec] Failed to Japize javax.swing.JEditorPane: java.lang.ArrayIndexOutOfBoundsException
     [exec] java.lang.ArrayIndexOutOfBoundsException
     [exec] 	at java.util.Arrays.mergeSort(Arrays.java:2728)
     [exec] 	at java.util.Arrays.sort(Arrays.java:2642)
     [exec] 	at java.util.Arrays.sort(Arrays.java:261)
     [exec] 	at net.wuffies.japi.BoundMemberSet.getFields(BoundMemberSet.java:33)

...

     [exec] 	at net.wuffies.japi.Japize.processRootSet(Japize.java:471)
     [exec] 	at net.wuffies.japi.Japize.doJapize(Japize.java:443)
     [exec] 	at net.wuffies.japi.Japize.main(Japize.java:316)

     [exec] Failed to Japize javax.swing.JEditorPane$AccessibleJEditorPane: java.lang.ArrayIndexOutOfBoundsException
     [exec] java.lang.ArrayIndexOutOfBoundsException
     [exec] 	at java.util.Arrays.mergeSort(Arrays.java:2728)
     [exec] 	at java.util.Arrays.sort(Arrays.java:2642)
     [exec] 	at java.util.Arrays.sort(Arrays.java:261)
     [exec] 	at net.wuffies.japi.BoundMemberSet.getCalls(BoundMemberSet.java:46)

...

     [exec] 	at net.wuffies.japi.Japize.processRootSet(Japize.java:471)
     [exec] 	at net.wuffies.japi.Japize.doJapize(Japize.java:443)
     [exec] 	at net.wuffies.japi.Japize.main(Japize.java:316)

     [exec] Failed to Japize javax.swing.JEditorPane$AccessibleJEditorPaneHTML: java.lang.ArrayIndexOutOfBoundsException
     [exec] java.lang.ArrayIndexOutOfBoundsException
     [exec] 	at java.util.Arrays.mergeSort(Arrays.java:2728)
     [exec] 	at java.util.Arrays.sort(Arrays.java:2642)
     [exec] 	at java.util.Arrays.sort(Arrays.java:261)
     [exec] 	at net.wuffies.japi.BoundMemberSet.getCalls(BoundMemberSet.java:46)

...

     [exec] 	at net.wuffies.japi.Japize.processRootSet(Japize.java:471)
     [exec] 	at net.wuffies.japi.Japize.doJapize(Japize.java:443)
     [exec] 	at net.wuffies.japi.Japize.main(Japize.java:316)
     [exec] --
     [exec] Failed to Japize javax.swing.JEditorPane$JEditorPaneAccessibleHypertextSupport:
java.lang.ArrayIndexOutOfBoundsException
     [exec] java.lang.ArrayIndexOutOfBoundsException
     [exec] 	at java.util.Arrays.mergeSort(Arrays.java:2728)
     [exec] 	at java.util.Arrays.sort(Arrays.java:2642)
     [exec] 	at java.util.Arrays.sort(Arrays.java:261)
     [exec] 	at net.wuffies.japi.BoundMemberSet.getCalls(BoundMemberSet.java:46)

...

     [exec] 	at net.wuffies.japi.Japize.processRootSet(Japize.java:471)
     [exec] 	at net.wuffies.japi.Japize.doJapize(Japize.java:443)
     [exec] 	at net.wuffies.japi.Japize.main(Japize.java:316)

     [exec] Failed to Japize javax.swing.JEditorPane$JEditorPaneAccessibleHypertextSupport$HTMLLink:
java.lang.ArrayIndexOutOfBoundsException
     [exec] java.lang.ArrayIndexOutOfBoundsException
     [exec] 	at java.util.Arrays.mergeSort(Arrays.java:2726)
     [exec] 	at java.util.Arrays.sort(Arrays.java:2642)
     [exec] 	at java.util.Arrays.sort(Arrays.java:261)
     [exec] 	at net.wuffies.japi.BoundMemberSet.getCalls(BoundMemberSet.java:46)

...

     [exec] 	at net.wuffies.japi.Japize.processRootSet(Japize.java:471)
     [exec] 	at net.wuffies.japi.Japize.doJapize(Japize.java:443)
     [exec] 	at net.wuffies.japi.Japize.main(Japize.java:316)
     [exec] -
     [exec] Failed to Japize javax.swing.JFileChooser: java.lang.ArrayIndexOutOfBoundsException
     [exec] java.lang.ArrayIndexOutOfBoundsException
     [exec] 	at java.util.Arrays.mergeSort(Arrays.java:2728)
     [exec] 	at java.util.Arrays.sort(Arrays.java:2642)
     [exec] 	at java.util.Arrays.sort(Arrays.java:261)
     [exec] 	at net.wuffies.japi.BoundMemberSet.getFields(BoundMemberSet.java:33)

...

update-index:

test-result:

BUILD FAILED
/home/hybld/continuum-working-directory/22/build.xml:209: There were test failures.

Total time: 80 minutes 14 seconds

****************************************************************************

...

Mime
View raw message