harmony-alerts mailing list archives

Site index · List index
Message view « Date » · « Thread »
Top « Date » · « Thread »
From nom...@intel.com
Subject [build-test alert] BUILD FAILED Windows 2003 x86_64 msvc debug: classlib tests
Date Wed, 04 Jul 2007 17:57:46 GMT
BUILD FAILED:
	Ant Error Message:
C:\cruise\cc\projects\classlib\trunk\build.xml:169: The following error occurred while executing this line: C:\cruise\cc\projects\classlib\trunk\make\build-test.xml:147: There were test errors.

Date of build:	07/05/2007 00:13:31
Time to build:	43 minutes 48 seconds
Last changed:	07/04/2007 22:21:07
Last log entry:	clean up compiler warnings in io module, no functional change.

***********************************************************
Execution log (errors/warnings messages):	

========================================
Testing class libraries...
========================================

Checking for depends/jars/yoko_M2-20070130/yoko.jar
Checking for depends/jars/yoko_M2-20070130/yoko-core.jar
Checking for depends/jars/yoko_M2-20070130/yoko-rmi-impl.jar
Checking for depends/jars/yoko_M2-20070130/yoko-rmi-spec.jar
Checking for depends/jars/bcel-5.2/bcel-5.2.jar
Checking for depends/jars/xalan-j_2.7.0/xalan.jar
Checking for depends/jars/xerces_2.9.0/xerces.zip
Checking for depends/jars/junit_3.8.2/junit.jar
Checking for depends/jars/bcprov-jdk15-136/bcprov.jar
Checking for depends/jars/icu4j_3.4.4/icu4j_3_4_4.jar
Checking for depends/jars/mx4j_3.0.2/mx4j.zip
Checking for depends/jars/jetty/jetty-6.0.0.jar
Checking for depends/jars/jetty/jetty-util-6.0.0.jar
Checking for depends/jars/jetty/servlet-api-2.5-6.0.0.jar
Checking for depends/libs/windows.x86_64/msvcr80.dll
Checking for depends/libs/windows.x86_64/swing_awt_deps_win64_2007-02-08.tgz
hy.test.vm.name = drl
Compiling ACCESSIBILITY classes
Compiling ACCESSIBILITY tests
Since fork is false, ignoring memoryMaximumSize setting
Compiling ANNOTATION classes
Compiling ANNOTATION tests
Since fork is false, ignoring memoryMaximumSize setting
----------
1. WARNING in C:\cruise\cc\projects\classlib\trunk\modules\annotation\src\test\java\org\apache\harmony\annotation\tests\java\lang\annotation\IncompleteAnnotationExceptionTest.java
 (at line 53)
	clazz, elementName);
	^^^^^
Type safety: The expression of type Class needs unchecked conversion to conform to Class<? extends Annotation>
----------
1 problem (1 warning)
Compiling APPLET classes
Compiling APPLET tests
Since fork is false, ignoring memoryMaximumSize setting
Compiling ARCHIVE classes
Compiling ARCHIVE tests
Since fork is false, ignoring memoryMaximumSize setting
The GC did not provide gc_add_weak_root_set_entry()
Compiling AUTH classes
Compiling AUTH tests
Since fork is false, ignoring memoryMaximumSize setting
The GC did not provide gc_add_weak_root_set_entry()
Compiling AWT classes
Compiling AWT tests
Since fork is false, ignoring memoryMaximumSize setting
The GC did not provide gc_add_weak_root_set_entry()
The GC did not provide gc_add_weak_root_set_entry()
Compiling BEANS classes
Compiling support classes for BEANS tests
Compiling internal BEANS tests
Compiling BEANS tests
Since fork is false, ignoring memoryMaximumSize setting
Running internal BEANS tests
Running BEANS tests
The GC did not provide gc_add_weak_root_set_entry()
Compiling CRYPTO classes
Compiling CRYPTO test support files
Compiling CRYPTO api tests
Since fork is false, ignoring memoryMaximumSize setting
Compiling CRYPTO api injected tests
Since fork is false, ignoring memoryMaximumSize setting
Compiling CRYPTO impl injected tests
Since fork is false, ignoring memoryMaximumSize setting
Compiling CRYPTO impl tests
Since fork is false, ignoring memoryMaximumSize setting
Running CRYPTO api tests
The GC did not provide gc_add_weak_root_set_entry()
Running CRYPTO api.injected tests
The GC did not provide gc_add_weak_root_set_entry()
Running CRYPTO impl tests
The GC did not provide gc_add_weak_root_set_entry()
Running CRYPTO impl injected tests
Compiling ImageIO classes
Compiling ImageIO tests
Since fork is false, ignoring memoryMaximumSize setting
Compiling INSTRUMENT classes
Compiling INSTRUMENT tests
Since fork is false, ignoring memoryMaximumSize setting
Compiling JNDI classes
Compiling JNDI tests
Since fork is false, ignoring memoryMaximumSize setting
The GC did not provide gc_add_weak_root_set_entry()
Compiling LANG-MANAGEMENT classes
Compiling LANG-MANAGEMENT API tests
Since fork is false, ignoring memoryMaximumSize setting
Compiling LANG-MANAGEMENT Implementation tests
Since fork is false, ignoring memoryMaximumSize setting
Compiling LOGGING classes
Compiling LOGGING tests
Since fork is false, ignoring memoryMaximumSize setting
The GC did not provide gc_add_weak_root_set_entry()
Compiling LUNI classes
Compiling LUNI JUnit Tests
Since fork is false, ignoring memoryMaximumSize setting
Running LUNI JUnit Tests
The GC did not provide gc_add_weak_root_set_entry()
2007-07-05 00:29:17.349::INFO:  Logging to STDERR via org.mortbay.log.StdErrLog
2007-07-05 00:29:17.880::INFO:  jetty-6.0.x
2007-07-05 00:29:18.286::INFO:  Started SocketConnector @ 0.0.0.0:2252
2007-07-05 00:30:31.145::INFO:  jetty-6.0.x
2007-07-05 00:30:31.161::INFO:  Started SocketConnector @ 0.0.0.0:2498
2007-07-05 00:30:32.754::INFO:  jetty-6.0.x
2007-07-05 00:30:32.754::INFO:  Started SocketConnector @ 0.0.0.0:2504
Compiling MATH classes
Compiling MATH tests
Since fork is false, ignoring memoryMaximumSize setting
The GC did not provide gc_add_weak_root_set_entry()
Compiling MISC classes
Compiling MISC tests
Since fork is false, ignoring memoryMaximumSize setting
Compiling NIO classes
Compiling NIO tests
Since fork is false, ignoring memoryMaximumSize setting
The GC did not provide gc_add_weak_root_set_entry()
Compiling NIO_CHAR classes
Compiling NIO_CHAR tests
Since fork is false, ignoring memoryMaximumSize setting
The GC did not provide gc_add_weak_root_set_entry()
Cannot find unmappable byte array for US-ASCII
Cannot find unmappable byte array for GB18030
Cannot find unmappable byte array for ISO-8859-1
Cannot find malform byte array for ISO-8859-1
Cannot find unmappable byte array for UTF-16BE
Cannot find malform byte array for UTF-16BE
Cannot find unmappable byte array for UTF-16
Cannot find malform byte array for UTF-16
Cannot find unmappable byte array for UTF-16LE
Cannot find malform byte array for UTF-16LE
Cannot find unmappable byte array for UTF-8
Compiling PACK200 classes
Compiling PACK200 tests
Since fork is false, ignoring memoryMaximumSize setting
Running PACK200 tests
The GC did not provide gc_add_weak_root_set_entry()
Compiling PREFS classes
Compiling PREFS tests
Since fork is false, ignoring memoryMaximumSize setting
The GC did not provide gc_add_weak_root_set_entry()
Compiling PRINT classes
Compiling Print tests
Since fork is false, ignoring memoryMaximumSize setting
The GC did not provide gc_add_weak_root_set_entry()
Compiling REGEX classes
Compiling REGEX tests
Since fork is false, ignoring memoryMaximumSize setting
The GC did not provide gc_add_weak_root_set_entry()
Compiling RMI classes
Compiling RMI api tests
Since fork is false, ignoring memoryMaximumSize setting
Running RMI api tests
testDirectSocket_SingleVM starting
Test server started.
Object: MyRemoteObject[UnicastServerRef[endpoint:[[10.125.122.44:3884]](local), ObjID[65536, UID[118f25b0:113924ff791:-8000]]]] created and exported.
Jul 5, 2007 12:38:46 AM org.apache.harmony.rmi.server.RMIReference makeStrong
FINER: main: Strongly referenced RegistryImpl
Registry created.
Object bound in the registry.
Registry located.
Jul 5, 2007 12:38:49 AM org.apache.harmony.rmi.client.ClientConnection sendDGCAck
FINER: main: Sent DGC ack to [localhost:1099] for UID[118f25b0:113924ff791:-7ffd]
Lookup object is: Proxy[interf:[org.apache.harmony.rmi.test.MyRemoteInterface, java.rmi.Remote], RemoteObjectInvocationHandler[UnicastRef[endpoint:[[10.125.122.44:3884]](remote), ObjID[65536, UID[118f25b0:113924ff791:-8000]]]]]
Testing test_String_Void...
Done.
Testing test_Void_String...
Returned: MyRemoteObject.test_Void_String
Done.
Testing test_Int_Void...
Done.
Testing test_Void_Int...
Returned: 987654321
Done.
Testing test_Remote_Void...
Done.
Testing test_Remote_Void with remote object extending another remote object...
Done.
Testing test_Void_Remote...
The GC did not provide gc_add_weak_root_set_entry()
Jul 5, 2007 12:38:50 AM org.apache.harmony.rmi.client.ClientConnection sendDGCAck
FINER: main: Sent DGC ack to [10.125.122.44:3884] for UID[118f25b0:113924ff791:-7fe8]
Returned: Proxy[interf:[org.apache.harmony.rmi.test.MyRemoteInterface2, java.rmi.Remote], RemoteObjectInvocationHandler[UnicastRef[endpoint:[[10.125.122.44:3892]](remote), ObjID[65539, UID[118f25b0:113924ff791:-7fe9]]]]]
Done.
Testing test_Long_Long...
Returned: 998877665544332211
Done.
Testing test_String_String...
Returned: MyRemoteObject.test_String_String
Done.
Testing test_Remote_Remote...
Jul 5, 2007 12:38:50 AM org.apache.harmony.rmi.client.ClientConnection sendDGCAck
FINER: main: Sent DGC ack to [10.125.122.44:3884] for UID[118f25b0:113924ff791:-7fde]
Returned: Proxy[interf:[org.apache.harmony.rmi.test.MyRemoteInterface2, java.rmi.Remote], RemoteObjectInvocationHandler[UnicastRef[endpoint:[[10.125.122.44:3896]](remote), ObjID[65541, UID[118f25b0:113924ff791:-7fdf]]]]]
Done.
Testing test_RemoteString_Void...
Done.
Testing test_RemoteRemote_Remote...
Jul 5, 2007 12:38:51 AM org.apache.harmony.rmi.client.ClientConnection sendDGCAck
FINER: main: Sent DGC ack to [10.125.122.44:3884] for UID[118f25b0:113924ff791:-7fd0]
Returned: Proxy[interf:[org.apache.harmony.rmi.test.MyRemoteInterface2, java.rmi.Remote], RemoteObjectInvocationHandler[UnicastRef[endpoint:[[10.125.122.44:3903]](remote), ObjID[65545, UID[118f25b0:113924ff791:-7fd1]]]]]
Done.
Testing test_BooleanStringRemote_Void...
Done.
Testing test_Proxy_Void...
Done.
Testing test_Array_Void...
Done.
Testing test_Void_Array...
Done.
Testing test_RemoteArray_Void...
Done.
Testing test_Void_RemoteArray...
Jul 5, 2007 12:38:52 AM org.apache.harmony.rmi.client.ClientConnection sendDGCAck
FINER: main: Sent DGC ack to [10.125.122.44:3884] for UID[118f25b0:113924ff791:-7fbd]
Done.
Testing test_Exception...
org.apache.harmony.rmi.test.MyException: MyRemoteObject.test_Exception
Done.
Testing test_Error...
java.rmi.ServerError: Error occurred while remote method invocation; nested exception is:
	java.lang.Error: MyRemoteObject.test_Error
Done.
Testing test_RuntimeException...
java.lang.RuntimeException: MyRemoteObject.text_RuntimeException
Done.
Testing test_RemoteException...
java.rmi.ServerException: RemoteException occurred while remote method invocation; nested exception is:
	java.rmi.RemoteException: MyRemoteObject.text_RemoteException
Done.
Test server complete.
Test server closing.
Unexporting MyRemoteObject[UnicastServerRef[endpoint:[[10.125.122.44:3884]](local), ObjID[65536, UID[118f25b0:113924ff791:-8000]]]] ...
testDirectHTTP_SingleVM starting
Test server started.
Object: MyRemoteObject[UnicastServerRef[endpoint:[[10.125.122.44:3912]](local), ObjID[65536, UID[118f25b0:1139250366f:-8000]]]] created and exported.
Jul 5, 2007 12:39:02 AM org.apache.harmony.rmi.server.RMIReference makeStrong
FINER: main: Strongly referenced RegistryImpl
Registry created.
Object bound in the registry.
Registry located.
Jul 5, 2007 12:39:05 AM org.apache.harmony.rmi.client.ClientConnection sendDGCAck
FINER: main: Sent DGC ack to [localhost:1099] for UID[118f25b0:1139250366f:-7ffd]
Lookup object is: Proxy[interf:[org.apache.harmony.rmi.test.MyRemoteInterface, java.rmi.Remote], RemoteObjectInvocationHandler[UnicastRef[endpoint:[[10.125.122.44:3912]](remote), ObjID[65536, UID[118f25b0:1139250366f:-8000]]]]]
Testing test_String_Void...
Done.
Testing test_Void_String...
Returned: MyRemoteObject.test_Void_String
Done.
Testing test_Int_Void...
Done.
Testing test_Void_Int...
Returned: 987654321
Done.
Testing test_Remote_Void...
Done.
Testing test_Remote_Void with remote object extending another remote object...
Done.
Testing test_Void_Remote...
The GC did not provide gc_add_weak_root_set_entry()
Jul 5, 2007 12:39:06 AM org.apache.harmony.rmi.client.ClientConnection sendDGCAck
FINER: main: Sent DGC ack to [10.125.122.44:3912] for UID[118f25b0:1139250366f:-7fe8]
Returned: Proxy[interf:[org.apache.harmony.rmi.test.MyRemoteInterface2, java.rmi.Remote], RemoteObjectInvocationHandler[UnicastRef[endpoint:[[10.125.122.44:3920]](remote), ObjID[65539, UID[118f25b0:1139250366f:-7fe9]]]]]
Done.
Testing test_Long_Long...
Returned: 998877665544332211
Done.
Testing test_String_String...
Returned: MyRemoteObject.test_String_String
Done.
Testing test_Remote_Remote...
Jul 5, 2007 12:39:07 AM org.apache.harmony.rmi.client.ClientConnection sendDGCAck
FINER: main: Sent DGC ack to [10.125.122.44:3912] for UID[118f25b0:1139250366f:-7fde]
Returned: Proxy[interf:[org.apache.harmony.rmi.test.MyRemoteInterface2, java.rmi.Remote], RemoteObjectInvocationHandler[UnicastRef[endpoint:[[10.125.122.44:3924]](remote), ObjID[65541, UID[118f25b0:1139250366f:-7fdf]]]]]
Done.
Testing test_RemoteString_Void...
Done.
Testing test_RemoteRemote_Remote...
Jul 5, 2007 12:39:07 AM org.apache.harmony.rmi.client.ClientConnection sendDGCAck
FINER: main: Sent DGC ack to [10.125.122.44:3912] for UID[118f25b0:1139250366f:-7fd0]
Returned: Proxy[interf:[org.apache.harmony.rmi.test.MyRemoteInterface2, java.rmi.Remote], RemoteObjectInvocationHandler[UnicastRef[endpoint:[[10.125.122.44:3931]](remote), ObjID[65545, UID[118f25b0:1139250366f:-7fd1]]]]]
Done.
Testing test_BooleanStringRemote_Void...
Done.
Testing test_Proxy_Void...
Done.
Testing test_Array_Void...
Done.
Testing test_Void_Array...
Done.
Testing test_RemoteArray_Void...
Done.
Testing test_Void_RemoteArray...
Jul 5, 2007 12:39:08 AM org.apache.harmony.rmi.client.ClientConnection sendDGCAck
FINER: main: Sent DGC ack to [10.125.122.44:3912] for UID[118f25b0:1139250366f:-7fbd]
Done.
Testing test_Exception...
org.apache.harmony.rmi.test.MyException: MyRemoteObject.test_Exception
Done.
Testing test_Error...
java.rmi.ServerError: Error occurred while remote method invocation; nested exception is:
	java.lang.Error: MyRemoteObject.test_Error
Done.
Testing test_RuntimeException...
java.lang.RuntimeException: MyRemoteObject.text_RuntimeException
Done.
Testing test_RemoteException...
java.rmi.ServerException: RemoteException occurred while remote method invocation; nested exception is:
	java.rmi.RemoteException: MyRemoteObject.text_RemoteException
Done.
Test server complete.
Test server closing.
The GC did not provide gc_add_weak_root_set_entry()
Unexporting MyRemoteObject1[UnicastServerRef[endpoint:[[10.125.122.44:3940]](local), ObjID[65536, UID[11ee9630:113925076a5:-7ff7]]]] ...
Done.
Unexporting MyRemoteObject1[UnicastServerRef[endpoint:[[10.125.122.44:3941]](local), ObjID[65537, UID[11ee9630:113925076a5:-7ff6]]]] ...
Done.
Unexporting MyRemoteObject1[UnicastServerRef[endpoint:[[10.125.122.44:3942]](local), ObjID[65538, UID[11ee9630:113925076a5:-7ff5]]]] ...
Done.
Unexporting MyRemoteObject1[UnicastServerRef[endpoint:[[10.125.122.44:3943]](local), ObjID[65539, UID[11ee9630:113925076a5:-7ff4]]]] ...
Done.
Unexporting MyRemoteObject1[UnicastServerRef[endpoint:[[10.125.122.44:3944]](local), ObjID[65540, UID[11ee9630:113925076a5:-7ff3]]]] ...
Done.
Unexporting MyRemoteObject1[UnicastServerRef[endpoint:[[10.125.122.44:3945]](local), ObjID[65541, UID[11ee9630:113925076a5:-7ff2]]]] ...
Done.
Unexporting MyRemoteObject1[UnicastServerRef[endpoint:[[10.125.122.44:3946]](local), ObjID[65542, UID[11ee9630:113925076a5:-7ff1]]]] ...
Done.
Unexporting MyRemoteObject1[UnicastServerRef[endpoint:[[10.125.122.44:3947]](local), ObjID[65543, UID[11ee9630:113925076a5:-7ff0]]]] ...
Done.
LogStream[tst]:
Compiling SECURITY classes
Compiling SECURITY test support files
Since fork is false, ignoring memoryMaximumSize setting
Compiling SECURITY api tests
Since fork is false, ignoring memoryMaximumSize setting
Compiling SECURITY api injected tests
Since fork is false, ignoring memoryMaximumSize setting
Compiling SECURITY impl injected tests
Since fork is false, ignoring memoryMaximumSize setting
Compiling SECURITY impl tests
Since fork is false, ignoring memoryMaximumSize setting
Running SECURITY api tests
The GC did not provide gc_add_weak_root_set_entry()
Running SECURITY api.injected tests
The GC did not provide gc_add_weak_root_set_entry()
Running SECURITY impl tests
The GC did not provide gc_add_weak_root_set_entry()
Running SECURITY impl injected tests
The GC did not provide gc_add_weak_root_set_entry()
Compiling SOUND classes
Compiling SOUND tests
Since fork is false, ignoring memoryMaximumSize setting
The GC did not provide gc_add_weak_root_set_entry()
Compiling SQL classes
Compiling SQL tests
Since fork is false, ignoring memoryMaximumSize setting
The GC did not provide gc_add_weak_root_set_entry()
Compiling Sun Compat classes
Compiling SUNCOMPAT tests
Compiling TEXT classes
Compiling TEXT tests
Since fork is false, ignoring memoryMaximumSize setting
The GC did not provide gc_add_weak_root_set_entry()
Compiling X-NET classes
Compiling X-NET test support files
Compiling X-NET api tests
Since fork is false, ignoring memoryMaximumSize setting
Compiling X-NET impl injected tests
Since fork is false, ignoring memoryMaximumSize setting
Compiling X-NET impl tests
Since fork is false, ignoring memoryMaximumSize setting
Running X-NET api tests
The GC did not provide gc_add_weak_root_set_entry()
Running X-NET impl tests
The GC did not provide gc_add_weak_root_set_entry()
Running X-NET impl injected tests
The GC did not provide gc_add_weak_root_set_entry()
The test report is in C:\cruise\cc\projects\classlib\trunk\build\test_report\html\index.html

***********************************************************
Unit Tests: (16738)
        
error: testSerialization org.apache.harmony.beans.tests.java.beans.beancontext.BeanContextEventTest
error: testSerializationComptibility org.apache.harmony.beans.tests.java.beans.beancontext.BeanContextEventTest
error: testSerialization org.apache.harmony.beans.tests.java.beans.beancontext.BeanContextMembershipEventTest
error: testSerialization_Compatibility org.apache.harmony.beans.tests.java.beans.beancontext.BeanContextMembershipEventTest
error: testSerialization org.apache.harmony.beans.tests.java.beans.beancontext.BeanContextServiceAvailableEventTest
error: testSerialization_Compatibility org.apache.harmony.beans.tests.java.beans.beancontext.BeanContextServiceAvailableEventTest
error: testSerialization org.apache.harmony.beans.tests.java.beans.beancontext.BeanContextServiceRevokedEventTest
error: testSerialization_Compatibility org.apache.harmony.beans.tests.java.beans.beancontext.BeanContextServiceRevokedEventTest
error: testSerialization org.apache.harmony.beans.tests.java.beans.beancontext.BeanContextServicesSupportTest
error: testSerialization_Compatibility org.apache.harmony.beans.tests.java.beans.beancontext.BeanContextServicesSupportTest
error: testBcsPreDeserializationHook org.apache.harmony.beans.tests.java.beans.beancontext.BeanContextSupportTest
error: testBcsPreSerializationHook org.apache.harmony.beans.tests.java.beans.beancontext.BeanContextSupportTest
error: testChildDeserializedHook org.apache.harmony.beans.tests.java.beans.beancontext.BeanContextSupportTest
error: testReadChildren org.apache.harmony.beans.tests.java.beans.beancontext.BeanContextSupportTest
error: testSerialization_NoPeer org.apache.harmony.beans.tests.java.beans.beancontext.BeanContextSupportTest
error: testSerialization_Peer org.apache.harmony.beans.tests.java.beans.beancontext.BeanContextSupportTest
error: testSerialization_Compatibility org.apache.harmony.beans.tests.java.beans.beancontext.BeanContextSupportTest
error: testSelfSerializatoin org.apache.harmony.beans.tests.java.beans.beancontext.BeanContextSupportTest
Unit Test Error Details:	(18)
                
Test: testSerializationClass: org.apache.harmony.beans.tests.java.beans.beancontext.BeanContextEventTestjava.lang.NullPointerException
	at java.io.ObjectStreamClass.buildFieldDescriptors(ObjectStreamClass.java:322)
	at java.io.ObjectStreamClass.createClassDesc(ObjectStreamClass.java:229)
	at java.io.ObjectStreamClass.lookupStreamClass(ObjectStreamClass.java:907)
	at java.io.ObjectStreamClass.lookupStreamClass(ObjectStreamClass.java:884)
	at java.io.ObjectOutputStream.writeObjectInternal(ObjectOutputStream.java:1844)
	at java.io.ObjectOutputStream.writeObject(ObjectOutputStream.java:1770)
	at java.io.ObjectOutputStream.writeObject(ObjectOutputStream.java:1734)
	at java.io.ObjectOutputStream.writeFieldValues(ObjectOutputStream.java:1224)
	at java.io.ObjectOutputStream.defaultWriteObject(ObjectOutputStream.java:302)
	at java.beans.beancontext.BeanContextSupport.writeObject(BeanContextSupport.java:1252)
	at java.lang.reflect.VMReflection.invokeMethod(VMReflection.java)
	at java.io.ObjectOutputStream.writeHierarchy(ObjectOutputStream.java:1301)
	at java.io.ObjectOutputStream.writeHierarchy(ObjectOutputStream.java:1287)
	at java.io.ObjectOutputStream.writeNewObject(ObjectOutputStream.java:1659)
	at java.io.ObjectOutputStream.writeObjectInternal(ObjectOutputStream.java:1927)
	at java.io.ObjectOutputStream.writeObject(ObjectOutputStream.java:1770)
	at java.io.ObjectOutputStream.writeObject(ObjectOutputStream.java:1734)
	at java.io.ObjectOutputStream.writeFieldValues(ObjectOutputStream.java:1224)
	at java.io.ObjectOutputStream.defaultWriteObject(ObjectOutputStream.java:302)
	at java.io.ObjectOutputStream.writeHierarchy(ObjectOutputStream.java:1323)
	at java.io.ObjectOutputStream.writeHierarchy(ObjectOutputStream.java:1287)
	at java.io.ObjectOutputStream.writeNewObject(ObjectOutputStream.java:1659)
	at java.io.ObjectOutputStream.writeObjectInternal(ObjectOutputStream.java:1927)
	at java.io.ObjectOutputStream.writeObject(ObjectOutputStream.java:1770)
	at java.io.ObjectOutputStream.writeObject(ObjectOutputStream.java:1734)
	at org.apache.harmony.testframework.serialization.SerializationTest.putObjectToStream(SerializationTest.java:197)
	at org.apache.harmony.testframework.serialization.SerializationTest.copySerializable(SerializationTest.java:582)
	at org.apache.harmony.testframework.serialization.SerializationTest.verifySelf(SerializationTest.java:473)
	at org.apache.harmony.beans.tests.java.beans.beancontext.BeanContextEventTest.testSerialization(BeanContextEventTest.java:143)
	at java.lang.reflect.VMReflection.invokeMethod(VMReflection.java)

Test: testSerializationComptibilityClass: org.apache.harmony.beans.tests.java.beans.beancontext.BeanContextEventTestjava.lang.NullPointerException
	at java.io.ObjectStreamClass.buildFieldDescriptors(ObjectStreamClass.java:322)
	at java.io.ObjectStreamClass.createClassDesc(ObjectStreamClass.java:229)
	at java.io.ObjectStreamClass.lookupStreamClass(ObjectStreamClass.java:907)
	at java.io.ObjectStreamClass.lookupStreamClass(ObjectStreamClass.java:884)
	at java.io.ObjectInputStream.verifyAndInit(ObjectInputStream.java:2721)
	at java.io.ObjectInputStream.readNewClassDesc(ObjectInputStream.java:1713)
	at java.io.ObjectInputStream.readClassDesc(ObjectInputStream.java:711)
	at java.io.ObjectInputStream.readNewObject(ObjectInputStream.java:1863)
	at java.io.ObjectInputStream.readNonPrimitiveContent(ObjectInputStream.java:815)
	at java.io.ObjectInputStream.readObject(ObjectInputStream.java:2133)
	at java.io.ObjectInputStream.readObject(ObjectInputStream.java:2088)
	at java.io.ObjectInputStream.readFieldValues(ObjectInputStream.java:1179)
	at java.io.ObjectInputStream.defaultReadObject(ObjectInputStream.java:427)
	at java.beans.beancontext.BeanContextSupport.readObject(BeanContextSupport.java:1290)
	at java.lang.reflect.VMReflection.invokeMethod(VMReflection.java)
	at java.io.ObjectInputStream.readObjectForClass(ObjectInputStream.java:1399)
	at java.io.ObjectInputStream.readHierarchy(ObjectInputStream.java:1321)
	at java.io.ObjectInputStream.readNewObject(ObjectInputStream.java:1981)
	at java.io.ObjectInputStream.readNonPrimitiveContent(ObjectInputStream.java:815)
	at java.io.ObjectInputStream.readObject(ObjectInputStream.java:2133)
	at java.io.ObjectInputStream.readObject(ObjectInputStream.java:2088)
	at java.io.ObjectInputStream.readFieldValues(ObjectInputStream.java:1179)
	at java.io.ObjectInputStream.defaultReadObject(ObjectInputStream.java:427)
	at java.io.ObjectInputStream.readObjectForClass(ObjectInputStream.java:1411)
	at java.io.ObjectInputStream.readHierarchy(ObjectInputStream.java:1321)
	at java.io.ObjectInputStream.readNewObject(ObjectInputStream.java:1981)
	at java.io.ObjectInputStream.readNonPrimitiveContent(ObjectInputStream.java:815)
	at java.io.ObjectInputStream.readObject(ObjectInputStream.java:2133)
	at java.io.ObjectInputStream.readObject(ObjectInputStream.java:2088)
	at org.apache.harmony.testframework.serialization.SerializationTest.getObjectFromStream(SerializationTest.java:208)
	at org.apache.harmony.testframework.serialization.SerializationTest.getObject(SerializationTest.java:530)
	at org.apache.harmony.testframework.serialization.SerializationTest.verifyGolden(SerializationTest.java:388)
	at org.apache.harmony.beans.tests.java.beans.beancontext.BeanContextEventTest.testSerializationComptibility(BeanContextEventTest.java:210)
	at java.lang.reflect.VMReflection.invokeMethod(VMReflection.java)

Test: testSerializationClass: org.apache.harmony.beans.tests.java.beans.beancontext.BeanContextMembershipEventTestjava.lang.NullPointerException
	at java.io.ObjectStreamClass.buildFieldDescriptors(ObjectStreamClass.java:322)
	at java.io.ObjectStreamClass.createClassDesc(ObjectStreamClass.java:229)
	at java.io.ObjectStreamClass.lookupStreamClass(ObjectStreamClass.java:907)
	at java.io.ObjectStreamClass.lookupStreamClass(ObjectStreamClass.java:884)
	at java.io.ObjectOutputStream.writeObjectInternal(ObjectOutputStream.java:1844)
	at java.io.ObjectOutputStream.writeObject(ObjectOutputStream.java:1770)
	at java.io.ObjectOutputStream.writeObject(ObjectOutputStream.java:1734)
	at java.io.ObjectOutputStream.writeFieldValues(ObjectOutputStream.java:1224)
	at java.io.ObjectOutputStream.defaultWriteObject(ObjectOutputStream.java:302)
	at java.beans.beancontext.BeanContextSupport.writeObject(BeanContextSupport.java:1252)
	at java.lang.reflect.VMReflection.invokeMethod(VMReflection.java)
	at java.io.ObjectOutputStream.writeHierarchy(ObjectOutputStream.java:1301)
	at java.io.ObjectOutputStream.writeNewObject(ObjectOutputStream.java:1659)
	at java.io.ObjectOutputStream.writeObjectInternal(ObjectOutputStream.java:1927)
	at java.io.ObjectOutputStream.writeObject(ObjectOutputStream.java:1770)
	at java.io.ObjectOutputStream.writeObject(ObjectOutputStream.java:1734)
	at java.io.ObjectOutputStream.writeFieldValues(ObjectOutputStream.java:1224)
	at java.io.ObjectOutputStream.defaultWriteObject(ObjectOutputStream.java:302)
	at org.apache.harmony.beans.tests.support.beancontext.mock.MockBeanContextDelegateS.writeObject(MockBeanContextDelegateS.java:243)
	at java.lang.reflect.VMReflection.invokeMethod(VMReflection.java)
	at java.io.ObjectOutputStream.writeHierarchy(ObjectOutputStream.java:1301)
	at java.io.ObjectOutputStream.writeNewObject(ObjectOutputStream.java:1659)
	at java.io.ObjectOutputStream.writeObjectInternal(ObjectOutputStream.java:1927)
	at java.io.ObjectOutputStream.writeObject(ObjectOutputStream.java:1770)
	at java.io.ObjectOutputStream.writeObject(ObjectOutputStream.java:1734)
	at java.io.ObjectOutputStream.writeFieldValues(ObjectOutputStream.java:1224)
	at java.io.ObjectOutputStream.defaultWriteObject(ObjectOutputStream.java:302)
	at java.io.ObjectOutputStream.writeHierarchy(ObjectOutputStream.java:1323)
	at java.io.ObjectOutputStream.writeHierarchy(ObjectOutputStream.java:1287)
	at java.io.ObjectOutputStream.writeNewObject(ObjectOutputStream.java:1659)
	at java.io.ObjectOutputStream.writeObjectInternal(ObjectOutputStream.java:1927)
	at java.io.ObjectOutputStream.writeObject(ObjectOutputStream.java:1770)
	at java.io.ObjectOutputStream.writeObject(ObjectOutputStream.java:1734)
	at tests.util.SerializationTester.getDeserilizedObject(SerializationTester.java:73)
	at org.apache.harmony.beans.tests.java.beans.beancontext.BeanContextMembershipEventTest.testSerialization(BeanContextMembershipEventTest.java:248)
	at java.lang.reflect.VMReflection.invokeMethod(VMReflection.java)

Test: testSerialization_CompatibilityClass: org.apache.harmony.beans.tests.java.beans.beancontext.BeanContextMembershipEventTestjava.lang.NullPointerException
	at java.io.ObjectStreamClass.buildFieldDescriptors(ObjectStreamClass.java:322)
	at java.io.ObjectStreamClass.createClassDesc(ObjectStreamClass.java:229)
	at java.io.ObjectStreamClass.lookupStreamClass(ObjectStreamClass.java:907)
	at java.io.ObjectStreamClass.lookupStreamClass(ObjectStreamClass.java:884)
	at java.io.ObjectInputStream.verifyAndInit(ObjectInputStream.java:2721)
	at java.io.ObjectInputStream.readNewClassDesc(ObjectInputStream.java:1713)
	at java.io.ObjectInputStream.readClassDesc(ObjectInputStream.java:711)
	at java.io.ObjectInputStream.readNewObject(ObjectInputStream.java:1863)
	at java.io.ObjectInputStream.readNonPrimitiveContent(ObjectInputStream.java:815)
	at java.io.ObjectInputStream.readObject(ObjectInputStream.java:2133)
	at java.io.ObjectInputStream.readObject(ObjectInputStream.java:2088)
	at java.io.ObjectInputStream.readFieldValues(ObjectInputStream.java:1179)
	at java.io.ObjectInputStream.defaultReadObject(ObjectInputStream.java:427)
	at java.beans.beancontext.BeanContextSupport.readObject(BeanContextSupport.java:1290)
	at java.lang.reflect.VMReflection.invokeMethod(VMReflection.java)
	at java.io.ObjectInputStream.readObjectForClass(ObjectInputStream.java:1399)
	at java.io.ObjectInputStream.readHierarchy(ObjectInputStream.java:1321)
	at java.io.ObjectInputStream.readNewObject(ObjectInputStream.java:1981)
	at java.io.ObjectInputStream.readNonPrimitiveContent(ObjectInputStream.java:815)
	at java.io.ObjectInputStream.readObject(ObjectInputStream.java:2133)
	at java.io.ObjectInputStream.readObject(ObjectInputStream.java:2088)
	at java.io.ObjectInputStream.readFieldValues(ObjectInputStream.java:1179)
	at java.io.ObjectInputStream.defaultReadObject(ObjectInputStream.java:427)
	at org.apache.harmony.beans.tests.support.beancontext.mock.MockBeanContextDelegateS.readObject(MockBeanContextDelegateS.java:248)
	at java.lang.reflect.VMReflection.invokeMethod(VMReflection.java)
	at java.io.ObjectInputStream.readObjectForClass(ObjectInputStream.java:1399)
	at java.io.ObjectInputStream.readHierarchy(ObjectInputStream.java:1321)
	at java.io.ObjectInputStream.readNewObject(ObjectInputStream.java:1981)
	at java.io.ObjectInputStream.readNonPrimitiveContent(ObjectInputStream.java:815)
	at java.io.ObjectInputStream.readObject(ObjectInputStream.java:2133)
	at java.io.ObjectInputStream.readObject(ObjectInputStream.java:2088)
	at java.io.ObjectInputStream.readFieldValues(ObjectInputStream.java:1179)
	at java.io.ObjectInputStream.defaultReadObject(ObjectInputStream.java:427)
	at java.io.ObjectInputStream.readObjectForClass(ObjectInputStream.java:1411)
	at java.io.ObjectInputStream.readHierarchy(ObjectInputStream.java:1321)
	at java.io.ObjectInputStream.readNewObject(ObjectInputStream.java:1981)
	at java.io.ObjectInputStream.readNonPrimitiveContent(ObjectInputStream.java:815)
	at java.io.ObjectInputStream.readObject(ObjectInputStream.java:2133)
	at java.io.ObjectInputStream.readObject(ObjectInputStream.java:2088)
	at org.apache.harmony.testframework.serialization.SerializationTest.getObjectFromStream(SerializationTest.java:208)
	at org.apache.harmony.testframework.serialization.SerializationTest.getObject(SerializationTest.java:530)
	at org.apache.harmony.testframework.serialization.SerializationTest.verifyGolden(SerializationTest.java:388)
	at org.apache.harmony.beans.tests.java.beans.beancontext.BeanContextMembershipEventTest.testSerialization_Compatibility(BeanContextMembershipEventTest.java:261)
	at java.lang.reflect.VMReflection.invokeMethod(VMReflection.java)

Test: testSerializationClass: org.apache.harmony.beans.tests.java.beans.beancontext.BeanContextServiceAvailableEventTestjava.lang.NullPointerException
	at java.io.ObjectStreamClass.buildFieldDescriptors(ObjectStreamClass.java:322)
	at java.io.ObjectStreamClass.createClassDesc(ObjectStreamClass.java:229)
	at java.io.ObjectStreamClass.lookupStreamClass(ObjectStreamClass.java:907)
	at java.io.ObjectStreamClass.lookupStreamClass(ObjectStreamClass.java:884)
	at java.io.ObjectOutputStream.writeObjectInternal(ObjectOutputStream.java:1844)
	at java.io.ObjectOutputStream.writeObject(ObjectOutputStream.java:1770)
	at java.io.ObjectOutputStream.writeObject(ObjectOutputStream.java:1734)
	at java.io.ObjectOutputStream.writeFieldValues(ObjectOutputStream.java:1224)
	at java.io.ObjectOutputStream.defaultWriteObject(ObjectOutputStream.java:302)
	at java.beans.beancontext.BeanContextSupport.writeObject(BeanContextSupport.java:1252)
	at java.lang.reflect.VMReflection.invokeMethod(VMReflection.java)
	at java.io.ObjectOutputStream.writeHierarchy(ObjectOutputStream.java:1301)
	at java.io.ObjectOutputStream.writeNewObject(ObjectOutputStream.java:1659)
	at java.io.ObjectOutputStream.writeObjectInternal(ObjectOutputStream.java:1927)
	at java.io.ObjectOutputStream.writeObject(ObjectOutputStream.java:1770)
	at java.io.ObjectOutputStream.writeObject(ObjectOutputStream.java:1734)
	at java.io.ObjectOutputStream.writeFieldValues(ObjectOutputStream.java:1224)
	at java.io.ObjectOutputStream.defaultWriteObject(ObjectOutputStream.java:302)
	at org.apache.harmony.beans.tests.support.beancontext.mock.MockBeanContextDelegateS.writeObject(MockBeanContextDelegateS.java:243)
	at java.lang.reflect.VMReflection.invokeMethod(VMReflection.java)
	at java.io.ObjectOutputStream.writeHierarchy(ObjectOutputStream.java:1301)
	at java.io.ObjectOutputStream.writeNewObject(ObjectOutputStream.java:1659)
	at java.io.ObjectOutputStream.writeObjectInternal(ObjectOutputStream.java:1927)
	at java.io.ObjectOutputStream.writeObject(ObjectOutputStream.java:1770)
	at java.io.ObjectOutputStream.writeObject(ObjectOutputStream.java:1734)
	at java.io.ObjectOutputStream.writeFieldValues(ObjectOutputStream.java:1224)
	at java.io.ObjectOutputStream.defaultWriteObject(ObjectOutputStream.java:302)
	at java.io.ObjectOutputStream.writeHierarchy(ObjectOutputStream.java:1323)
	at java.io.ObjectOutputStream.writeHierarchy(ObjectOutputStream.java:1287)
	at java.io.ObjectOutputStream.writeNewObject(ObjectOutputStream.java:1659)
	at java.io.ObjectOutputStream.writeObjectInternal(ObjectOutputStream.java:1927)
	at java.io.ObjectOutputStream.writeObject(ObjectOutputStream.java:1770)
	at java.io.ObjectOutputStream.writeObject(ObjectOutputStream.java:1734)
	at tests.util.SerializationTester.getDeserilizedObject(SerializationTester.java:73)
	at org.apache.harmony.beans.tests.java.beans.beancontext.BeanContextServiceAvailableEventTest.testSerialization(BeanContextServiceAvailableEventTest.java:125)
	at java.lang.reflect.VMReflection.invokeMethod(VMReflection.java)

Test: testSerialization_CompatibilityClass: org.apache.harmony.beans.tests.java.beans.beancontext.BeanContextServiceAvailableEventTestjava.lang.NullPointerException
	at java.io.ObjectStreamClass.buildFieldDescriptors(ObjectStreamClass.java:322)
	at java.io.ObjectStreamClass.createClassDesc(ObjectStreamClass.java:229)
	at java.io.ObjectStreamClass.lookupStreamClass(ObjectStreamClass.java:907)
	at java.io.ObjectStreamClass.lookupStreamClass(ObjectStreamClass.java:884)
	at java.io.ObjectInputStream.verifyAndInit(ObjectInputStream.java:2721)
	at java.io.ObjectInputStream.readNewClassDesc(ObjectInputStream.java:1713)
	at java.io.ObjectInputStream.readClassDesc(ObjectInputStream.java:711)
	at java.io.ObjectInputStream.readNewObject(ObjectInputStream.java:1863)
	at java.io.ObjectInputStream.readNonPrimitiveContent(ObjectInputStream.java:815)
	at java.io.ObjectInputStream.readObject(ObjectInputStream.java:2133)
	at java.io.ObjectInputStream.readObject(ObjectInputStream.java:2088)
	at java.io.ObjectInputStream.readFieldValues(ObjectInputStream.java:1179)
	at java.io.ObjectInputStream.defaultReadObject(ObjectInputStream.java:427)
	at java.beans.beancontext.BeanContextSupport.readObject(BeanContextSupport.java:1290)
	at java.lang.reflect.VMReflection.invokeMethod(VMReflection.java)
	at java.io.ObjectInputStream.readObjectForClass(ObjectInputStream.java:1399)
	at java.io.ObjectInputStream.readHierarchy(ObjectInputStream.java:1321)
	at java.io.ObjectInputStream.readNewObject(ObjectInputStream.java:1981)
	at java.io.ObjectInputStream.readNonPrimitiveContent(ObjectInputStream.java:815)
	at java.io.ObjectInputStream.readObject(ObjectInputStream.java:2133)
	at java.io.ObjectInputStream.readObject(ObjectInputStream.java:2088)
	at java.io.ObjectInputStream.readFieldValues(ObjectInputStream.java:1179)
	at java.io.ObjectInputStream.defaultReadObject(ObjectInputStream.java:427)
	at org.apache.harmony.beans.tests.support.beancontext.mock.MockBeanContextDelegateS.readObject(MockBeanContextDelegateS.java:248)
	at java.lang.reflect.VMReflection.invokeMethod(VMReflection.java)
	at java.io.ObjectInputStream.readObjectForClass(ObjectInputStream.java:1399)
	at java.io.ObjectInputStream.readHierarchy(ObjectInputStream.java:1321)
	at java.io.ObjectInputStream.readNewObject(ObjectInputStream.java:1981)
	at java.io.ObjectInputStream.readNonPrimitiveContent(ObjectInputStream.java:815)
	at java.io.ObjectInputStream.readObject(ObjectInputStream.java:2133)
	at java.io.ObjectInputStream.readObject(ObjectInputStream.java:2088)
	at java.io.ObjectInputStream.readFieldValues(ObjectInputStream.java:1179)
	at java.io.ObjectInputStream.defaultReadObject(ObjectInputStream.java:427)
	at java.io.ObjectInputStream.readObjectForClass(ObjectInputStream.java:1411)
	at java.io.ObjectInputStream.readHierarchy(ObjectInputStream.java:1321)
	at java.io.ObjectInputStream.readNewObject(ObjectInputStream.java:1981)
	at java.io.ObjectInputStream.readNonPrimitiveContent(ObjectInputStream.java:815)
	at java.io.ObjectInputStream.readObject(ObjectInputStream.java:2133)
	at java.io.ObjectInputStream.readObject(ObjectInputStream.java:2088)
	at org.apache.harmony.testframework.serialization.SerializationTest.getObjectFromStream(SerializationTest.java:208)
	at org.apache.harmony.testframework.serialization.SerializationTest.getObject(SerializationTest.java:530)
	at org.apache.harmony.testframework.serialization.SerializationTest.verifyGolden(SerializationTest.java:388)
	at org.apache.harmony.beans.tests.java.beans.beancontext.BeanContextServiceAvailableEventTest.testSerialization_Compatibility(BeanContextServiceAvailableEventTest.java:135)
	at java.lang.reflect.VMReflection.invokeMethod(VMReflection.java)

Test: testSerializationClass: org.apache.harmony.beans.tests.java.beans.beancontext.BeanContextServiceRevokedEventTestjava.lang.NullPointerException
	at java.io.ObjectStreamClass.buildFieldDescriptors(ObjectStreamClass.java:322)
	at java.io.ObjectStreamClass.createClassDesc(ObjectStreamClass.java:229)
	at java.io.ObjectStreamClass.lookupStreamClass(ObjectStreamClass.java:907)
	at java.io.ObjectStreamClass.lookupStreamClass(ObjectStreamClass.java:884)
	at java.io.ObjectOutputStream.writeObjectInternal(ObjectOutputStream.java:1844)
	at java.io.ObjectOutputStream.writeObject(ObjectOutputStream.java:1770)
	at java.io.ObjectOutputStream.writeObject(ObjectOutputStream.java:1734)
	at java.io.ObjectOutputStream.writeFieldValues(ObjectOutputStream.java:1224)
	at java.io.ObjectOutputStream.defaultWriteObject(ObjectOutputStream.java:302)
	at java.beans.beancontext.BeanContextSupport.writeObject(BeanContextSupport.java:1252)
	at java.lang.reflect.VMReflection.invokeMethod(VMReflection.java)
	at java.io.ObjectOutputStream.writeHierarchy(ObjectOutputStream.java:1301)
	at java.io.ObjectOutputStream.writeNewObject(ObjectOutputStream.java:1659)
	at java.io.ObjectOutputStream.writeObjectInternal(ObjectOutputStream.java:1927)
	at java.io.ObjectOutputStream.writeObject(ObjectOutputStream.java:1770)
	at java.io.ObjectOutputStream.writeObject(ObjectOutputStream.java:1734)
	at java.io.ObjectOutputStream.writeFieldValues(ObjectOutputStream.java:1224)
	at java.io.ObjectOutputStream.defaultWriteObject(ObjectOutputStream.java:302)
	at org.apache.harmony.beans.tests.support.beancontext.mock.MockBeanContextDelegateS.writeObject(MockBeanContextDelegateS.java:243)
	at java.lang.reflect.VMReflection.invokeMethod(VMReflection.java)
	at java.io.ObjectOutputStream.writeHierarchy(ObjectOutputStream.java:1301)
	at java.io.ObjectOutputStream.writeNewObject(ObjectOutputStream.java:1659)
	at java.io.ObjectOutputStream.writeObjectInternal(ObjectOutputStream.java:1927)
	at java.io.ObjectOutputStream.writeObject(ObjectOutputStream.java:1770)
	at java.io.ObjectOutputStream.writeObject(ObjectOutputStream.java:1734)
	at java.io.ObjectOutputStream.writeFieldValues(ObjectOutputStream.java:1224)
	at java.io.ObjectOutputStream.defaultWriteObject(ObjectOutputStream.java:302)
	at java.io.ObjectOutputStream.writeHierarchy(ObjectOutputStream.java:1323)
	at java.io.ObjectOutputStream.writeHierarchy(ObjectOutputStream.java:1287)
	at java.io.ObjectOutputStream.writeNewObject(ObjectOutputStream.java:1659)
	at java.io.ObjectOutputStream.writeObjectInternal(ObjectOutputStream.java:1927)
	at java.io.ObjectOutputStream.writeObject(ObjectOutputStream.java:1770)
	at java.io.ObjectOutputStream.writeObject(ObjectOutputStream.java:1734)
	at tests.util.SerializationTester.getDeserilizedObject(SerializationTester.java:73)
	at org.apache.harmony.beans.tests.java.beans.beancontext.BeanContextServiceRevokedEventTest.testSerialization(BeanContextServiceRevokedEventTest.java:161)
	at java.lang.reflect.VMReflection.invokeMethod(VMReflection.java)

Test: testSerialization_CompatibilityClass: org.apache.harmony.beans.tests.java.beans.beancontext.BeanContextServiceRevokedEventTestjava.lang.NullPointerException
	at java.io.ObjectStreamClass.buildFieldDescriptors(ObjectStreamClass.java:322)
	at java.io.ObjectStreamClass.createClassDesc(ObjectStreamClass.java:229)
	at java.io.ObjectStreamClass.lookupStreamClass(ObjectStreamClass.java:907)
	at java.io.ObjectStreamClass.lookupStreamClass(ObjectStreamClass.java:884)
	at java.io.ObjectInputStream.verifyAndInit(ObjectInputStream.java:2721)
	at java.io.ObjectInputStream.readNewClassDesc(ObjectInputStream.java:1713)
	at java.io.ObjectInputStream.readClassDesc(ObjectInputStream.java:711)
	at java.io.ObjectInputStream.readNewObject(ObjectInputStream.java:1863)
	at java.io.ObjectInputStream.readNonPrimitiveContent(ObjectInputStream.java:815)
	at java.io.ObjectInputStream.readObject(ObjectInputStream.java:2133)
	at java.io.ObjectInputStream.readObject(ObjectInputStream.java:2088)
	at java.io.ObjectInputStream.readFieldValues(ObjectInputStream.java:1179)
	at java.io.ObjectInputStream.defaultReadObject(ObjectInputStream.java:427)
	at java.beans.beancontext.BeanContextSupport.readObject(BeanContextSupport.java:1290)
	at java.lang.reflect.VMReflection.invokeMethod(VMReflection.java)
	at java.io.ObjectInputStream.readObjectForClass(ObjectInputStream.java:1399)
	at java.io.ObjectInputStream.readHierarchy(ObjectInputStream.java:1321)
	at java.io.ObjectInputStream.readNewObject(ObjectInputStream.java:1981)
	at java.io.ObjectInputStream.readNonPrimitiveContent(ObjectInputStream.java:815)
	at java.io.ObjectInputStream.readObject(ObjectInputStream.java:2133)
	at java.io.ObjectInputStream.readObject(ObjectInputStream.java:2088)
	at java.io.ObjectInputStream.readFieldValues(ObjectInputStream.java:1179)
	at java.io.ObjectInputStream.defaultReadObject(ObjectInputStream.java:427)
	at org.apache.harmony.beans.tests.support.beancontext.mock.MockBeanContextDelegateS.readObject(MockBeanContextDelegateS.java:248)
	at java.lang.reflect.VMReflection.invokeMethod(VMReflection.java)
	at java.io.ObjectInputStream.readObjectForClass(ObjectInputStream.java:1399)
	at java.io.ObjectInputStream.readHierarchy(ObjectInputStream.java:1321)
	at java.io.ObjectInputStream.readNewObject(ObjectInputStream.java:1981)
	at java.io.ObjectInputStream.readNonPrimitiveContent(ObjectInputStream.java:815)
	at java.io.ObjectInputStream.readObject(ObjectInputStream.java:2133)
	at java.io.ObjectInputStream.readObject(ObjectInputStream.java:2088)
	at java.io.ObjectInputStream.readFieldValues(ObjectInputStream.java:1179)
	at java.io.ObjectInputStream.defaultReadObject(ObjectInputStream.java:427)
	at java.io.ObjectInputStream.readObjectForClass(ObjectInputStream.java:1411)
	at java.io.ObjectInputStream.readHierarchy(ObjectInputStream.java:1321)
	at java.io.ObjectInputStream.readNewObject(ObjectInputStream.java:1981)
	at java.io.ObjectInputStream.readNonPrimitiveContent(ObjectInputStream.java:815)
	at java.io.ObjectInputStream.readObject(ObjectInputStream.java:2133)
	at java.io.ObjectInputStream.readObject(ObjectInputStream.java:2088)
	at org.apache.harmony.testframework.serialization.SerializationTest.getObjectFromStream(SerializationTest.java:208)
	at org.apache.harmony.testframework.serialization.SerializationTest.getObject(SerializationTest.java:530)
	at org.apache.harmony.testframework.serialization.SerializationTest.verifyGolden(SerializationTest.java:388)
	at org.apache.harmony.beans.tests.java.beans.beancontext.BeanContextServiceRevokedEventTest.testSerialization_Compatibility(BeanContextServiceRevokedEventTest.java:170)
	at java.lang.reflect.VMReflection.invokeMethod(VMReflection.java)

Test: testSerializationClass: org.apache.harmony.beans.tests.java.beans.beancontext.BeanContextServicesSupportTestjava.lang.NullPointerException
	at java.io.ObjectStreamClass.buildFieldDescriptors(ObjectStreamClass.java:322)
	at java.io.ObjectStreamClass.createClassDesc(ObjectStreamClass.java:229)
	at java.io.ObjectStreamClass.lookupStreamClass(ObjectStreamClass.java:907)
	at java.io.ObjectStreamClass.lookupStreamClass(ObjectStreamClass.java:884)
	at java.io.ObjectOutputStream.writeObjectInternal(ObjectOutputStream.java:1844)
	at java.io.ObjectOutputStream.writeObject(ObjectOutputStream.java:1770)
	at java.io.ObjectOutputStream.writeObject(ObjectOutputStream.java:1734)
	at java.io.ObjectOutputStream.writeFieldValues(ObjectOutputStream.java:1224)
	at java.io.ObjectOutputStream.defaultWriteObject(ObjectOutputStream.java:302)
	at java.beans.beancontext.BeanContextSupport.writeObject(BeanContextSupport.java:1252)
	at java.lang.reflect.VMReflection.invokeMethod(VMReflection.java)
	at java.io.ObjectOutputStream.writeHierarchy(ObjectOutputStream.java:1301)
	at java.io.ObjectOutputStream.writeHierarchy(ObjectOutputStream.java:1287)
	at java.io.ObjectOutputStream.writeNewObject(ObjectOutputStream.java:1659)
	at java.io.ObjectOutputStream.writeObjectInternal(ObjectOutputStream.java:1927)
	at java.io.ObjectOutputStream.writeObject(ObjectOutputStream.java:1770)
	at java.io.ObjectOutputStream.writeObject(ObjectOutputStream.java:1734)
	at tests.util.SerializationTester.getDeserilizedObject(SerializationTester.java:73)
	at org.apache.harmony.beans.tests.java.beans.beancontext.BeanContextServicesSupportTest.testSerialization(BeanContextServicesSupportTest.java:1309)
	at java.lang.reflect.VMReflection.invokeMethod(VMReflection.java)

Test: testSerialization_CompatibilityClass: org.apache.harmony.beans.tests.java.beans.beancontext.BeanContextServicesSupportTestjava.lang.NullPointerException
	at java.io.ObjectStreamClass.buildFieldDescriptors(ObjectStreamClass.java:322)
	at java.io.ObjectStreamClass.createClassDesc(ObjectStreamClass.java:229)
	at java.io.ObjectStreamClass.lookupStreamClass(ObjectStreamClass.java:907)
	at java.io.ObjectStreamClass.lookupStreamClass(ObjectStreamClass.java:884)
	at java.io.ObjectInputStream.verifyAndInit(ObjectInputStream.java:2721)
	at java.io.ObjectInputStream.readNewClassDesc(ObjectInputStream.java:1713)
	at java.io.ObjectInputStream.readClassDesc(ObjectInputStream.java:711)
	at java.io.ObjectInputStream.readNewObject(ObjectInputStream.java:1863)
	at java.io.ObjectInputStream.readNonPrimitiveContent(ObjectInputStream.java:815)
	at java.io.ObjectInputStream.readObject(ObjectInputStream.java:2133)
	at java.io.ObjectInputStream.readObject(ObjectInputStream.java:2088)
	at java.io.ObjectInputStream.readFieldValues(ObjectInputStream.java:1179)
	at java.io.ObjectInputStream.defaultReadObject(ObjectInputStream.java:427)
	at java.beans.beancontext.BeanContextSupport.readObject(BeanContextSupport.java:1290)
	at java.lang.reflect.VMReflection.invokeMethod(VMReflection.java)
	at java.io.ObjectInputStream.readObjectForClass(ObjectInputStream.java:1399)
	at java.io.ObjectInputStream.readHierarchy(ObjectInputStream.java:1321)
	at java.io.ObjectInputStream.readNewObject(ObjectInputStream.java:1981)
	at java.io.ObjectInputStream.readNonPrimitiveContent(ObjectInputStream.java:815)
	at java.io.ObjectInputStream.readObject(ObjectInputStream.java:2133)
	at java.io.ObjectInputStream.readObject(ObjectInputStream.java:2088)
	at org.apache.harmony.testframework.serialization.SerializationTest.getObjectFromStream(SerializationTest.java:208)
	at org.apache.harmony.testframework.serialization.SerializationTest.getObject(SerializationTest.java:530)
	at org.apache.harmony.testframework.serialization.SerializationTest.verifyGolden(SerializationTest.java:388)
	at org.apache.harmony.beans.tests.java.beans.beancontext.BeanContextServicesSupportTest.testSerialization_Compatibility(BeanContextServicesSupportTest.java:1337)
	at java.lang.reflect.VMReflection.invokeMethod(VMReflection.java)

Test: testBcsPreDeserializationHookClass: org.apache.harmony.beans.tests.java.beans.beancontext.BeanContextSupportTestjava.lang.NullPointerException
	at java.io.ObjectStreamClass.buildFieldDescriptors(ObjectStreamClass.java:322)
	at java.io.ObjectStreamClass.createClassDesc(ObjectStreamClass.java:229)
	at java.io.ObjectStreamClass.lookupStreamClass(ObjectStreamClass.java:907)
	at java.io.ObjectStreamClass.lookupStreamClass(ObjectStreamClass.java:884)
	at java.io.ObjectOutputStream.writeObjectInternal(ObjectOutputStream.java:1844)
	at java.io.ObjectOutputStream.writeObject(ObjectOutputStream.java:1770)
	at java.io.ObjectOutputStream.writeObject(ObjectOutputStream.java:1734)
	at java.io.ObjectOutputStream.writeFieldValues(ObjectOutputStream.java:1224)
	at java.io.ObjectOutputStream.defaultWriteObject(ObjectOutputStream.java:302)
	at java.beans.beancontext.BeanContextSupport.writeObject(BeanContextSupport.java:1252)
	at java.lang.reflect.VMReflection.invokeMethod(VMReflection.java)
	at java.io.ObjectOutputStream.writeHierarchy(ObjectOutputStream.java:1301)
	at java.io.ObjectOutputStream.writeHierarchy(ObjectOutputStream.java:1287)
	at java.io.ObjectOutputStream.writeNewObject(ObjectOutputStream.java:1659)
	at java.io.ObjectOutputStream.writeObjectInternal(ObjectOutputStream.java:1927)
	at java.io.ObjectOutputStream.writeObject(ObjectOutputStream.java:1770)
	at java.io.ObjectOutputStream.writeObject(ObjectOutputStream.java:1734)
	at org.apache.harmony.beans.tests.java.beans.beancontext.BeanContextSupportTest.serialize(BeanContextSupportTest.java:2079)
	at org.apache.harmony.beans.tests.java.beans.beancontext.BeanContextSupportTest.testBcsPreDeserializationHook(BeanContextSupportTest.java:662)
	at java.lang.reflect.VMReflection.invokeMethod(VMReflection.java)

Test: testBcsPreSerializationHookClass: org.apache.harmony.beans.tests.java.beans.beancontext.BeanContextSupportTestjava.lang.NullPointerException
	at java.io.ObjectStreamClass.buildFieldDescriptors(ObjectStreamClass.java:322)
	at java.io.ObjectStreamClass.createClassDesc(ObjectStreamClass.java:229)
	at java.io.ObjectStreamClass.lookupStreamClass(ObjectStreamClass.java:907)
	at java.io.ObjectStreamClass.lookupStreamClass(ObjectStreamClass.java:884)
	at java.io.ObjectOutputStream.writeObjectInternal(ObjectOutputStream.java:1844)
	at java.io.ObjectOutputStream.writeObject(ObjectOutputStream.java:1770)
	at java.io.ObjectOutputStream.writeObject(ObjectOutputStream.java:1734)
	at java.io.ObjectOutputStream.writeFieldValues(ObjectOutputStream.java:1224)
	at java.io.ObjectOutputStream.defaultWriteObject(ObjectOutputStream.java:302)
	at java.beans.beancontext.BeanContextSupport.writeObject(BeanContextSupport.java:1252)
	at java.lang.reflect.VMReflection.invokeMethod(VMReflection.java)
	at java.io.ObjectOutputStream.writeHierarchy(ObjectOutputStream.java:1301)
	at java.io.ObjectOutputStream.writeHierarchy(ObjectOutputStream.java:1287)
	at java.io.ObjectOutputStream.writeNewObject(ObjectOutputStream.java:1659)
	at java.io.ObjectOutputStream.writeObjectInternal(ObjectOutputStream.java:1927)
	at java.io.ObjectOutputStream.writeObject(ObjectOutputStream.java:1770)
	at java.io.ObjectOutputStream.writeObject(ObjectOutputStream.java:1734)
	at org.apache.harmony.beans.tests.java.beans.beancontext.BeanContextSupportTest.serialize(BeanContextSupportTest.java:2079)
	at org.apache.harmony.beans.tests.java.beans.beancontext.BeanContextSupportTest.testBcsPreSerializationHook(BeanContextSupportTest.java:688)
	at java.lang.reflect.VMReflection.invokeMethod(VMReflection.java)

Test: testChildDeserializedHookClass: org.apache.harmony.beans.tests.java.beans.beancontext.BeanContextSupportTestjava.lang.NullPointerException
	at java.io.ObjectStreamClass.buildFieldDescriptors(ObjectStreamClass.java:322)
	at java.io.ObjectStreamClass.createClassDesc(ObjectStreamClass.java:229)
	at java.io.ObjectStreamClass.lookupStreamClass(ObjectStreamClass.java:907)
	at java.io.ObjectStreamClass.lookupStreamClass(ObjectStreamClass.java:884)
	at java.io.ObjectOutputStream.writeObjectInternal(ObjectOutputStream.java:1844)
	at java.io.ObjectOutputStream.writeObject(ObjectOutputStream.java:1770)
	at java.io.ObjectOutputStream.writeObject(ObjectOutputStream.java:1734)
	at java.io.ObjectOutputStream.writeFieldValues(ObjectOutputStream.java:1224)
	at java.io.ObjectOutputStream.defaultWriteObject(ObjectOutputStream.java:302)
	at java.beans.beancontext.BeanContextSupport.writeObject(BeanContextSupport.java:1252)
	at java.lang.reflect.VMReflection.invokeMethod(VMReflection.java)
	at java.io.ObjectOutputStream.writeHierarchy(ObjectOutputStream.java:1301)
	at java.io.ObjectOutputStream.writeHierarchy(ObjectOutputStream.java:1287)
	at java.io.ObjectOutputStream.writeNewObject(ObjectOutputStream.java:1659)
	at java.io.ObjectOutputStream.writeObjectInternal(ObjectOutputStream.java:1927)
	at java.io.ObjectOutputStream.writeObject(ObjectOutputStream.java:1770)
	at java.io.ObjectOutputStream.writeObject(ObjectOutputStream.java:1734)
	at org.apache.harmony.beans.tests.java.beans.beancontext.BeanContextSupportTest.serialize(BeanContextSupportTest.java:2079)
	at org.apache.harmony.beans.tests.java.beans.beancontext.BeanContextSupportTest.testChildDeserializedHook(BeanContextSupportTest.java:794)
	at java.lang.reflect.VMReflection.invokeMethod(VMReflection.java)

Test: testReadChildrenClass: org.apache.harmony.beans.tests.java.beans.beancontext.BeanContextSupportTestjava.lang.NullPointerException
	at java.io.ObjectStreamClass.buildFieldDescriptors(ObjectStreamClass.java:322)
	at java.io.ObjectStreamClass.createClassDesc(ObjectStreamClass.java:229)
	at java.io.ObjectStreamClass.lookupStreamClass(ObjectStreamClass.java:907)
	at java.io.ObjectStreamClass.lookupStreamClass(ObjectStreamClass.java:884)
	at java.io.ObjectOutputStream.writeObjectInternal(ObjectOutputStream.java:1844)
	at java.io.ObjectOutputStream.writeObject(ObjectOutputStream.java:1770)
	at java.io.ObjectOutputStream.writeObject(ObjectOutputStream.java:1734)
	at java.io.ObjectOutputStream.writeFieldValues(ObjectOutputStream.java:1224)
	at java.io.ObjectOutputStream.defaultWriteObject(ObjectOutputStream.java:302)
	at java.beans.beancontext.BeanContextSupport.writeObject(BeanContextSupport.java:1252)
	at java.lang.reflect.VMReflection.invokeMethod(VMReflection.java)
	at java.io.ObjectOutputStream.writeHierarchy(ObjectOutputStream.java:1301)
	at java.io.ObjectOutputStream.writeHierarchy(ObjectOutputStream.java:1287)
	at java.io.ObjectOutputStream.writeNewObject(ObjectOutputStream.java:1659)
	at java.io.ObjectOutputStream.writeObjectInternal(ObjectOutputStream.java:1927)
	at java.io.ObjectOutputStream.writeObject(ObjectOutputStream.java:1770)
	at java.io.ObjectOutputStream.writeObject(ObjectOutputStream.java:1734)
	at java.io.ObjectOutputStream.writeFieldValues(ObjectOutputStream.java:1224)
	at java.io.ObjectOutputStream.defaultWriteObject(ObjectOutputStream.java:302)
	at java.io.ObjectOutputStream.writeHierarchy(ObjectOutputStream.java:1323)
	at java.io.ObjectOutputStream.writeNewObject(ObjectOutputStream.java:1659)
	at java.io.ObjectOutputStream.writeObjectInternal(ObjectOutputStream.java:1927)
	at java.io.ObjectOutputStream.writeObject(ObjectOutputStream.java:1770)
	at java.io.ObjectOutputStream.writeObject(ObjectOutputStream.java:1734)
	at java.beans.beancontext.BeanContextSupport.writeChildren(BeanContextSupport.java:1199)
	at org.apache.harmony.beans.tests.java.beans.beancontext.BeanContextSupportTest.testReadChildren(BeanContextSupportTest.java:1405)
	at java.lang.reflect.VMReflection.invokeMethod(VMReflection.java)

Test: testSerialization_NoPeerClass: org.apache.harmony.beans.tests.java.beans.beancontext.BeanContextSupportTestjava.lang.NullPointerException
	at java.io.ObjectStreamClass.buildFieldDescriptors(ObjectStreamClass.java:322)
	at java.io.ObjectStreamClass.createClassDesc(ObjectStreamClass.java:229)
	at java.io.ObjectStreamClass.lookupStreamClass(ObjectStreamClass.java:907)
	at java.io.ObjectStreamClass.lookupStreamClass(ObjectStreamClass.java:884)
	at java.io.ObjectOutputStream.writeObjectInternal(ObjectOutputStream.java:1844)
	at java.io.ObjectOutputStream.writeObject(ObjectOutputStream.java:1770)
	at java.io.ObjectOutputStream.writeObject(ObjectOutputStream.java:1734)
	at java.io.ObjectOutputStream.writeFieldValues(ObjectOutputStream.java:1224)
	at java.io.ObjectOutputStream.defaultWriteObject(ObjectOutputStream.java:302)
	at java.beans.beancontext.BeanContextSupport.writeObject(BeanContextSupport.java:1252)
	at java.lang.reflect.VMReflection.invokeMethod(VMReflection.java)
	at java.io.ObjectOutputStream.writeHierarchy(ObjectOutputStream.java:1301)
	at java.io.ObjectOutputStream.writeNewObject(ObjectOutputStream.java:1659)
	at java.io.ObjectOutputStream.writeObjectInternal(ObjectOutputStream.java:1927)
	at java.io.ObjectOutputStream.writeObject(ObjectOutputStream.java:1770)
	at java.io.ObjectOutputStream.writeObject(ObjectOutputStream.java:1734)
	at tests.util.SerializationTester.getDeserilizedObject(SerializationTester.java:73)
	at org.apache.harmony.beans.tests.java.beans.beancontext.BeanContextSupportTest.testSerialization_NoPeer(BeanContextSupportTest.java:2014)
	at java.lang.reflect.VMReflection.invokeMethod(VMReflection.java)

Test: testSerialization_PeerClass: org.apache.harmony.beans.tests.java.beans.beancontext.BeanContextSupportTestjava.lang.NullPointerException
	at java.io.ObjectStreamClass.buildFieldDescriptors(ObjectStreamClass.java:322)
	at java.io.ObjectStreamClass.createClassDesc(ObjectStreamClass.java:229)
	at java.io.ObjectStreamClass.lookupStreamClass(ObjectStreamClass.java:907)
	at java.io.ObjectStreamClass.lookupStreamClass(ObjectStreamClass.java:884)
	at java.io.ObjectOutputStream.writeObjectInternal(ObjectOutputStream.java:1844)
	at java.io.ObjectOutputStream.writeObject(ObjectOutputStream.java:1770)
	at java.io.ObjectOutputStream.writeObject(ObjectOutputStream.java:1734)
	at java.io.ObjectOutputStream.writeFieldValues(ObjectOutputStream.java:1224)
	at java.io.ObjectOutputStream.defaultWriteObject(ObjectOutputStream.java:302)
	at java.beans.beancontext.BeanContextSupport.writeObject(BeanContextSupport.java:1252)
	at java.lang.reflect.VMReflection.invokeMethod(VMReflection.java)
	at java.io.ObjectOutputStream.writeHierarchy(ObjectOutputStream.java:1301)
	at java.io.ObjectOutputStream.writeNewObject(ObjectOutputStream.java:1659)
	at java.io.ObjectOutputStream.writeObjectInternal(ObjectOutputStream.java:1927)
	at java.io.ObjectOutputStream.writeObject(ObjectOutputStream.java:1770)
	at java.io.ObjectOutputStream.writeObject(ObjectOutputStream.java:1734)
	at java.io.ObjectOutputStream.writeFieldValues(ObjectOutputStream.java:1224)
	at java.io.ObjectOutputStream.defaultWriteObject(ObjectOutputStream.java:302)
	at org.apache.harmony.beans.tests.support.beancontext.mock.MockBeanContextDelegateS.writeObject(MockBeanContextDelegateS.java:243)
	at java.lang.reflect.VMReflection.invokeMethod(VMReflection.java)
	at java.io.ObjectOutputStream.writeHierarchy(ObjectOutputStream.java:1301)
	at java.io.ObjectOutputStream.writeNewObject(ObjectOutputStream.java:1659)
	at java.io.ObjectOutputStream.writeObjectInternal(ObjectOutputStream.java:1927)
	at java.io.ObjectOutputStream.writeObject(ObjectOutputStream.java:1770)
	at java.io.ObjectOutputStream.writeObject(ObjectOutputStream.java:1734)
	at tests.util.SerializationTester.getDeserilizedObject(SerializationTester.java:73)
	at org.apache.harmony.beans.tests.java.beans.beancontext.BeanContextSupportTest.testSerialization_Peer(BeanContextSupportTest.java:2040)
	at java.lang.reflect.VMReflection.invokeMethod(VMReflection.java)

Test: testSerialization_CompatibilityClass: org.apache.harmony.beans.tests.java.beans.beancontext.BeanContextSupportTestjava.lang.NullPointerException
	at java.io.ObjectStreamClass.buildFieldDescriptors(ObjectStreamClass.java:322)
	at java.io.ObjectStreamClass.createClassDesc(ObjectStreamClass.java:229)
	at java.io.ObjectStreamClass.lookupStreamClass(ObjectStreamClass.java:907)
	at java.io.ObjectStreamClass.lookupStreamClass(ObjectStreamClass.java:884)
	at java.io.ObjectInputStream.verifyAndInit(ObjectInputStream.java:2721)
	at java.io.ObjectInputStream.readNewClassDesc(ObjectInputStream.java:1713)
	at java.io.ObjectInputStream.readClassDesc(ObjectInputStream.java:711)
	at java.io.ObjectInputStream.readNewObject(ObjectInputStream.java:1863)
	at java.io.ObjectInputStream.readNonPrimitiveContent(ObjectInputStream.java:815)
	at java.io.ObjectInputStream.readObject(ObjectInputStream.java:2133)
	at java.io.ObjectInputStream.readObject(ObjectInputStream.java:2088)
	at java.io.ObjectInputStream.readFieldValues(ObjectInputStream.java:1179)
	at java.io.ObjectInputStream.defaultReadObject(ObjectInputStream.java:427)
	at java.beans.beancontext.BeanContextSupport.readObject(BeanContextSupport.java:1290)
	at java.lang.reflect.VMReflection.invokeMethod(VMReflection.java)
	at java.io.ObjectInputStream.readObjectForClass(ObjectInputStream.java:1399)
	at java.io.ObjectInputStream.readHierarchy(ObjectInputStream.java:1321)
	at java.io.ObjectInputStream.readNewObject(ObjectInputStream.java:1981)
	at java.io.ObjectInputStream.readNonPrimitiveContent(ObjectInputStream.java:815)
	at java.io.ObjectInputStream.readObject(ObjectInputStream.java:2133)
	at java.io.ObjectInputStream.readObject(ObjectInputStream.java:2088)
	at java.io.ObjectInputStream.readFieldValues(ObjectInputStream.java:1179)
	at java.io.ObjectInputStream.defaultReadObject(ObjectInputStream.java:427)
	at org.apache.harmony.beans.tests.support.beancontext.mock.MockBeanContextDelegateS.readObject(MockBeanContextDelegateS.java:248)
	at java.lang.reflect.VMReflection.invokeMethod(VMReflection.java)
	at java.io.ObjectInputStream.readObjectForClass(ObjectInputStream.java:1399)
	at java.io.ObjectInputStream.readHierarchy(ObjectInputStream.java:1321)
	at java.io.ObjectInputStream.readNewObject(ObjectInputStream.java:1981)
	at java.io.ObjectInputStream.readNonPrimitiveContent(ObjectInputStream.java:815)
	at java.io.ObjectInputStream.readObject(ObjectInputStream.java:2133)
	at java.io.ObjectInputStream.readObject(ObjectInputStream.java:2088)
	at org.apache.harmony.testframework.serialization.SerializationTest.getObjectFromStream(SerializationTest.java:208)
	at org.apache.harmony.testframework.serialization.SerializationTest.getObject(SerializationTest.java:530)
	at org.apache.harmony.testframework.serialization.SerializationTest.verifyGolden(SerializationTest.java:388)
	at org.apache.harmony.beans.tests.java.beans.beancontext.BeanContextSupportTest.testSerialization_Compatibility(BeanContextSupportTest.java:2063)
	at java.lang.reflect.VMReflection.invokeMethod(VMReflection.java)

Test: testSelfSerializatoinClass: org.apache.harmony.beans.tests.java.beans.beancontext.BeanContextSupportTestjava.lang.NullPointerException
	at java.io.ObjectStreamClass.buildFieldDescriptors(ObjectStreamClass.java:322)
	at java.io.ObjectStreamClass.createClassDesc(ObjectStreamClass.java:229)
	at java.io.ObjectStreamClass.lookupStreamClass(ObjectStreamClass.java:907)
	at java.io.ObjectStreamClass.lookupStreamClass(ObjectStreamClass.java:884)
	at java.io.ObjectOutputStream.writeObjectInternal(ObjectOutputStream.java:1844)
	at java.io.ObjectOutputStream.writeObject(ObjectOutputStream.java:1770)
	at java.io.ObjectOutputStream.writeObject(ObjectOutputStream.java:1734)
	at java.io.ObjectOutputStream.writeFieldValues(ObjectOutputStream.java:1224)
	at java.io.ObjectOutputStream.defaultWriteObject(ObjectOutputStream.java:302)
	at java.beans.beancontext.BeanContextSupport.writeObject(BeanContextSupport.java:1252)
	at java.lang.reflect.VMReflection.invokeMethod(VMReflection.java)
	at java.io.ObjectOutputStream.writeHierarchy(ObjectOutputStream.java:1301)
	at java.io.ObjectOutputStream.writeNewObject(ObjectOutputStream.java:1659)
	at java.io.ObjectOutputStream.writeObjectInternal(ObjectOutputStream.java:1927)
	at java.io.ObjectOutputStream.writeObject(ObjectOutputStream.java:1770)
	at java.io.ObjectOutputStream.writeObject(ObjectOutputStream.java:1734)
	at org.apache.harmony.beans.tests.java.beans.beancontext.BeanContextSupportTest.testSelfSerializatoin(BeanContextSupportTest.java:2189)
	at java.lang.reflect.VMReflection.invokeMethod(VMReflection.java)


***********************************************************
Modifications since last successful build:	(13)
            
modified tonywu  /harmony/enhanced/classlib/trunk/modules/luni/src/test/api/common/tests/api/java/io/SerializationStressTest5.java 07/04/2007 22:21:07 clean up compiler warnings in io module, no functional change.
modified tonywu  /harmony/enhanced/classlib/trunk/modules/luni/src/test/api/common/tests/api/java/io/StreamTokenizerTest.java 07/04/2007 22:21:07 clean up compiler warnings in io module, no functional change.
modified tonywu  /harmony/enhanced/classlib/trunk/modules/luni/src/test/api/common/tests/api/java/io/StringBufferInputStreamTest.java 07/04/2007 22:21:07 clean up compiler warnings in io module, no functional change.
modified tonywu  /harmony/enhanced/classlib/trunk/modules/luni/src/test/api/common/tests/api/java/io/SerializationStressTest.java 07/04/2007 22:21:07 clean up compiler warnings in io module, no functional change.
modified tonywu  /harmony/enhanced/classlib/trunk/modules/luni/src/test/api/common/tests/api/java/io/SerializationStressTest1.java 07/04/2007 22:21:07 clean up compiler warnings in io module, no functional change.
modified tonywu  /harmony/enhanced/classlib/trunk/modules/luni/src/test/api/common/tests/api/java/io/SerializationStressTest2.java 07/04/2007 22:21:07 clean up compiler warnings in io module, no functional change.
modified tonywu  /harmony/enhanced/classlib/trunk/modules/luni/src/test/api/common/tests/api/java/io/SerializationStressTest3.java 07/04/2007 22:21:07 clean up compiler warnings in io module, no functional change.
modified tonywu  /harmony/enhanced/classlib/trunk/modules/luni/src/test/api/common/tests/api/java/io/SerializationStressTest4.java 07/04/2007 22:21:07 clean up compiler warnings in io module, no functional change.
added tonywu  /harmony/enhanced/classlib/trunk/modules/luni/src/test/api/common/tests/api/java/io/InputStreamTest.java 07/04/2007 19:59:54 Fix Harmony-4337 ([classlib][luni] Compatibility: InputStream.read(null, offset, len) exception throwing order differs on Harmony and RI if offset is negative)
modified tonywu  /harmony/enhanced/classlib/trunk/modules/luni/src/main/java/java/io/InputStream.java 07/04/2007 19:59:54 Fix Harmony-4337 ([classlib][luni] Compatibility: InputStream.read(null, offset, len) exception throwing order differs on Harmony and RI if offset is negative)
modified apetrenko  /harmony/enhanced/classlib/trunk/modules/awt/src/main/java/common/org/apache/harmony/awt/gl/CommonGraphics2DFactory.java 07/04/2007 17:54:26 Patch for HARMONY-3719 "Graphics.getFontMetrics() throws HeadlessExcetion if headless"
modified apetrenko  /harmony/enhanced/classlib/trunk/modules/awt/src/main/java/common/org/apache/harmony/awt/wtk/GraphicsFactory.java 07/04/2007 17:54:26 Patch for HARMONY-3719 "Graphics.getFontMetrics() throws HeadlessExcetion if headless"
modified apetrenko  /harmony/enhanced/classlib/trunk/modules/awt/src/main/java/common/java/awt/ToolkitImpl.java 07/04/2007 17:54:26 Patch for HARMONY-3719 "Graphics.getFontMetrics() throws HeadlessExcetion if headless"

Mime
View raw message