harmony-alerts mailing list archives

Site index · List index
Message view « Date » · « Thread »
Top « Date » · « Thread »
From nom...@intel.com
Subject [build-test alert] BUILD FAILED Windows server 2003 x86_64: tomcat start
Date Wed, 04 Jul 2007 05:34:14 GMT
BUILD FAILED:
	Ant Error Message:
C:\cruise_hdk\cc\apps\apache-tomcat-5.5.20\build.xml:60: java.net.ConnectException: Connection
refused: connect

Date of build:	07/04/2007 12:01:31
Time to build:	1 minute 42 seconds
Last changed:	07/04/2007 11:00:31
Last log entry:	

***********************************************************
Unit Tests: (0)
        
No Tests Run: This project doesn't have any tests

***********************************************************
Modifications since last successful build:	(1)
            
change viv time build/ time build 07/04/2007 11:00:31 

Mime
View raw message