harmony-alerts mailing list archives

Site index · List index
Message view « Date » · « Thread »
Top « Date » · « Thread »
From nbe...@kc.rr.com
Subject [build-test alert] BUILD FAILED Windows XP x86: drlvm-test
Date Tue, 03 Jul 2007 23:58:05 GMT
BUILD FAILED:
	Ant Error Message:
C:\harmony\buildtest2\scripts\cc-exec-adaptor.xml:101: The following error occurred while
executing this line: C:\harmony\buildtest2\adaptors\drlvm-test\adaptor.xml:75: There were
drlvm-test failures

Date of build:	07/03/2007 13:44:12
Time to build:	312 minutes 25 seconds
Last changed:	07/03/2007 13:09:36
Last log entry:	classlib

***********************************************************
Errors/Warnings:	(103)
            
[java] Timeout: killed the sub-process
[java] 	at org.apache.tools.ant.taskdefs.Java.fork(Java.java:754)
[java] 	at org.apache.tools.ant.taskdefs.Java.executeJava(Java.java:171)
[java] 	at org.apache.tools.ant.taskdefs.Java.execute(Java.java:84)
[java] 	at org.apache.tools.ant.UnknownElement.execute(UnknownElement.java:275)
[java] 	at org.apache.tools.ant.Task.perform(Task.java:364)
[java] 	at org.apache.tools.ant.taskdefs.Sequential.execute(Sequential.java:64)
[java] 	at net.sf.antcontrib.logic.IfTask.execute(IfTask.java:197)
[java] 	at sun.reflect.GeneratedMethodAccessor101.invoke(Unknown Source)
[java] 	at sun.reflect.DelegatingMethodAccessorImpl.invoke(DelegatingMethodAccessorImpl.java:25)
[java] 	at java.lang.reflect.Method.invoke(Method.java:585)
[java] 	at org.apache.tools.ant.TaskAdapter.execute(TaskAdapter.java:123)
[java] 	at org.apache.tools.ant.UnknownElement.execute(UnknownElement.java:275)
[java] 	at org.apache.tools.ant.Task.perform(Task.java:364)
[java] 	at org.apache.tools.ant.taskdefs.Sequential.execute(Sequential.java:64)
[java] 	at org.apache.tools.ant.UnknownElement.execute(UnknownElement.java:275)
[java] 	at org.apache.tools.ant.Task.perform(Task.java:364)
[java] 	at org.apache.tools.ant.taskdefs.MacroInstance.execute(MacroInstance.java:378)
[java] 	at net.sf.antcontrib.logic.ForDelegate.doSequentialIteration(ForDelegate.java:228)
[java] 	at net.sf.antcontrib.logic.ForDelegate.doTheTasks(ForDelegate.java:281)
[java] 	at net.sf.antcontrib.logic.ForDelegate.execute(ForDelegate.java:213)
[java] 	at net.sf.antcontrib.logic.For.execute(For.java:166)
[java] 	at org.apache.tools.ant.UnknownElement.execute(UnknownElement.java:275)
[java] 	at org.apache.tools.ant.Task.perform(Task.java:364)
[java] 	at org.apache.tools.ant.Target.execute(Target.java:341)
[java] 	at org.apache.tools.ant.Target.performTasks(Target.java:369)
[java] 	at org.apache.tools.ant.Project.executeSortedTargets(Project.java:1216)
[java] 	at org.apache.tools.ant.helper.SingleCheckExecutor.executeTargets(SingleCheckExecutor.java:37)
[java] 	at org.apache.tools.ant.Project.executeTargets(Project.java:1068)
[java] 	at org.apache.tools.ant.taskdefs.Ant.execute(Ant.java:382)
[java] 	at org.apache.tools.ant.taskdefs.CallTarget.execute(CallTarget.java:107)
[java] 	at org.apache.tools.ant.UnknownElement.execute(UnknownElement.java:275)
[java] 	at org.apache.tools.ant.Task.perform(Task.java:364)
[java] 	at org.apache.tools.ant.taskdefs.Sequential.execute(Sequential.java:64)
[java] 	at org.apache.tools.ant.UnknownElement.execute(UnknownElement.java:275)
[java] 	at org.apache.tools.ant.Task.perform(Task.java:364)
[java] 	at org.apache.tools.ant.taskdefs.MacroInstance.execute(MacroInstance.java:378)
[java] 	at net.sf.antcontrib.logic.ForDelegate.doSequentialIteration(ForDelegate.java:228)
[java] 	at net.sf.antcontrib.logic.ForDelegate.doTheTasks(ForDelegate.java:253)
[java] 	at net.sf.antcontrib.logic.ForDelegate.execute(ForDelegate.java:213)
[java] 	at net.sf.antcontrib.logic.For.execute(For.java:166)
[java] 	at org.apache.tools.ant.UnknownElement.execute(UnknownElement.java:275)
[java] 	at org.apache.tools.ant.Task.perform(Task.java:364)
[java] 	at org.apache.tools.ant.Target.execute(Target.java:341)
[java] 	at org.apache.tools.ant.Target.performTasks(Target.java:369)
[java] 	at org.apache.tools.ant.Project.executeSortedTargets(Project.java:1216)
[java] 	at org.apache.tools.ant.Project.executeTarget(Project.java:1185)
[java] 	at net.sf.antcontrib.logic.AntFetch.execute(AntFetch.java:345)
[java] 	at org.apache.tools.ant.UnknownElement.execute(UnknownElement.java:275)
[java] 	at org.apache.tools.ant.Task.perform(Task.java:364)
[java] 	at org.apache.tools.ant.Target.execute(Target.java:341)
[java] 	at org.apache.tools.ant.Target.performTasks(Target.java:369)
[java] 	at org.apache.tools.ant.Project.executeSortedTargets(Project.java:1216)
[java] 	at org.apache.tools.ant.helper.SingleCheckExecutor.executeTargets(SingleCheckExecutor.java:37)
[java] 	at org.apache.tools.ant.Project.executeTargets(Project.java:1068)
[java] 	at org.apache.tools.ant.taskdefs.Ant.execute(Ant.java:382)
[java] 	at org.apache.tools.ant.UnknownElement.execute(UnknownElement.java:275)
[java] 	at org.apache.tools.ant.Task.perform(Task.java:364)
[java] 	at org.apache.tools.ant.Target.execute(Target.java:341)
[java] 	at org.apache.tools.ant.Target.performTasks(Target.java:369)
[java] 	at org.apache.tools.ant.Project.executeSortedTargets(Project.java:1216)
[java] 	at org.apache.tools.ant.helper.SingleCheckExecutor.executeTargets(SingleCheckExecutor.java:37)
[java] 	at org.apache.tools.ant.Project.executeTargets(Project.java:1068)
[java] 	at org.apache.tools.ant.taskdefs.Ant.execute(Ant.java:382)
[java] 	at org.apache.tools.ant.taskdefs.SubAnt.execute(SubAnt.java:277)
[java] 	at org.apache.tools.ant.taskdefs.SubAnt.execute(SubAnt.java:201)
[java] 	at org.apache.tools.ant.UnknownElement.execute(UnknownElement.java:275)
[java] 	at org.apache.tools.ant.Task.perform(Task.java:364)
[java] 	at org.apache.tools.ant.Target.execute(Target.java:341)
[java] 	at org.apache.tools.ant.Target.performTasks(Target.java:369)
[java] 	at org.apache.tools.ant.Project.executeSortedTargets(Project.java:1216)
[java] 	at org.apache.tools.ant.Project.executeTarget(Project.java:1185)
[java] 	at org.apache.tools.ant.helper.DefaultExecutor.executeTargets(DefaultExecutor.java:40)
[java] 	at org.apache.tools.ant.Project.executeTargets(Project.java:1068)
[java] 	at org.apache.tools.ant.Main.runBuild(Main.java:668)
[java] 	at org.apache.tools.ant.Main.startAnt(Main.java:187)
[java] 	at org.apache.tools.ant.launch.Launcher.run(Launcher.java:246)
[java] 	at org.apache.tools.ant.launch.Launcher.main(Launcher.java:67)
[java] Java Result: 1
[java] Java Result: 1
[java] Java Result: 130
[java] Java Result: 1
[java] Java Result: 1
[java] Java Result: 130
[java] Java Result: 1
[java] Java Result: 1
[java] Java Result: 130
[java] Java Result: 1
[java] Java Result: 1
[java] Java Result: 130
[java] Java Result: 1
[java] Java Result: 1
[java] Java Result: 130
[junit] Tests FAILED
[junit] Tests FAILED
[junit] Tests FAILED
BUILD FAILED
C:\harmony\buildtest2\build\checkouts\drlvm\build\make\build.xml:398: The following error
occurred while executing this line:
C:\harmony\buildtest2\build\checkouts\drlvm\build\make\build_component.xml:73: The following
error occurred while executing this line:
C:\harmony\buildtest2\build\checkouts\drlvm\build\win_ia32_msvc_debug\semis\build\targets\test.xml:6:
Some tests failed
Total time: 310 minutes 7 seconds
The execution FAILED with the following exception:
The following error occurred while executing this line:
C:\harmony\buildtest2\adaptors\drlvm-test\adaptor.xml:75: There were drlvm-test failures

***********************************************************
Unit Tests: (4338)
        
failure: test_exec_Str java.lang.RuntimeTest2
failure: test_exec_Str java.lang.RuntimeTest2
failure: test_exec_Str java.lang.RuntimeTest2
Unit Test Error Details:	(3)
                
Test: test_exec_StrClass: java.lang.RuntimeTest2junit.framework.AssertionFailedError: check001:
the date's reply has not been received
	at junit.framework.Assert.fail(Assert.java:47)
	at java.lang.RuntimeTest2.exec_StrForWindows(RuntimeTest2.java:295)
	at java.lang.RuntimeTest2.test_exec_Str(RuntimeTest2.java:362)
	at java.lang.reflect.VMReflection.invokeMethod(VMReflection.java)
	at java.lang.reflect.Method.invoke(Method.java:317)
	at junit.framework.TestCase.runTest(TestCase.java:164)
	at junit.framework.TestCase.runBare(TestCase.java:130)
	at junit.framework.TestResult$1.protect(TestResult.java:106)
	at junit.framework.TestResult.runProtected(TestResult.java:124)
	at junit.framework.TestResult.run(TestResult.java:109)
	at junit.framework.TestCase.run(TestCase.java:120)
	at junit.framework.TestSuite.runTest(TestSuite.java:230)
	at junit.framework.TestSuite.run(TestSuite.java:225)
	at org.apache.tools.ant.taskdefs.optional.junit.JUnitTestRunner.run(JUnitTestRunner.java:297)
	at org.apache.tools.ant.taskdefs.optional.junit.JUnitTestRunner.launch(JUnitTestRunner.java:672)
	at org.apache.tools.ant.taskdefs.optional.junit.JUnitTestRunner.main(JUnitTestRunner.java:546)
Test: test_exec_StrClass: java.lang.RuntimeTest2junit.framework.AssertionFailedError: check001:
the date's reply has not been received
	at junit.framework.Assert.fail(Assert.java:47)
	at java.lang.RuntimeTest2.exec_StrForWindows(RuntimeTest2.java:295)
	at java.lang.RuntimeTest2.test_exec_Str(RuntimeTest2.java:362)
	at java.lang.reflect.VMReflection.invokeMethod(VMReflection.java)
	at java.lang.reflect.Method.invoke(Method.java:317)
	at junit.framework.TestCase.runTest(TestCase.java:164)
	at junit.framework.TestCase.runBare(TestCase.java:130)
	at junit.framework.TestResult$1.protect(TestResult.java:106)
	at junit.framework.TestResult.runProtected(TestResult.java:124)
	at junit.framework.TestResult.run(TestResult.java:109)
	at junit.framework.TestCase.run(TestCase.java:120)
	at junit.framework.TestSuite.runTest(TestSuite.java:230)
	at junit.framework.TestSuite.run(TestSuite.java:225)
	at org.apache.tools.ant.taskdefs.optional.junit.JUnitTestRunner.run(JUnitTestRunner.java:297)
	at org.apache.tools.ant.taskdefs.optional.junit.JUnitTestRunner.launch(JUnitTestRunner.java:672)
	at org.apache.tools.ant.taskdefs.optional.junit.JUnitTestRunner.main(JUnitTestRunner.java:546)
Test: test_exec_StrClass: java.lang.RuntimeTest2junit.framework.AssertionFailedError: check001:
the date's reply has not been received
	at junit.framework.Assert.fail(Assert.java:47)
	at java.lang.RuntimeTest2.exec_StrForWindows(RuntimeTest2.java:295)
	at java.lang.RuntimeTest2.test_exec_Str(RuntimeTest2.java:362)
	at java.lang.reflect.VMReflection.invokeMethod(VMReflection.java)
	at java.lang.reflect.Method.invoke(Method.java:317)
	at junit.framework.TestCase.runTest(TestCase.java:164)
	at junit.framework.TestCase.runBare(TestCase.java)
	at junit.framework.TestResult$1.protect(TestResult.java)
	at junit.framework.TestResult.runProtected(TestResult.java)
	at junit.framework.TestResult.run(TestResult.java)
	at junit.framework.TestCase.run(TestCase.java)
	at junit.framework.TestSuite.runTest(TestSuite.java)
	at junit.framework.TestSuite.run(TestSuite.java)
	at org.apache.tools.ant.taskdefs.optional.junit.JUnitTestRunner.run(JUnitTestRunner.java)
	at org.apache.tools.ant.taskdefs.optional.junit.JUnitTestRunner.launch(JUnitTestRunner.java:672)
	at org.apache.tools.ant.taskdefs.optional.junit.JUnitTestRunner.main(JUnitTestRunner.java:546)

***********************************************************
Modifications since last successful build:	(95)
            
add cc-classlib log20070703130936Lbuild.42 07/03/2007 13:09:36classlib
modified tonywu  /harmony/enhanced/classlib/trunk/modules/luni/src/test/api/common/tests/api/java/io/ObjectStreamFieldTest.java
07/03/2007 11:52:07 clean up compiler warnings in io module, no functional change.
modified tonywu  /harmony/enhanced/classlib/trunk/modules/luni/src/test/api/common/tests/api/java/io/NotActiveExceptionTest.java
07/03/2007 11:52:07 clean up compiler warnings in io module, no functional change.
modified tonywu  /harmony/enhanced/classlib/trunk/modules/luni/src/test/api/common/tests/api/java/io/LineNumberInputStreamTest.java
07/03/2007 11:52:07 clean up compiler warnings in io module, no functional change.
modified tonywu  /harmony/enhanced/classlib/trunk/modules/luni/src/test/api/common/tests/api/java/io/PipedInputStreamTest.java
07/03/2007 11:52:07 clean up compiler warnings in io module, no functional change.
modified tonywu  /harmony/enhanced/classlib/trunk/modules/luni/src/test/api/common/tests/api/java/io/InputStreamReaderTest.java
07/03/2007 11:52:07 clean up compiler warnings in io module, no functional change.
modified tonywu  /harmony/enhanced/classlib/trunk/modules/luni/src/test/api/common/tests/api/java/io/ByteArrayOutputStreamTest.java
07/03/2007 11:52:07 clean up compiler warnings in io module, no functional change.
modified tonywu  /harmony/enhanced/classlib/trunk/modules/luni/src/test/api/common/tests/api/java/io/ObjectInputStreamTest.java
07/03/2007 11:52:07 clean up compiler warnings in io module, no functional change.
modified tonywu  /harmony/enhanced/classlib/trunk/modules/luni/src/test/api/common/tests/api/java/io/ObjectOutputStreamTest.java
07/03/2007 11:52:07 clean up compiler warnings in io module, no functional change.
modified tonywu  /harmony/enhanced/classlib/trunk/modules/luni/src/test/api/common/tests/api/java/io/SequenceInputStreamTest.java
07/03/2007 11:52:07 clean up compiler warnings in io module, no functional change.
modified tonywu  /harmony/enhanced/classlib/trunk/modules/luni/src/test/api/common/org/apache/harmony/luni/tests/java/io/ObjectInputStreamTest.java
07/03/2007 11:52:07 clean up compiler warnings in io module, no functional change.
modified tonywu  /harmony/enhanced/classlib/trunk/modules/luni/src/test/api/common/tests/api/java/io/DataInputStreamTest.java
07/03/2007 11:52:07 clean up compiler warnings in io module, no functional change.
modified tonywu  /harmony/enhanced/classlib/trunk/modules/luni/src/test/api/common/tests/api/java/io/ObjectStreamFieldTest.java
07/03/2007 11:52:07 clean up compiler warnings in io module, no functional change.
modified tonywu  /harmony/enhanced/classlib/trunk/modules/luni/src/test/api/common/tests/api/java/io/NotActiveExceptionTest.java
07/03/2007 11:52:07 clean up compiler warnings in io module, no functional change.
modified tonywu  /harmony/enhanced/classlib/trunk/modules/luni/src/test/api/common/tests/api/java/io/LineNumberInputStreamTest.java
07/03/2007 11:52:07 clean up compiler warnings in io module, no functional change.
modified tonywu  /harmony/enhanced/classlib/trunk/modules/luni/src/test/api/common/tests/api/java/io/PipedInputStreamTest.java
07/03/2007 11:52:07 clean up compiler warnings in io module, no functional change.
modified tonywu  /harmony/enhanced/classlib/trunk/modules/luni/src/test/api/common/tests/api/java/io/InputStreamReaderTest.java
07/03/2007 11:52:07 clean up compiler warnings in io module, no functional change.
modified tonywu  /harmony/enhanced/classlib/trunk/modules/luni/src/test/api/common/tests/api/java/io/ByteArrayOutputStreamTest.java
07/03/2007 11:52:07 clean up compiler warnings in io module, no functional change.
modified tonywu  /harmony/enhanced/classlib/trunk/modules/luni/src/test/api/common/tests/api/java/io/ObjectInputStreamTest.java
07/03/2007 11:52:07 clean up compiler warnings in io module, no functional change.
modified tonywu  /harmony/enhanced/classlib/trunk/modules/luni/src/test/api/common/tests/api/java/io/ObjectOutputStreamTest.java
07/03/2007 11:52:07 clean up compiler warnings in io module, no functional change.
modified tonywu  /harmony/enhanced/classlib/trunk/modules/luni/src/test/api/common/tests/api/java/io/SequenceInputStreamTest.java
07/03/2007 11:52:07 clean up compiler warnings in io module, no functional change.
modified tonywu  /harmony/enhanced/classlib/trunk/modules/luni/src/test/api/common/org/apache/harmony/luni/tests/java/io/ObjectInputStreamTest.java
07/03/2007 11:52:07 clean up compiler warnings in io module, no functional change.
modified tonywu  /harmony/enhanced/classlib/trunk/modules/luni/src/test/api/common/tests/api/java/io/DataInputStreamTest.java
07/03/2007 11:52:07 clean up compiler warnings in io module, no functional change.
modified tonywu  /harmony/enhanced/classlib/trunk/modules/luni/.classpath 07/03/2007 11:38:48
correct output path for impl tests
modified tonywu  /harmony/enhanced/classlib/trunk/modules/luni/.classpath 07/03/2007 11:38:48
correct output path for impl tests
modified tonywu  /harmony/enhanced/classlib/trunk/modules/luni/src/main/java/java/io/LineNumberReader.java
07/03/2007 11:24:57 Fix Harmony-4294 ([classlib][io] LineNumberReader treats \r\n as two lines)
modified tonywu  /harmony/enhanced/classlib/trunk/modules/luni/src/test/api/common/tests/api/java/io/LineNumberReaderTest.java
07/03/2007 11:24:57 Fix Harmony-4294 ([classlib][io] LineNumberReader treats \r\n as two lines)
modified tonywu  /harmony/enhanced/classlib/trunk/modules/luni/src/main/java/java/io/LineNumberReader.java
07/03/2007 11:24:57 Fix Harmony-4294 ([classlib][io] LineNumberReader treats \r\n as two lines)
modified tonywu  /harmony/enhanced/classlib/trunk/modules/luni/src/test/api/common/tests/api/java/io/LineNumberReaderTest.java
07/03/2007 11:24:57 Fix Harmony-4294 ([classlib][io] LineNumberReader treats \r\n as two lines)
add cc-classlib log20070703083954Lbuild.41 07/03/2007 08:39:54classlib
modified tonywu  /harmony/enhanced/classlib/trunk/modules/luni/src/main/java/java/io/OutputStream.java
07/03/2007 08:27:48 Fix Harmony-4311 ([classlib][luni] Compatibility: OutputStream.write(null,
off, len) exception throwing order differs on Harmony and RI)
modified tonywu  /harmony/enhanced/classlib/trunk/modules/luni/src/test/api/common/tests/api/java/io/PipedOutputStreamTest.java
07/03/2007 08:27:48 Fix Harmony-4311 ([classlib][luni] Compatibility: OutputStream.write(null,
off, len) exception throwing order differs on Harmony and RI)
modified tonywu  /harmony/enhanced/classlib/trunk/modules/luni/src/main/java/java/io/OutputStream.java
07/03/2007 08:27:48 Fix Harmony-4311 ([classlib][luni] Compatibility: OutputStream.write(null,
off, len) exception throwing order differs on Harmony and RI)
modified tonywu  /harmony/enhanced/classlib/trunk/modules/luni/src/test/api/common/tests/api/java/io/PipedOutputStreamTest.java
07/03/2007 08:27:48 Fix Harmony-4311 ([classlib][luni] Compatibility: OutputStream.write(null,
off, len) exception throwing order differs on Harmony and RI)
add cc-classlib log20070703081753Lbuild.40 07/03/2007 08:17:53classlib
modified ivavladimir  /harmony/enhanced/classlib/trunk/modules/awt/make/exclude.linux.x86_64.drl
07/03/2007 03:19:32 exclude test due to HARMONY-4307
modified ivavladimir  /harmony/enhanced/classlib/trunk/modules/awt/make/exclude.linux.x86_64.drl
07/03/2007 03:19:32 exclude test due to HARMONY-4307
add cc-drlvm log20070703023646Lbuild.25 07/03/2007 02:36:46drlvm
modified mfursov  /harmony/enhanced/drlvm/trunk/src/test/regression/excludes/exclude.windows.x86_64
07/03/2007 02:13:40 Excluding HARMONY-4267 regression test for x86_64 platforms. JIT does
not support unresolved types for compressed references today.
modified mfursov  /harmony/enhanced/drlvm/trunk/src/test/regression/excludes/exclude.linux.x86_64
07/03/2007 02:13:40 Excluding HARMONY-4267 regression test for x86_64 platforms. JIT does
not support unresolved types for compressed references today.
add cc-drlvm log20070703020941Lbuild.24 07/03/2007 02:09:41drlvm
add cc-classlib log20070703014408Lbuild.39 07/03/2007 01:44:08classlib
added pyang  /harmony/enhanced/classlib/trunk/modules/luni/src/test/impl/org/apache/harmony/tests/internal/net
07/03/2007 01:08:23 Apply patch for HARMONY-617([classlib][luni] HttpURLConnection does not
support persistent connections)
modified pyang  /harmony/enhanced/classlib/trunk/modules/luni/.classpath 07/03/2007 01:08:23
Apply patch for HARMONY-617([classlib][luni] HttpURLConnection does not support persistent
connections)
modified pyang  /harmony/enhanced/classlib/trunk/modules/luni/src/main/java/org/apache/harmony/luni/internal/net/www/protocol/http/HttpURLConnection.java
07/03/2007 01:08:23 Apply patch for HARMONY-617([classlib][luni] HttpURLConnection does not
support persistent connections)
added pyang  /harmony/enhanced/classlib/trunk/modules/luni/src/test/impl/org/apache/harmony/tests/internal/net/www/protocol/http
07/03/2007 01:08:23 Apply patch for HARMONY-617([classlib][luni] HttpURLConnection does not
support persistent connections)
modified pyang  /harmony/enhanced/classlib/trunk/modules/luni/src/main/java/org/apache/harmony/luni/internal/net/www/protocol/https/HttpsURLConnection.java
07/03/2007 01:08:23 Apply patch for HARMONY-617([classlib][luni] HttpURLConnection does not
support persistent connections)
added pyang  /harmony/enhanced/classlib/trunk/modules/luni/src/test/impl 07/03/2007 01:08:23
Apply patch for HARMONY-617([classlib][luni] HttpURLConnection does not support persistent
connections)
added pyang  /harmony/enhanced/classlib/trunk/modules/luni/src/test/impl/org/apache/harmony/tests/internal/net/www/protocol/http/PersistenceTest.java
07/03/2007 01:08:23 Apply patch for HARMONY-617([classlib][luni] HttpURLConnection does not
support persistent connections)
added pyang  /harmony/enhanced/classlib/trunk/modules/luni/src/main/java/org/apache/harmony/luni/internal/net/www/protocol/http/HttpConnectionManager.java
07/03/2007 01:08:23 Apply patch for HARMONY-617([classlib][luni] HttpURLConnection does not
support persistent connections)
added pyang  /harmony/enhanced/classlib/trunk/modules/luni/src/test/impl/org/apache/harmony/tests/internal
07/03/2007 01:08:23 Apply patch for HARMONY-617([classlib][luni] HttpURLConnection does not
support persistent connections)
modified pyang  /harmony/enhanced/classlib/trunk/modules/luni/src/test/api/common/org/apache/harmony/luni/tests/internal/net/www/protocol/http/HttpURLConnectionTest.java
07/03/2007 01:08:23 Apply patch for HARMONY-617([classlib][luni] HttpURLConnection does not
support persistent connections)
added pyang  /harmony/enhanced/classlib/trunk/modules/luni/src/main/java/org/apache/harmony/luni/internal/net/www/protocol/http/HttpConnection.java
07/03/2007 01:08:23 Apply patch for HARMONY-617([classlib][luni] HttpURLConnection does not
support persistent connections)
added pyang  /harmony/enhanced/classlib/trunk/modules/luni/src/test/impl/org/apache 07/03/2007
01:08:23 Apply patch for HARMONY-617([classlib][luni] HttpURLConnection does not support persistent
connections)
modified pyang  /harmony/enhanced/classlib/trunk/modules/luni/src/test/api/common/org/apache/harmony/luni/tests/internal/net/www/protocol/https/HttpsURLConnectionTest.java
07/03/2007 01:08:23 Apply patch for HARMONY-617([classlib][luni] HttpURLConnection does not
support persistent connections)
added pyang  /harmony/enhanced/classlib/trunk/modules/luni/src/test/impl/org/apache/harmony/tests/internal/net/www
07/03/2007 01:08:23 Apply patch for HARMONY-617([classlib][luni] HttpURLConnection does not
support persistent connections)
added pyang  /harmony/enhanced/classlib/trunk/modules/luni/src/test/impl/org/apache/harmony/tests/internal/net/www/protocol
07/03/2007 01:08:23 Apply patch for HARMONY-617([classlib][luni] HttpURLConnection does not
support persistent connections)
added pyang  /harmony/enhanced/classlib/trunk/modules/luni/src/main/java/org/apache/harmony/luni/internal/net/www/protocol/http/HttpConfiguration.java
07/03/2007 01:08:23 Apply patch for HARMONY-617([classlib][luni] HttpURLConnection does not
support persistent connections)
added pyang  /harmony/enhanced/classlib/trunk/modules/luni/src/test/impl/org/apache/harmony
07/03/2007 01:08:23 Apply patch for HARMONY-617([classlib][luni] HttpURLConnection does not
support persistent connections)
added pyang  /harmony/enhanced/classlib/trunk/modules/luni/src/test/impl/org/apache/harmony/tests
07/03/2007 01:08:23 Apply patch for HARMONY-617([classlib][luni] HttpURLConnection does not
support persistent connections)
added pyang  /harmony/enhanced/classlib/trunk/modules/luni/src/test/impl/org 07/03/2007 01:08:23
Apply patch for HARMONY-617([classlib][luni] HttpURLConnection does not support persistent
connections)
modified pyang  /harmony/enhanced/classlib/trunk/modules/luni/build.xml 07/03/2007 01:08:23
Apply patch for HARMONY-617([classlib][luni] HttpURLConnection does not support persistent
connections)
added pyang  /harmony/enhanced/classlib/trunk/modules/luni/src/test/impl/org/apache/harmony/tests/internal/net
07/03/2007 01:08:23 Apply patch for HARMONY-617([classlib][luni] HttpURLConnection does not
support persistent connections)
modified pyang  /harmony/enhanced/classlib/trunk/modules/luni/.classpath 07/03/2007 01:08:23
Apply patch for HARMONY-617([classlib][luni] HttpURLConnection does not support persistent
connections)
modified pyang  /harmony/enhanced/classlib/trunk/modules/luni/src/main/java/org/apache/harmony/luni/internal/net/www/protocol/http/HttpURLConnection.java
07/03/2007 01:08:23 Apply patch for HARMONY-617([classlib][luni] HttpURLConnection does not
support persistent connections)
added pyang  /harmony/enhanced/classlib/trunk/modules/luni/src/test/impl/org/apache/harmony/tests/internal/net/www/protocol/http
07/03/2007 01:08:23 Apply patch for HARMONY-617([classlib][luni] HttpURLConnection does not
support persistent connections)
modified pyang  /harmony/enhanced/classlib/trunk/modules/luni/src/main/java/org/apache/harmony/luni/internal/net/www/protocol/https/HttpsURLConnection.java
07/03/2007 01:08:23 Apply patch for HARMONY-617([classlib][luni] HttpURLConnection does not
support persistent connections)
added pyang  /harmony/enhanced/classlib/trunk/modules/luni/src/test/impl 07/03/2007 01:08:23
Apply patch for HARMONY-617([classlib][luni] HttpURLConnection does not support persistent
connections)
added pyang  /harmony/enhanced/classlib/trunk/modules/luni/src/test/impl/org/apache/harmony/tests/internal/net/www/protocol/http/PersistenceTest.java
07/03/2007 01:08:23 Apply patch for HARMONY-617([classlib][luni] HttpURLConnection does not
support persistent connections)
added pyang  /harmony/enhanced/classlib/trunk/modules/luni/src/main/java/org/apache/harmony/luni/internal/net/www/protocol/http/HttpConnectionManager.java
07/03/2007 01:08:23 Apply patch for HARMONY-617([classlib][luni] HttpURLConnection does not
support persistent connections)
added pyang  /harmony/enhanced/classlib/trunk/modules/luni/src/test/impl/org/apache/harmony/tests/internal
07/03/2007 01:08:23 Apply patch for HARMONY-617([classlib][luni] HttpURLConnection does not
support persistent connections)
modified pyang  /harmony/enhanced/classlib/trunk/modules/luni/src/test/api/common/org/apache/harmony/luni/tests/internal/net/www/protocol/http/HttpURLConnectionTest.java
07/03/2007 01:08:23 Apply patch for HARMONY-617([classlib][luni] HttpURLConnection does not
support persistent connections)
added pyang  /harmony/enhanced/classlib/trunk/modules/luni/src/main/java/org/apache/harmony/luni/internal/net/www/protocol/http/HttpConnection.java
07/03/2007 01:08:23 Apply patch for HARMONY-617([classlib][luni] HttpURLConnection does not
support persistent connections)
added pyang  /harmony/enhanced/classlib/trunk/modules/luni/src/test/impl/org/apache 07/03/2007
01:08:23 Apply patch for HARMONY-617([classlib][luni] HttpURLConnection does not support persistent
connections)
modified pyang  /harmony/enhanced/classlib/trunk/modules/luni/src/test/api/common/org/apache/harmony/luni/tests/internal/net/www/protocol/https/HttpsURLConnectionTest.java
07/03/2007 01:08:23 Apply patch for HARMONY-617([classlib][luni] HttpURLConnection does not
support persistent connections)
added pyang  /harmony/enhanced/classlib/trunk/modules/luni/src/test/impl/org/apache/harmony/tests/internal/net/www
07/03/2007 01:08:23 Apply patch for HARMONY-617([classlib][luni] HttpURLConnection does not
support persistent connections)
added pyang  /harmony/enhanced/classlib/trunk/modules/luni/src/test/impl/org/apache/harmony/tests/internal/net/www/protocol
07/03/2007 01:08:23 Apply patch for HARMONY-617([classlib][luni] HttpURLConnection does not
support persistent connections)
added pyang  /harmony/enhanced/classlib/trunk/modules/luni/src/main/java/org/apache/harmony/luni/internal/net/www/protocol/http/HttpConfiguration.java
07/03/2007 01:08:23 Apply patch for HARMONY-617([classlib][luni] HttpURLConnection does not
support persistent connections)
added pyang  /harmony/enhanced/classlib/trunk/modules/luni/src/test/impl/org/apache/harmony
07/03/2007 01:08:23 Apply patch for HARMONY-617([classlib][luni] HttpURLConnection does not
support persistent connections)
added pyang  /harmony/enhanced/classlib/trunk/modules/luni/src/test/impl/org/apache/harmony/tests
07/03/2007 01:08:23 Apply patch for HARMONY-617([classlib][luni] HttpURLConnection does not
support persistent connections)
added pyang  /harmony/enhanced/classlib/trunk/modules/luni/src/test/impl/org 07/03/2007 01:08:23
Apply patch for HARMONY-617([classlib][luni] HttpURLConnection does not support persistent
connections)
modified pyang  /harmony/enhanced/classlib/trunk/modules/luni/build.xml 07/03/2007 01:08:23
Apply patch for HARMONY-617([classlib][luni] HttpURLConnection does not support persistent
connections)
modified xli  /harmony/enhanced/drlvm/trunk/vm/vmcore/include/init.h 07/02/2007 21:16:46 HARMONY-3934
: comments by Vladimir Beliaev: The attached patch does the following things:1. reports error
if -XX propery format is broken (-XX:+key, -XX:-key or -XX:key=[value] is allowed), i.e. '-XX:gc.dll='
is a proper specification (of empty value) while '-XX:gc.dll' argument produces error ('initialize_properties'
returnns the status code now).2. renamed 'vm.dlls' to 'gc.dll'". This required to do the following:
   2.1 add a check that "gc.dll" property is always set (the vm_init code expects this property
is set either to default value or it is set through command line)   2.2 remove "parsing cycle"
of gc.dll (previously "vm.dlls" may contain the list of DLLs)I've tested DRLVM with different
variants of related command line - works as expected.
modified xli  /harmony/enhanced/drlvm/trunk/vm/vmcore/src/init/vm_init.cpp 07/02/2007 21:16:46
HARMONY-3934 : comments by Vladimir Beliaev: The attached patch does the following things:1.
reports error if -XX propery format is broken (-XX:+key, -XX:-key or -XX:key=[value] is allowed),
i.e. '-XX:gc.dll=' is a proper specification (of empty value) while '-XX:gc.dll' argument
produces error ('initialize_properties' returnns the status code now).2. renamed 'vm.dlls'
to 'gc.dll'". This required to do the following:    2.1 add a check that "gc.dll" property
is always set (the vm_init code expects this property is set either to default value or it
is set through command line)   2.2 remove "parsing cycle" of gc.dll (previously "vm.dlls"
may contain the list of DLLs)I've tested DRLVM with different variants of related command
line - works as expected.
modified xli  /harmony/enhanced/drlvm/trunk/vm/vmcore/src/init/harmony.properties 07/02/2007
21:16:46 HARMONY-3934 : comments by Vladimir Beliaev: The attached patch does the following
things:1. reports error if -XX propery format is broken (-XX:+key, -XX:-key or -XX:key=[value]
is allowed), i.e. '-XX:gc.dll=' is a proper specification (of empty value) while '-XX:gc.dll'
argument produces error ('initialize_properties' returnns the status code now).2. renamed
'vm.dlls' to 'gc.dll'". This required to do the following:    2.1 add a check that "gc.dll"
property is always set (the vm_init code expects this property is set either to default value
or it is set through command line)   2.2 remove "parsing cycle" of gc.dll (previously "vm.dlls"
may contain the list of DLLs)I've tested DRLVM with different variants of related command
line - works as expected.
modified xli  /harmony/enhanced/drlvm/trunk/vm/vmcore/src/init/vm_properties.cpp 07/02/2007
21:16:46 HARMONY-3934 : comments by Vladimir Beliaev: The attached patch does the following
things:1. reports error if -XX propery format is broken (-XX:+key, -XX:-key or -XX:key=[value]
is allowed), i.e. '-XX:gc.dll=' is a proper specification (of empty value) while '-XX:gc.dll'
argument produces error ('initialize_properties' returnns the status code now).2. renamed
'vm.dlls' to 'gc.dll'". This required to do the following:    2.1 add a check that "gc.dll"
property is always set (the vm_init code expects this property is set either to default value
or it is set through command line)   2.2 remove "parsing cycle" of gc.dll (previously "vm.dlls"
may contain the list of DLLs)I've tested DRLVM with different variants of related command
line - works as expected.
add cc-classlib log20070702204825Lbuild.38 07/02/2007 20:48:25classlib
modified ndbeyer  /harmony/enhanced/common_resources/build/depends.properties 07/02/2007 20:39:54
Update Eclipse dependencies to v3.3 (final)Synchronize common_resources depends.properties
and depends.xml with classlib's version
modified ndbeyer  /harmony/enhanced/common_resources/build/depends.xml 07/02/2007 20:39:54
Update Eclipse dependencies to v3.3 (final)Synchronize common_resources depends.properties
and depends.xml with classlib's version
modified ndbeyer  /harmony/enhanced/jdktools/trunk/make/depends.properties 07/02/2007 20:39:54
Update Eclipse dependencies to v3.3 (final)Synchronize common_resources depends.properties
and depends.xml with classlib's version
modified ndbeyer  /harmony/enhanced/classlib/trunk/make/depends.properties 07/02/2007 20:39:54
Update Eclipse dependencies to v3.3 (final)Synchronize common_resources depends.properties
and depends.xml with classlib's version
modified ndbeyer  /harmony/enhanced/common_resources/build/depends.properties 07/02/2007 20:39:54
Update Eclipse dependencies to v3.3 (final)Synchronize common_resources depends.properties
and depends.xml with classlib's version
modified ndbeyer  /harmony/enhanced/common_resources/build/depends.xml 07/02/2007 20:39:54
Update Eclipse dependencies to v3.3 (final)Synchronize common_resources depends.properties
and depends.xml with classlib's version
modified ndbeyer  /harmony/enhanced/jdktools/trunk/make/depends.properties 07/02/2007 20:39:54
Update Eclipse dependencies to v3.3 (final)Synchronize common_resources depends.properties
and depends.xml with classlib's version
modified ndbeyer  /harmony/enhanced/classlib/trunk/make/depends.properties 07/02/2007 20:39:54
Update Eclipse dependencies to v3.3 (final)Synchronize common_resources depends.properties
and depends.xml with classlib's version

begin 644 execution_log.zip
M4$L#! H    ( !R7XS9+7!'$6R4  !&/ @ 2    97AE8W5T:6]N7VQO9RYH
M=&UL[5U[<]LXDO_[4C7?@5=S5^O9VM"BGI9W9JJ<Q)EQ+HE]EF>VMI*4BJ8@
MB3%%ZOCP8S[] 2 E41(%H$E!DI/63,5ZH!]H=#=>/X _C^.)]^O/M\'@Z=>?
MIR'Y]6?;B.(GC_SRMV'@QR\C]R]R:IS4_ON??_OUAQ=AXI_^\,(PC$\#XI&8
M?#'>L+^N/S(Z7<L8NAZ)C&$83(S7IY_'=C@)_*?/MXGK#6(2Q?7T[>>01(D7
M1Y\'H7<_><E^X3PIUZ_VO?W%>,5*,5ZGQL2^(RF5^3CQEHLM?XKN_9<#JI(3
MG\J*3<-@*BQ$'F,2^OT!62V6OB?..*#O_XA8O5^_/^OUWE^\,GX1UMD9$^<N
M2&BM'<^.(L^]%2F05L0,(M,.G;'I/#Z:SG DU-GUW=A\<'UYH<1W'\4V(K$9
MD8D;F0,WC&1%$[$M><7->#(UO]H29DP[@<$YO1&'"1$Q&5'E;3]VJ/.&[JU0
MWM1+1JZO6CJM""ULWI,P<@.QI;EA3.KI01(Z1,&(9LJ?AY!":>;#)(Q=2>&4
M:>+_Y4ZG9&"FCFU[8J(1\4EHQ\1T_;2X>6^'KGVKI)G4L]1T@+5-5MJ93F,[
MNJOD9:\#?^B.$EK_]2;.E^.OWX.()[]W]&>: "RS9=;Z5MTXZB6^\<%UPB!Z
MBF(RB8P+WS%_$G.;)08C#(*X8CI9TW3Q"B+*^U^N/P@>(D4BEH0HD6LWZJIB
M:,JB%)/HWE&F&(XHQ8#<)B,)"<WA1DCN71:$E*35JG<5%'."R33PB1]'7,S4
M"YYDKAK;(4LG<6 RVPN]2EJ 9M.T'Z/^'-$DYL1D( [=6;D^IQ.6E9=@^O7O
M)RMEWB13SW5HJ \,FE"^TC['\.T)H3%BN-1:86P:5]GWU^>_79_W>A>7'XV;
M\]Y-S[C^XR,UX]#U*?&0]A,QHU+S6=[Q9]_2+JO/'*O/?*7/F_\S[WRRW],V
MB.B@8<1;P:1C$#86,&Q_8-@CFZE:1BX?66QB+FZ7R90FZ9=?[R>QRT<O$1U1
MD*D=$G&."DF_(/>L,9^LI9U+VN&$[H EFBGS^R")4LN[+$<9P9!&PY"$Q'>(
M$0<9#Y8,S4S7<"O\MLK-<_V[54[2/+U>H#^/:IE9U]J,_0(F\FFW<+_:SOED
M\^./M =A=+Q;^//#S861TD14WU.0G]+_N=#/7('/KT)BWTT#VB=;!>+I)\?Y
M8O2H1_,>B28XX@^HT9]HH-C>4^32@7D0&O5TD&YN9I&5H$F?&,F4-=F C04V
M$]0R EKREM#&SNPV2"<"!8H(><5!;'M+'&?\S(/+7<(<4C5!E4V,!V>E9Y?A
M>;R99')+?6YB^^YPO6_?3<A?!=.W(6TM#/@#<64,> QXG0'?HQP]THO)%$/^
M0)P90QY#7F?(__GA@LYCJH2[)0UW"\,=PQW#71SN:ZLUN8G_>F98WP ;N#1.
MXB!\VJH]4\73A!$2UKH%B[:?)G=4^A?C=4BX6] /L)Q468LB:Q<8[@!<%P/\
MFPQP6B2_4"?HRN7[$;](7W(>UXF?C1.X/D:2;A9[+O%C8Q(,B/'NXL8XHDUE
M)UXLV1G:EE*'D3D^?W7CS;I2P_G,5,+ESD]?$SIHHI%R_NJ/WTZ-WT@<+P9F
MQ+]WZ3"%&MHTS:(Z+Q,/ I_\I[14+Q/AV%/[E@X#V<ZK!O;DGFU0;9'Q!Q*/
M@\&Y']-^R;$][]9V[@PZ<&3O68J@X\><I<W\>]9H1P6>N2+AC1O9MWQ<G)?%
M*Z)<#^46IG*(X2>T'P^-F.U(4Q';D3!K@=NY!=2:89W."/Q4SU9-HW8+*2W=
M-E"B?4.H1P6TU]K43%ORA%<Y"SA.,G6I%].N9ICX#M]OJNC-^AWM-<N@ZU8&
M57SN8')I'K%#)BT>DVQ L)"[M3IAX^^A\5N U)RCWW)FGN6,*'$<$D5TG,(A
M6ML3H,VW5D<<@MV6;8XW2H\D2HP1;JC?TQ")Q[3Y!ZS;C]AB$AG(QPU\0,BD
MG8VHM!O.0,519Z9A!4S/]D=F2FM4(N88L(3-KB%L^*0IBEGZ4R&;5]EF5<Z,
M!B(<><&M[>7P#FQXQ7(/@-E,^;DWFO-W_V6!K%C(P8S';CCH4[>8'OUD3/B(
M#<*T5&I<'E<H=CQL!@5M";[D(.TE"@RS9!9%,?.N%=:AIL0SDRQV?.:)695#
M$K%E6-ZWPUR,6[5BJ$IXF$\N\08@#\LXSGO(7*5HY\+KRM)7K.1Q&;.;' ^6
M_5(V*ODO8_"2O0QK[C)\WI1^J\J"JIOUC<I2KTF44%DY"\ ]/S_94YLJ;HU%
MSJ>+XN_4B A-Z+-H^_,?*?+UU'@_#\?C7,;ZYZ[BX1 ]K_X=>5[.;;1Y7ICX
MZ'%"CVM4\;@Y:7K$A^G!Q\C]\^OKR^O^Q\O^A\OK\_[;Z[,/YSV 4TZ"^[*=
MY:RCY2;.P@%@U1(!D5$NFF)_Z5>!Q>HL2 A!P777+:Z[YBQMYM\?TKKKN:]]
M >%9+NTV&[M8VFUV<&DW-V^K&##/:G6OV5"/S8)N\=#7WE:]L[C+2I/E(35L
M3M'4+H&O- A9)V/U S0VML1N6J()Z'>??]QAQLUWMKB?LM7]E$)DZP%@FQ !
MA@BP#;_,7OH08%]=MA\5F._.;W:C1D$P[P7S11#S=4!K#XCYTK0P@)@OA/VL
M%T+,%S8^8KX.P+<0\R5R5,1\(>9K6ZEQ9YBO[P#-A+ VQ'RIN 5BOKX%! YB
MOA#SM5N/0\Q7U8! S!>NNR+FZ]M>VD7,%R(0U@LAYJNL=W[G2"/$?!U*2R#F
MZ[O-N(CY0LP78KX0\V7L O-U>;4WS)?<#.G3K,BCXR4#PB_K5'X$S5I39ERB
MV1N3E^BGN+"']-$SYN-)VPRFL5!=>85R._['^=U_5G(S5:Y?.\[W<6*J++D=
M9W\EI0N6&244<CLL7@7Y>A^P/MJ \DY!_.0*]1UYT+(5]DS8,V'/-.=1W#/Q
M![Q-0Q*O/HI'EQH'DK9HO2NF+5P51S3RX2]9(QH9 :GKA1"-C(V/:.0#\"U$
M(XL<%='(B$;>5FK$&RC7(4/[A^I^RYAM1",C&GE/T/5G "#6>SP"T<@[]C@$
M$!],]JSDPZHP9@00(X!X<R$$$". ^& 6Y+XK.!L"B+\CV"H"B ^E)1! _-UF
M7 00(X 885H(TS)TPK1Z)+RGL39[;/!N5"ECBKV B*/P7JBNO$(((I[G['V@
M\6@#RCN&PP41+W]R6*?'*RA()C_^:+P.)E.7#PN&3-.'(+PK'(.P3XY#O8WM
MF[/B \*7:'WGB69-VWN*Z$B4K0RU>+Q% A99"<,.B9%,C3@P!FR%?3-!+2.@
M)6_9\JS#=69=1!A,BA01\HJ#V/:6.,[X%9$56>JUP8R;IL8*EK*Z4E/-BCPW
M6[UW_;L52Z4+PWU6O&_'<2BP'%3NJL%I(]UM+D9?<YR"Y]Z&=OBTJII)O^=C
M@>"6CU-6?R:/TRK5O[4CUSG,ZG/5-E<__;EB]5WJ@+$[?#I,"\RTVVR$>8FJ
M=F"H]S I/+IR"(:8J2>PQ+Q(15/03MV-@T/-"3/M-AMB7J*B':9V*-!RGS9@
MFFVN/_^U:MWCL.\$?M$8[!#JGVDGL,&L1$4[9)O?AVF&3+G-5I@5*&\$G\J^
M)P?:2>:5*S3"4H'*1AC:\2RW'*HI<BJ*#)(O5MDLAQHBR^J)S+&U,(G'=(Y[
MX"Z2UU%DE*5RY2T3NW1@$L5A,CDX@RQ4*[1#[N=*U6=+Y%X_HF:T1T6+W7LW
MPI*"FTRQ7*B203*GHM8=!H=HC[Q^F\RQ5*:2-:;$OJ-#E:3P].G>;;'0;I,E
M<B4JV2&T'PYWYK&BWR9;+)6I9 V.<SU$,Z0 W WU3W^L5/'8G=#?#K'FJ6:;
MJI[]*JO[^2-QDKC$:ES&XN+CV\M3OC^7T:2PS/Z(Q/UIZ :A&S^EQZFJ\3@U
MKLYZO?,W<"[1%C2)0)I0LW(6"N6DYM\TT9$H3%O-=L9EJYM2ES?Y@%21GE+#
MI8^?,@8.WQ>"BE\AKRR__^#&X_X<<%)-FV5FY5N&A=2[CQ=]XM]7B<J,17D]
MO@8NV"1YVO*2:5XD:O)?9B]^QB.)C%^,6JUF65:G8QQUZ-O.3X95*SA:_DW3
M\Y=Q5/O):+%WWR*UW'/*>Q]Y=,B4A3";N4S+1L REPI=HT=(:24X<84LR8\^
MEDZ+G'JW7;%@9THZ?/"&Y8<>WK!:OG?!5EZFKB9]=EZNO ;IVQVWM6#W3:+R
MG+1LG><,RAO>C19<2&GC+W,IKXW#3H!O0Z$U1KMU"L%J@$3QQ>J,6]HM\CS*
MM\6,"V%&K*H*9U)=ESA\VHX^<T9;L,]C]99B/*IKX@>LT^FS$ZL5]5EPJJ[5
M@UW=/HS'%KR'#\NVH<^"TS:UXF^#9(O:S3CN-OMM0!](M&=4_<1G?\H:(,>B
M?+MP)I6[YF4N52>A58RRX+!C+]B,PU 8RG$6U4>$.3;5!J?SK<6J&BTQVFV+
M;-[NELTL4L)^F%X$4'9^LL2EPEPTXT-[IXQ7E2ZOF-O.&D:"4I%-;MF<CQ&7
M7\.<<WC^RZ@3VP>OVQ?QJ*")2Q.^3?M@F1J+<NY?M.;"U36IL"WHVQ^0H<UN
M*Y'H/2LV"H-D:BP4L&H%AT;!TG<==6)8U ;M^;@J<D>^#<XY.=)=5Q6<^^>-
MM)PG2\?7,IL*+KN>M[>DTS[RO@1V):_ @KS<Q%C JE(;Y9B5GK1+V&U+O_E$
MB28DSR,C>%RK\MV^QMO6=%L:LLR:^%[@2*<MZ<;+J<'WF;8G=EL5X9[&YC$Q
MOTALB^&U8+JSI"-$-"K,7=@8.?T859D"Y=AL8\<@A7!5WS=(^533Z);Y'MF"
M2DN,=ND@ LSG+L1+$)8*EIN'U8Q7E6988U;>/<:!-XCZ*BE1SJ&:DS(._>#!
M+[^,OLREFC:,Q=R\E?+*,J==!LTF).PN9$O0IQ*[Y:A+3N,W<RKO%WE> _I#
M&)0&Y!6PVHY>E?:AUAAM1Z?*^V.%S+9DKPK[9*M\=AG;F_#,"@F)D_;;*D-@
MLH >U8VCV;N"ZZ6^92(%6^ZRY8L W:7E?AH0C\3DB_&&_>7W.;@A84]@>-KJ
MC22T2']Q:<?L5I+/XWCUYB#^5O?]*,K:I+=KI3]_,6Y"VX^&03@QV*STU*BW
M:K6)H'>CMK_R"%L&'[K^@#=@Q*'NZ1W,]'V\S6H=WT^.\]4Z%OD(@Z+XZY>G
M[-(?HDEP1Y9OJ1%JG!Y*,!=D_)*>4Q%-KFRZM&5R] E03$HJN&DF=WF*1ANE
M:D3'T3B)!W14>7Q#OWYC$RKMTO^7[0K..\EO:Y%?UO),[FHY@ O:\!J[;_(:
MNS06R>26^MS$]MTA$5X_M<>D\-:FP7(>AJ)#TY@2,"4<FI4P)6A+"1?RZY@P
M(V!&.#0K?8L903;?$!9G__;Y4@ G*$@V.YD]2^=NE_<TW;C\H4G3D-R[01*E
M_N#RTZ3!,/?X1!JJC,CD3VLRIW8\/C@_Q&C])J-U)9K24\I?W;@?9,=TJ.^R
MI>;-7?KF7V:O;5P3W6/:90M(-'I>>RY[8.;LJFKC*$.J"18QMZE-&6OLX-+J
M-"?E+ZVF+2E45UXA_A0#V?71)!RJE!,L%!J_GUU_N/SX[Y?U;D< -W&#8S:.
M&Y$PVH*L1M<2R!HYQU=CVX^#R?4L4=_,UMR$5/\B]AV$1-X\B]?FLK/+HYD+
M&:?&[ZZ ;;H6+BFUPI .CIT[5AL5O@J%5]CSKL\+[ $)S=?L/:/^C<1O"/V%
M/7V6?ZDBNRHG@6+GLV/;%SZ[H=NU/?<O$JH:I2HG@6+O@]%[_@ZJAP*A0.S'
M('X;)"+X:K%4.9U :"\.2125JZX:[8KP^6']1:N!@J$<_48EWKH^]Y:2.@#(
M-ZKP\>H<)E1(L")FY# =S]B#8%2$*!4O%)'&G+H,6?D"(4'H"/:HEP6(RQ8P
M#^T1>Z*E*G]I\2(11%E]8=%UUN\O>XJ<A24+&+MJ$2$MNL[Z@_  Y1)K<=$"
MUG3PZMZDX$M5$4HDZZ(4@U=6<IWQZFCI?Q.2D$T9)GU_,SL'>^?R9X_&8V)$
MR>U+.G]C3YC:3/@?=FP$X<BTIS8=)YMQ$'B12<6;L1W=T<E 9+YC$^IA$-X=
M\7=\I[33:A;.$$ \"4<G$/8^Q]KJ6%MCG6-[4DKA/_P[/WCPSSW"'WD[8[OR
M-1=0[[3*2+BA>IM3.NX/PLD1_\"Y-=K5#-PC_Y>P.UIL;ZYT[BLN0BK!)[$9
M#1E?AA(-W5O3"T:N8UX,N9XSOMG'M/&Z'0G3B$ZE0S+TB!.;OQ&?G8\B@_3A
MMF?\86A!:-4LT_7OZ11L9FBC%R0TJ0-8,]#!B%\6N,S[8C+U9LR%9=(VE34I
M7VSR;'\T%YRRFHG(/G%FK9/2#G(VL*<Q"><FSW^7VKW>0/<&NO>W99$/MA,&
M%WX4V[3#F.N]_&TJJ'-2,N[IP"H+&6(.@H6]+_@I1SHZ/<J72&U4WXZPFS%A
MIHH*))S(N@L5"3-[K;.W9($E8)]GF\5IN_T]>.4-7T#-I2O^,>78+-6]9RPR
M#5-?6&+;[I9AFRUCSS3M!2'MC5*^T='LQRS#6J6:;DR\*9LO\\>6\;6]%)2Y
M\(Z9N*(B6<1NH6K%E:JU9?$ISCIG.6\\F[E@XZ08 ZO*]+7M>2L>E/LJ4[R4
M39Y;'&%_A_W=JH16A0X)^SOL[S3W=X7=S@IK2SH3VN1DM(]Y2V)GG.]TTB\R
M8Y=R!G2W9^MN.+Q")T<G1R=?&S GMWF^V<?,NTO90HEUK91C8F@^V]#<SG!'
M%/5O4D#6IHA?_9F+;-8.+=H_V*[/8'2O&/;JB']*9ZT5V/%3QS3V<NRLDU*Q
M[=F)3\>0[_D?:G.JZ-'\0QIWS5+NL<IX0C5=X=PNUKA@%Q&T+;AI;Y%27Y-)
M<*^Z':U0OD!(XL^W^:-+__S1C57Q%66HUQ5(X2E4=T61"N4+A#S19@P#G^HY
M6"@,J&@9!NMJI#O7/7['6^0&OJ)P=;(5D0QX;?(C84N0J\W1\8[^:USS@\JG
MAJ6B'D#$9A4OX[$:*$6E]*J P#P+0_M)%2.A5GY%R%??-1G"ZGWZM#,5.<HD
M*Z("VG<,)S3.PR?S39#<>DKI 4(E$'BA!KU1)A&(NO)H H8*DQ )Q"DF(&42
M@2@:SL$#5)B$2"#N3WZ2'RI/1B456,XWU6BEPDOXJ0*A5&P))U(@7!'+1MYF
M>L[G@^T_S?&52ABJ$L2JXOL#^F9<20D9BR)5\I"PGCN9JOD<F+1(=(_<D]#V
M ! V$%FA2#[Z>1V$/@E[M*-5%ZI,J"*V+X#V2P2+2(M$\\3'W$19H@*%4%")
MB +1*@H'QE,)#D)%RHH'"ET S.(4@:4B$4"T(FYV/-I4N$9E36P)8I%XX84-
MI0?D !%R%44'R LU; @NC]^@HU"&7,7W@:,$4 80K8KC&<Q\Y8YH+J/?OTJ&
M0[7I"I2R6# (MJ].4RR,MX;2N%N1H%C,!_<1($-8NE@ /^H!$"$IOT'(DZ]T
M7D.I>+$(P.!"E:)8D/HT09&@6 P[*/B['8TG]E1U^05*N2(XO;C/9&M3O2P'
M_!X$2KX!)BT6?>'S(_ $%,APVDW"L_2JVLO!Z(J%LH% YH>JK0RE+!;<8\]W
M!8B3E"\6DNJGT&^MB5.F% F^O/P %BFD61&6Q*YGOA'>-+J0HE"XD'UP%;KW
M#,]$E$9\ *(B<5=AH.05"H6+V*>]NWK7"2!:O4LR/=I)M%\IF;OK8^5*R0.X
M<@(OYL"+.0JC11!\V4O#Q1Q40QK)@?GN_&8W\LO4?S]7<1"\BF.S++R* Z_B
M "F&5W'@51QX%0=>Q:$L!*_BV,0:K^+XOJ_B*!"'F#UE!1"S)Q6.F#W$["%F
M3T488O80LX>8/8%HQ.PA9@\Q>XC9DRN"F+TUL8C9DVJ(F+TEF8C90\R>:G'$
M[(GE(68/,7M2P8C90\P>8O80LX>8/<3L+0=?]M*(V;N\0LS>,F8OF")F;[,L
MQ.PA9@^D&&+V$+.'F#W$["D+0<S>)M:(V4/,WHHXQ.PI*X"8/:EPQ.PA9@\Q
M>RK"$+.'F#W$[ E$(V8/,7N(V4/,GEP1Q.RMB47,GE1#Q.PMR43,'F+V5(LC
M9D\L#S%[B-F3"D;,'F+V$+.'F#W$["%F;SGXLI<&S%Y.M=W(+U/_O6#VJ&6$
MZLHKM"O,7N2)5M='SC';!4=,X'8Q@3\:-V,WRL;W:>]&/]Z3\(FWAW)LI0R.
MTZZTM#9R-UV\E(<'B%U$[**"'HA=E M'[")B%Q&[*&7_'6 7$6"( $-U!1!@
M*!6. $,$&"+ 4$48 @P18(@ 0X%H!!@BP! !A@@PE"N" ,,UL0@PE&J( ,,E
MF<\/8(C(/T41B/Q#Y!\B_Y0%(_(/D7^(_$/D'R+_$/FW''S92P/RKT?">Q(:
MDV! C'<7>&/?,OHO"N^%ZLHK]$W?V-=I"*;;<UC(]X #7'\I=\);Q]<A  X!
M<&I"$0"' #@$P"$ ;A-CO+Q/+ JQ=8BM4Q."V#K$UB&V#K%UB*U3E(?8NA)B
M$5N'V#JY6,36040CMJZT"HBM0VP=8NL06P<1AI?W080@A \J!B%\".$3B44(
MGU0P0O@0PK='"-_R)\ZK'Q*&2BO 5GV:W W<\(N1SO8'!OUPNE4T&BV2U_5S
MJDGT>1ROPL4^?4UH(DU__V+<A+8?#8-P8L3NA)P:K9-:LS,1])HWXQ2U9:0<
MV#536P;6B:KRF;8_>337:[7\:4%^*BKF!).IZY&7=]3UB/>RH/S\K4/;CI=F
M/M\PHB )G13^%1EQL-7ZI]IDE<_<?$VK3P,:_S'Y8KQA?YE2U*7X2.1)NS*?
M_2 >KH,]EC^]G-)VLT.)<?=2C<RA]A"E<C66/X6)+[#? <!C$43\38*(7ZXX
MWLM;.W;&>\<,TS&'D6J5 8<3#L9][;G$C^?88>.(-IE-!P0_[4:K,E;9 8HX
MRS5Y&/%7M^HEHC^RBR9)- -NT_Q.>[] <N<G^^;8L_W1,6U -LPX&PQ<MC)K
M>VQN\_?RP-QU;1(_BNU;:DX6.F,JTPB&,1$,+"7*699$.PE]HUF1OEN-OEFK
M2%^Q_LWZ-L#DS59#4'"A0N\IBLF$R=6*H-[+..$SC5Z3Y;BB$2H;TB_F9$$X
M,NVI3:6:F4HF,X\Y(CX)72=*0=0I9K9X=6'&\88'%NT-3HVZ]0_CK>UZ"9UM
MG1JU?QA\/3U]>T/;W2">/8W(@)8T.U;7B$C!(E\1W[8JWYK9L!H2OG1V\MMK
MVB #@PY268=_[]($.W+Z]F#0?R#V73\,@K@?D;A/^XSPZ:B@DRA0TFJI*MDP
M:U9+N?(GJFQ;ICK3AKI!.R>6,EME$UAFMR5KIQ+:,K9-9;;*WEHSF_6Z.MNN
MNKJ=AKJZC::Z@S4!U@68H6:UM;!M=I39*AL7QA;B"S5U(]0AME4/7PC;AKKG
M*CL8S+;*&:QF6DWU9 /H%&IM+4:PZNI-!M&VJYX4 &PAVG8 ;$_4/0'0[4!2
M#<0('75/T*0MP,$@:1R@+<03(/EV_WX+Z70ZZ@/0 S!"2SW*-"5&"-N&>AH'
M=9%Z>MZV>I1M=292@FU36SCHR;>040V@TX$XF%73PU?32%0]CVL9UP'< -)>
M@&0+&8 !LB(@%JR3$W6VRJ-;RVP ECP 3@NR F PW@+D14O9&:PZG4$!%%YJ
M-TO$F.9&6=][WKOA:X'I8E>V',FDU8VW9Q?OS]]LVY4Z;4"VUC1E5E^0. $M
MRS25?:EK=FJ A0YU,[0A(UGUU<FNGHQMF9"^&]#+UMOJ61MB7<!L7'WMMV:>
M=#3,/RSSQ-(RF(6X;ETY)!KF21/ %])J+8 S* ^3F7G54P-@]&T!1G( KC5 
M7POPA09@D0[0U0("0KV7J.N)")K% 'LW@.V+6D=]V 6(WVX;,)H#Y%RU?9&B
M8<4!X$T0E8.HG+VC<KZZ#-@;F._.O^_;_(IP. 1Q.(C#>2XXG/77P2!BR+-!
MQ$!612"(F&9#-OXY $0,9,E->4C9-MLZ-B<MT'Q;V0AUL][5H&W=;.G!0;0 
M.UWJ2U!ULPV8NJEC8IJPI3@]  M-; $[$9!YL29M-8%7(&P!$TW(W@E 6\#:
M &0I4M,>+6A+1L\^HB8C -B"MKO4'6S_F!C(_C=$6P!;@(/5(9!)B">HVU93
MO@5A"[1T.O6:>I-!MK_UH$QTP>\ B?$ ,#&ZND@M?JL%W]D"P:A!HYJ]>\)!
M8&*TC$3U8&)T(3$A1H" 9P$I#*2MEDVU1@LP>0#@8IHG@)U0@.?6 ;MU$'U;
M72W &)K' /TO !A35P!I[QP9TP(,"F#(&, 9%>5\U3$;3?6V 9R#@LR7(( ;
M2*P"TNM)77UFHPZX:<!&!@!]ZP#P!@1QTP9@[@#J0EH-@KB!#)#4$3<Z!D<0
M;($ZPL(RVX"#'Q"T#>B(!@!M SE' ,*Z:YDX D \ &4AMH7X L2VZEV/!4)T
M 4("LGZO; 7800+(=A-@, <Y=:G&%N$V"+=!N(T8;G-YA7";%;A-,$6X#<)M
M$&Y3%6Y#X^AYP&VL+NC8% 1OTVW+9C![Q]NT6Z"#\.J#RA.S"[@I!8!A@1ST
M439#!S034,<'-<T3+?>D0$X)J,_B+;,!8*R.N&F#8%*@H\IZ@#P 7X#L  ,6
MMC0=  1M)^K9I02LF!_ +31Z9L: 11((X$;+F@.DP2!L < 8R#::EK5C77O@
M$'RCGEB A!C $31I"TFVFJY)@2P8ZEF,!1E!#TQ,S_$\72@> /H,TI$!=A<A
MAV#U& %RFE^9;;T%&N1K&M-H<@5-($\(W@9R% (T#MUW'H?T.IJ:#)#'(=I"
M/ &PQPR8HJO#5^H@=4%PFQ,=^C9 TUYUM$W3;$H7:DIM VHZ<-, W90 075!
ML,3JRPJ@Y0H 8*8%F/VK V:L$[/9V/>5+P# 3,?LZ#@L!EMC4A\RZ+GN&09'
M4E\<;H(6;91#HJ'K<DB0%0 (@487L!@$" G(8JXZ9J8#.I$(&)SKN7 1,N0'
M* O".4$PKY Q#J!3@]PQ!;BB!G+%E/I0!(8G!*BKZ6+UPGG: 0 ]$ Z#<)B]
MPV%<]CS):4ABX5-FMZC'\X'#4-,(]977".$P"(=!. R-H^<!AVG0:35@81LP
M\9-O*.\=#6/504@%]>%BIP%:"E*>0;4;H+4K@"&:9MW2<'5!MPX[[@78B@"-
MG)6GZDW0G%H=$V-93= "%N#P@9:3';"S$H"[>K7LJ%IZ4#&6GD/V,&W570RT
M>:+IU QDZ@O0%F $'; 82P\L!F9:]1T./=?0P-Q6DQ$@VNIX]I<^V^IX*I&E
M!U\ 8PO(XEJ>3Z4M@6F!V\ <#)1N]71E +_5U$,"C* A&!H-T-%ER)A&QRTT
ML'X7U.< C%#3T_-"<H*N+E+#+32PX 6T&>@."CT>IFE& H'%- '/"5"'Q5BP
M2UW4Q^--&#X( HP!,59ON0;H\1D CVCK ,98(+P-Y+@-)$4";@_6 XSIFET=
MN)@&=3( Q$)](;.I9Q[1A#T"''!W'>22*H"Z('@! !G3 :R4 I;;(-8%/"P3
M@NE21T/4@9 ;Y68[T02-:8% ?LIL-3V,M F*"8"V=< -X !L3 <T.%7O@6#W
MP0&B G*%KKH9:$\!>(*!LKIMV.,BU:U0^)RT X!](#@&P3%[!\?T2'A/0H-M
M7AOO+O"^F!6 3!3>"_65UP@!,@B0V15 YD?C][/K#Y<?__VRSJ[44U&A]Q3%
M9,+D?H.P'!J]SP.68S5 R!3(+352?/3>83FM&@B, H#EZ#GJ4P<]/D'=#)J>
M1=W0=4LXZ )(Y26"MMD]T71+C:Z'!^@Y(PU8Y0.<#H9< 02ZX4#/*7R $4"7
MXSZG6VHT'28[@#/2^[^40M,]-;J>"Z7G^3H0MJ!K=;0\?0VRB;G_BVH.X'XE
M30_" 1E!3P;3=8V(GBC3<Z/,\WHN%.39G.H8EY:>#6>-CJON"I!>!X+#J.FQ
M B0KZ.HD]0SN]#P82@MJ%>@*FF8/D(=V0*[H!7@NY(HE=7U;L!FU.B*G ]MG
M57\P5-/L2A\.ON,'0]6+]^64ZBIN=-#3P #K$EJNHVF:#0W#6=B3RV&H&SV3
M!<@C8-11-Y;9E/I]*74ASRY77P:&81,!CUK7](!+R&4_ZCB+AMF"7$X,.B*B
MXQE.#?/$TK+ZI05T ^O$(1?2 "YX@5Q(TP @L" 7TD!0_)I.-T& :) ]AVUN
M#Y5RL7;18RB7/Z5[='F@1 %$8EF+HF%(6B)E1LN%MA\-@W!BL,$+&U%U3YJ3
M"$)2K]6Z#1B)U:"C*R!)L]ON0DE:[?HJR?(GOFDJ,>EBU_;OFU\2,N-_\D"2
M*+;C)#+D9&K29!O-KSV7^/$<L6(<#<C03KSXIXW#U&7ZV=.1WIW? "DNKVZ,
MJ[->3TZ1NW)&D6(%AU.HV68>5QZQ(X:*\0?&@,0T2LF 1EA$S1(9B3^@G'5M
MMA]GF^UL2Y\X<1 ^F2*M<Z2G<E=.JR L^.J/B_=O"LU5$AS$WS*0UVFC>W+*
M]\>'@><%#QQ_Q'*>$3A.$H;4Q ]CAD,BC\1)8O9S/'8CPW-]<KH]5?I.,)D&
M/O5YKE2GL3>=5*%X'"G'=&V?&KU@,@,;#;E;BMKR)HAM+TMW#:MF3%P_H;0&
M[TP"?["2_-[1?XWKU$4,:_:;$TR?:.WHOZSVG:[%P6*1$0?"*F?1DE:8)\^,
MH?'I+W=*_8R58ASI)S%T99U3GW8J'?I?HV\UFDV3<OCAQ0O6B%DK!7[FP,:#
M&X]IBRTU[Z-#IJS,Z8O2[5ZLKCVPIS1@\YK.ODM=K<5=+23& _MG48HW)1L'
MO/CAQ<_']J\_']-<1_^]#09/],\XGGB__C]02P$"% ,*    "  <E^,V2UP1
MQ%LE   1CP( $@              I($     97AE8W5T:6]N7VQO9RYH=&UL
64$L%!@     !  $ 0    (LE      $! 
end


Mime
View raw message