harmony-alerts mailing list archives

Site index · List index
Message view « Date » · « Thread »
Top « Date » · « Thread »
From nom...@intel.com
Subject [build-test alert] BUILD FAILED Windows 2003 x86_64 msvc debug: drlvm regression tests
Date Mon, 02 Jul 2007 14:45:15 GMT
BUILD FAILED:
	Ant Error Message:
C:\cruise\cc\projects\drlvm\trunk\build\make\build.xml:472: The following error occurred while
executing this line: C:\cruise\cc\projects\drlvm\trunk\build\make\targets\reg.test.run.xml:122:
There were test failures

Date of build:	07/02/2007 20:02:33
Time to build:	102 minutes 25 seconds
Last changed:	07/02/2007 19:46:16
Last log entry:	Fix for HARMONY-4267 with regression test.


***********************************************************
Execution log (errors/warnings messages):	
cl : Command line warning D9035 : option 'GZ' has been deprecated and will be removed in a
future release
cl : Command line warning D9035 : option 'GZ' has been deprecated and will be removed in a
future release
cl : Command line warning D9036 : use 'RTC1' instead of 'GZ'
cl : Command line warning D9035 : option 'GZ' has been deprecated and will be removed in a
future release
cl : Command line warning D9036 : use 'RTC1' instead of 'GZ'
cl : Command line warning D9035 : option 'GZ' has been deprecated and will be removed in a
future release
cl : Command line warning D9036 : use 'RTC1' instead of 'GZ'
cl : Command line warning D9035 : option 'GZ' has been deprecated and will be removed in a
future release
cl : Command line warning D9036 : use 'RTC1' instead of 'GZ'
cl : Command line warning D9035 : option 'GZ' has been deprecated and will be removed in a
future release
cl : Command line warning D9036 : use 'RTC1' instead of 'GZ'
cl : Command line warning D9035 : option 'GZ' has been deprecated and will be removed in a
future release
cl : Command line warning D9036 : use 'RTC1' instead of 'GZ'
cl : Command line warning D9035 : option 'GZ' has been deprecated and will be removed in a
future release
cl : Command line warning D9036 : use 'RTC1' instead of 'GZ'
cl : Command line warning D9035 : option 'GZ' has been deprecated and will be removed in a
future release
cl : Command line warning D9036 : use 'RTC1' instead of 'GZ'
cl : Command line warning D9035 : option 'GZ' has been deprecated and will be removed in a
future release
cl : Command line warning D9036 : use 'RTC1' instead of 'GZ'
cl : Command line warning D9035 : option 'GZ' has been deprecated and will be removed in a
future release
cl : Command line warning D9036 : use 'RTC1' instead of 'GZ'
cl : Command line warning D9035 : option 'GZ' has been deprecated and will be removed in a
future release
cl : Command line warning D9036 : use 'RTC1' instead of 'GZ'
cl : Command line warning D9035 : option 'GZ' has been deprecated and will be removed in a
future release
cl : Command line warning D9036 : use 'RTC1' instead of 'GZ'
cl : Command line warning D9035 : option 'GZ' has been deprecated and will be removed in a
future release
cl : Command line warning D9036 : use 'RTC1' instead of 'GZ'
cl : Command line warning D9035 : option 'GZ' has been deprecated and will be removed in a
future release
cl : Command line warning D9036 : use 'RTC1' instead of 'GZ'
cl : Command line warning D9035 : option 'GZ' has been deprecated and will be removed in a
future release
cl : Command line warning D9036 : use 'RTC1' instead of 'GZ'
Test org.apache.harmony.drlvm.tests.regression.h4267.UnresolvedArrayElem FAILED
Configuration:
     Hosting Java = 1.5.0_10 (Sun Microsystems Inc.)
    classlib root = C:\cruise\cc\projects\classlib\trunk
               os = Windows
             arch = em64t
              cxx = msvc
              cfg = debug
     svn revision = ${svn.revision}
       components = deploy
Adding manifest to C:\cruise\cc\projects\drlvm\trunk\build\win_em64t_msvc_debug\semis\reg.tests\native/H0000/DirectByteBufferTest.dll
Adding manifest to C:\cruise\cc\projects\drlvm\trunk\build\win_em64t_msvc_debug\semis\reg.tests\native/H2151/VMInit1.dll
Adding manifest to C:\cruise\cc\projects\drlvm\trunk\build\win_em64t_msvc_debug\semis\reg.tests\native/H2899/ManyArgs.dll
Adding manifest to C:\cruise\cc\projects\drlvm\trunk\build\win_em64t_msvc_debug\semis\reg.tests\native/H2926/test.dll
Adding manifest to C:\cruise\cc\projects\drlvm\trunk\build\win_em64t_msvc_debug\semis\reg.tests\native/H3027/AgentLib.dll
Adding manifest to C:\cruise\cc\projects\drlvm\trunk\build\win_em64t_msvc_debug\semis\reg.tests\native/H3074/natives.dll
Adding manifest to C:\cruise\cc\projects\drlvm\trunk\build\win_em64t_msvc_debug\semis\reg.tests\native/H3130/CallNativeTest.dll
Adding manifest to C:\cruise\cc\projects\drlvm\trunk\build\win_em64t_msvc_debug\semis\reg.tests\native/H3317/GetFieldDeclaringClassTest.dll
Adding manifest to C:\cruise\cc\projects\drlvm\trunk\build\win_em64t_msvc_debug\semis\reg.tests\native/H3404/H3404.dll
Adding manifest to C:\cruise\cc\projects\drlvm\trunk\build\win_em64t_msvc_debug\semis\reg.tests\native/H3505/GetFieldModifiersTest.dll
Adding manifest to C:\cruise\cc\projects\drlvm\trunk\build\win_em64t_msvc_debug\semis\reg.tests\native/H3698/ExceptionLocation.dll
Adding manifest to C:\cruise\cc\projects\drlvm\trunk\build\win_em64t_msvc_debug\semis\reg.tests\native/H3730/StepM2N.dll
Adding manifest to C:\cruise\cc\projects\drlvm\trunk\build\win_em64t_msvc_debug\semis\reg.tests\native/H3784/check.dll
Adding manifest to C:\cruise\cc\projects\drlvm\trunk\build\win_em64t_msvc_debug\semis\reg.tests\native/H3894/ThreadGroupChildren.dll
Adding manifest to C:\cruise\cc\projects\drlvm\trunk\build\win_em64t_msvc_debug\semis\reg.tests\native/H3909/FinalizerThreadGroup.dll
Adding manifest to C:\cruise\cc\projects\drlvm\trunk\build\win_em64t_msvc_debug\semis\reg.tests\native/H3982/EmptyStackTrace.dll

=====================================
DRLVM Regression Testing on platform: windows.x86_64
=====================================
        
vf_debug: verifying class org/apache/harmony/drlvm/tests/regression/h1857/TestClass (method
tryMe()V) couldn't load class "org/apache/harmony/drlvm/tests/regression/h1857/MissedThrowable"
vf_debug: VerifyError: Couldn't load class: org/apache/harmony/drlvm/tests/regression/h1857/MissedThrowable
The GC did not provide gc_add_weak_root_set_entry()
Running on JET
Running on OPT
Running on interpreter
vf_debug: VerifyError: (class: org/apache/harmony/drlvm/tests/regression/h2103/SupClass, method:
test()I) Incompatible object argument for invokespecial
vf_debug: verifying class org/apache/harmony/drlvm/tests/regression/h2808/finTest1 (method
test()V) couldn't load class "org/apache/harmony/drlvm/tests/regression/h2808/finTest2"
vf_debug: VerifyError: Couldn't load class: org/apache/harmony/drlvm/tests/regression/h2808/finTest2
The GC did not provide gc_add_weak_root_set_entry()
vf_debug: verifying class org/apache/harmony/drlvm/tests/regression/h3048/MyTestSuper (method
<clinit>()V) couldn't load class "org/apache/harmony/drlvm/tests/regression/h3048/MyException"
vf_debug: VerifyError: Couldn't load class: org/apache/harmony/drlvm/tests/regression/h3048/MyException
Running on OPT
Running on OPT
The GC did not provide gc_add_weak_root_set_entry()
Windows reported exception: 0xc0000005
Registers:
    RAX: 0x00000000deadbeef, RBX: 0x0000000011b7b738
    RCX: 0x00000000deadbeef, RDX: 0x0000000004153bb0
    RSI: 0x0000000011b6f8a8, RDI: 0x000000000012ba70
    RSP: 0x000000000012ba40, RBP: 0x000000000012de50
    R8 : 0x0000000000000001, R9 : 0x0000000006522668
    R10: 0x0000000100000001, R11: 0x8101010101010100
    R12: 0x000000000012e680, R13: 0x0000000002f04388
    R14: 0x0000000000000000, R15: 0x0000000000000000
    RIP: 0x000000000072ba2b
Stack trace:
  0: Class::get_name (??:-1)
  1: JIT_execute_method_default (??:-1)
  2: ?? (??:-1)
  3: java/lang/reflect/VMReflection.invokeMethod(JLjava/lang/Object;[Ljava/lang/Object;)Ljava/lang/Object;
(VMReflection.java:-2)
  4: java/lang/reflect/Method.invoke(Ljava/lang/Object;[Ljava/lang/Object;)Ljava/lang/Object;
(Method.java:317)
  5: junit/framework/TestCase.runTest()V (TestCase.java:164)
  6: junit/framework/TestCase.runBare()V (TestCase.java:-1)
  7: junit/framework/TestResult$1.protect()V (TestResult.java:-1)
  8: junit/framework/TestResult.runProtected(Ljunit/framework/Test;Ljunit/framework/Protectable;)V
(TestResult.java:-1)
  9: junit/framework/TestResult.run(Ljunit/framework/TestCase;)V (TestResult.java:-1)
 10: junit/framework/TestCase.run(Ljunit/framework/TestResult;)V (TestCase.java:-1)
 11: junit/framework/TestSuite.runTest(Ljunit/framework/Test;Ljunit/framework/TestResult;)V
(TestSuite.java:230)
 12: junit/framework/TestSuite.run(Ljunit/framework/TestResult;)V (TestSuite.java:-1)
 13: org/apache/tools/ant/taskdefs/optional/junit/JUnitTestRunner.run()V (JUnitTestRunner.java:-1)
 14: org/apache/tools/ant/taskdefs/optional/junit/JUnitTestRunner.launch(Lorg/apache/tools/ant/taskdefs/optional/junit/JUnitTest;ZZZZLjava/util/Properties;)I
(JUnitTestRunner.java:672)
 15: org/apache/tools/ant/taskdefs/optional/junit/JUnitTestRunner.main([Ljava/lang/String;)V
(JUnitTestRunner.java:567)
<end of stack trace>
Assertion failed: depth == 0, file C:\cruise\cc\projects\drlvm\trunk\vm\jitrino\src\main\PMF.cpp,
line 708
This application has requested the Runtime to terminate it in an unusual way.
Please contact the application's support team for more information.
[Fatal Error] :-1:-1: Premature end of file.
The file C:\cruise\cc\projects\drlvm\trunk\build\win_em64t_msvc_debug\semis\reg.tests\reports\TEST-org.apache.harmony.drlvm.tests.regression.h4267.UnresolvedArrayElem.xml
is not a valid XML document. It is possibly corrupted.
========================================
Regression testing report was stored in:
========================================
C:\cruise\cc\projects\drlvm\trunk\build\win_em64t_msvc_debug\semis\reg.tests/reports/html
========================================

***********************************************************
Unit Tests: (98)
        

***********************************************************
Modifications since last successful build:	(7)
            
added mfursov  /harmony/enhanced/drlvm/trunk/src/test/regression/H4267/UnresolvedArrayElem.java
07/02/2007 19:46:16 Fix for HARMONY-4267 with regression test.
modified mfursov  /harmony/enhanced/drlvm/trunk/vm/jitrino/src/translator/java/JavaByteCodeTranslator.cpp
07/02/2007 19:46:16 Fix for HARMONY-4267 with regression test.
modified mfursov  /harmony/enhanced/drlvm/trunk/vm/jitrino/src/shared/Type.cpp 07/02/2007
19:46:16 Fix for HARMONY-4267 with regression test.
added mfursov  /harmony/enhanced/drlvm/trunk/src/test/regression/H4267 07/02/2007 19:46:16
Fix for HARMONY-4267 with regression test.
modified mfursov  /harmony/enhanced/drlvm/trunk/vm/jitrino/src/vm/drl/DrlVMInterface.cpp 07/02/2007
19:46:16 Fix for HARMONY-4267 with regression test.
added mfursov  /harmony/enhanced/drlvm/trunk/src/test/regression/H4267/run.test.xml 07/02/2007
19:46:16 Fix for HARMONY-4267 with regression test.
modified mfursov  /harmony/enhanced/drlvm/trunk/vm/jitrino/src/translator/java/JavaLabelPrepass.cpp
07/02/2007 19:46:16 Fix for HARMONY-4267 with regression test.

Mime
View raw message