harmony-alerts mailing list archives: June 2007

Site index · List index
Message list« Previous · 1 · 2 · 3 · 4 · 5 · 6 · 7 · Next »Thread · Author · Date
nbe...@kc.rr.com [build-test alert] BUILD FAILED Windows XP x86: classlib-test Wed, 20 Jun, 21:49
nom...@intel.com [build-test alert] BUILD SUCCEEDED Linux SUSE 9 x86_64: harmony_hdk Thu, 21 Jun, 00:25
nom...@intel.com [build-test alert] BUILD FAILED LINUX SUSE 9 x86_64: harmony_hdk Thu, 21 Jun, 01:48
nom...@intel.com [build-test alert] BUILD FAILED Linux SUSE 9 64bit gcc debug: drlvm tests Thu, 21 Jun, 02:21
nbe...@kc.rr.com [build-test alert] BUILD FAILED Windows 2000 x86: drlvm-test Thu, 21 Jun, 03:10
nbe...@kc.rr.com [build-test alert] BUILD PASSED Windows 2000 x86: classlib-test Thu, 21 Jun, 04:34
nom...@intel.com [build-test alert] BUILD FAILED Windows 2003 x86_64 msvc debug: classlib tests Thu, 21 Jun, 05:03
nbe...@kc.rr.com [build-test alert] BUILD PASSED Windows XP x86: drlvm-test Thu, 21 Jun, 05:09
nom...@hursley.ibm.com [continuum] BUILD FAILURE: Classlib/linux.ia32 Build/Test Thu, 21 Jun, 05:16
nom...@intel.com [build-test alert] BUILD SUCCEEDED Windows 2003 x86_64 msvc debug: classlib tests Thu, 21 Jun, 06:04
nom...@hursley.ibm.com [continuum] BUILD SUCCESSFUL: Classlib/linux.ia32 Build/Test Thu, 21 Jun, 08:04
nbe...@kc.rr.com [build-test alert] BUILD FAILED Windows XP x86: drlvm-test Thu, 21 Jun, 09:37
nbe...@kc.rr.com [build-test alert] BUILD FAILED Windows XP x86: drlvm-test Thu, 21 Jun, 14:27
nom...@intel.com [build-test alert] BUILD SUCCEEDED Linux SUSE 9 gcc debug: drlvm reg.test Thu, 21 Jun, 16:06
nom...@hursley.ibm.com [continuum] BUILD FAILURE: Classlib/linux.ia32 Build/Test Thu, 21 Jun, 18:31
nbe...@kc.rr.com [build-test alert] BUILD FAILED Windows XP x86: drlvm-test Thu, 21 Jun, 20:15
nom...@intel.com [build-test alert] BUILD FAILED Linux SUSE 9 gcc debug: classlib over drlvm Thu, 21 Jun, 21:20
nom...@intel.com [build-test alert] BUILD FAILED Windows server 2003 msvc: jdktools_test Thu, 21 Jun, 22:17
nom...@hursley.ibm.com [continuum] BUILD SUCCESSFUL: Classlib/linux.ia32 Build/Test Thu, 21 Jun, 23:24
nom...@intel.com [build-test alert] BUILD FAILED Windows 2003 x86_64 msvc debug: drlvm Thu, 21 Jun, 23:43
nbe...@kc.rr.com [build-test alert] BUILD FAILED Windows XP x86: drlvm-test Fri, 22 Jun, 01:02
nom...@hursley.ibm.com [continuum] BUILD FAILURE: Classlib/linux.ia32 Build/Test Fri, 22 Jun, 01:16
nbe...@kc.rr.com [build-test alert] BUILD FAILED Windows 2000 x86: drlvm-test Fri, 22 Jun, 01:39
nom...@hursley.ibm.com [continuum] BUILD SUCCESSFUL: Classlib/linux.ia32 Build/Test Fri, 22 Jun, 03:25
nbe...@kc.rr.com [build-test alert] BUILD PASSED Windows 2000 x86: classlib-test Fri, 22 Jun, 03:48
nbe...@kc.rr.com [build-test alert] BUILD FAILED Windows 2000 x86: drlvm-test Fri, 22 Jun, 03:56
nom...@intel.com [build-test alert] BUILD FAILED Linux SUSE 9 gcc debug: drlvm test Fri, 22 Jun, 04:48
nbe...@kc.rr.com [build-test alert] BUILD FAILED Windows XP x86: drlvm-test Fri, 22 Jun, 05:25
nom...@intel.com [build-test alert] BUILD SUCCEEDED Linux SUSE 9 64bit gcc debug: drlvm tests Fri, 22 Jun, 07:38
nom...@intel.com [build-test alert] BUILD SUCCEEDED Linux SUSE 9 gcc debug: drlvm test Fri, 22 Jun, 08:45
nbe...@kc.rr.com [build-test alert] BUILD PASSED Windows 2000 x86: classlib-test Fri, 22 Jun, 08:53
nom...@intel.com [build-test alert] BUILD FAILED Windows 2003 x86_64 msvc debug: classlib tests Fri, 22 Jun, 08:58
nbe...@kc.rr.com [build-test alert] BUILD PASSED Windows XP x86: drlvm-test Fri, 22 Jun, 09:54
nom...@intel.com [build-test alert] BUILD SUCCEEDED Windows server 2003 msvc: jdktools_test Fri, 22 Jun, 09:56
nom...@intel.com [build-test alert] BUILD SUCCEEDED Linux SUSE 9 x86_64: harmony_hdk Fri, 22 Jun, 10:45
nom...@intel.com [build-test alert] BUILD FAILED Windows XP SP2 x86: jdktools_test Fri, 22 Jun, 11:43
nbe...@kc.rr.com [build-test alert] BUILD FAILED Windows XP x86: drlvm-test Fri, 22 Jun, 14:27
nom...@intel.com [build-test alert] BUILD FAILED LINUX SUSE 9 x86_64: harmony_hdk Fri, 22 Jun, 15:08
nom...@intel.com [build-test alert] BUILD FAILED Linux SUSE 9 gcc debug: drlvm test Fri, 22 Jun, 17:31
nom...@intel.com [build-test alert] BUILD SUCCEEDED Linux SUSE 9 x86_64: harmony_hdk Fri, 22 Jun, 18:34
nom...@intel.com [build-test alert] BUILD FAILED LINUX SUSE 9 x86: jdktools_test Fri, 22 Jun, 19:01
nbe...@kc.rr.com [build-test alert] BUILD PASSED Windows XP x86: drlvm-test Fri, 22 Jun, 19:10
nom...@intel.com [build-test alert] BUILD SUCCEEDED Linux SUSE 9 x86: jdktools_test Fri, 22 Jun, 20:20
nom...@intel.com [build-test alert] BUILD SUCCEEDED Linux SUSE 9 gcc debug: drlvm test Fri, 22 Jun, 21:28
nom...@intel.com [build-test alert] BUILD FAILED LINUX SUSE 9 x86_64: harmony_hdk Fri, 22 Jun, 22:40
nom...@intel.com [build-test alert] BUILD FAILED Windows server 2003 msvc: jdktools_test Fri, 22 Jun, 22:53
nom...@intel.com [build-test alert] BUILD SUCCEEDED Linux SUSE 9 x86_64: harmony_hdk Fri, 22 Jun, 23:47
nbe...@kc.rr.com [build-test alert] BUILD FAILED Windows XP x86: drlvm-test Sat, 23 Jun, 00:16
nbe...@kc.rr.com [build-test alert] BUILD FAILED Windows 2000 x86: drlvm-test Sat, 23 Jun, 01:51
nbe...@kc.rr.com [build-test alert] BUILD PASSED Windows XP x86: drlvm-test Sat, 23 Jun, 05:50
nbe...@kc.rr.com [build-test alert] BUILD FAILED Windows XP x86: classlib-test Sat, 23 Jun, 06:48
nbe...@kc.rr.com [build-test alert] BUILD FAILED Windows XP x86: drlvm-test Sat, 23 Jun, 12:25
nom...@intel.com [build-test alert] BUILD SUCCEEDED Windows 2003 x86_64 msvc debug: classlib tests Sat, 23 Jun, 13:17
nbe...@kc.rr.com [build-test alert] BUILD FAILED Windows XP x86: classlib-test Sat, 23 Jun, 13:27
nom...@intel.com [build-test alert] BUILD SUCCEEDED Windows XP SP2 x86: jdktools_test Mon, 25 Jun, 03:22
nom...@intel.com [build-test alert] BUILD SUCCEEDED Windows server 2003 msvc: jdktools_test Mon, 25 Jun, 03:30
nom...@intel.com [build-test alert] BUILD FAILED Linux SUSE 9 64bit gcc debug: drlvm tests Mon, 25 Jun, 05:32
nom...@intel.com [build-test alert] BUILD SUCCEEDED Linux SUSE 9 64bit gcc debug: drlvm tests Mon, 25 Jun, 08:29
nom...@intel.com [build-test alert] BUILD SUCCEEDED Linux SUSE 9 gcc debug: classlib over drlvm Mon, 25 Jun, 09:38
nom...@intel.com [build-test alert] BUILD FAILED Windows XP SP2 x86: jdktools_test Mon, 25 Jun, 13:14
nbe...@kc.rr.com [build-test alert] BUILD FAILED Windows XP x86: classlib-test Mon, 25 Jun, 13:36
nom...@intel.com [build-test alert] BUILD FAILED LINUX SUSE 9 x86: jdktools_test Mon, 25 Jun, 13:47
nom...@intel.com [build-test alert] BUILD SUCCEEDED Linux SUSE 9 x86: jdktools_test Mon, 25 Jun, 14:34
nom...@intel.com [build-test alert] BUILD FAILED Windows 2003 x86_64 msvc debug: classlib tests Mon, 25 Jun, 15:03
nom...@intel.com [build-test alert] BUILD FAILED LINUX SUSE 9 x86: jdktools_test Mon, 25 Jun, 17:39
nom...@intel.com [build-test alert] BUILD SUCCEEDED Linux SUSE 9 x86: jdktools_test Mon, 25 Jun, 18:10
nbe...@kc.rr.com [build-test alert] BUILD FAILED Windows XP x86: drlvm-test Mon, 25 Jun, 18:45
nbe...@kc.rr.com [build-test alert] BUILD FAILED Windows XP x86: classlib-test Mon, 25 Jun, 20:07
nbe...@kc.rr.com [build-test alert] BUILD PASSED Windows XP x86: drlvm-test Tue, 26 Jun, 00:13
nbe...@kc.rr.com [build-test alert] BUILD PASSED Windows 2000 x86: classlib-test Tue, 26 Jun, 00:42
nbe...@kc.rr.com [build-test alert] BUILD FAILED Windows 2000 x86: drlvm-test Tue, 26 Jun, 03:15
nom...@intel.com [build-test alert] BUILD FAILED Linux SUSE 9 gcc debug: classlib over drlvm Tue, 26 Jun, 03:23
nom...@intel.com [build-test alert] BUILD FAILED Windows server 2003 msvc: jdktools_test Tue, 26 Jun, 03:33
nom...@intel.com [build-test alert] BUILD FAILED LINUX SUSE 9 x86: jdktools_test Tue, 26 Jun, 03:57
nom...@intel.com [build-test alert] BUILD SUCCEEDED Linux SUSE 9 x86: jdktools_test Tue, 26 Jun, 04:51
nom...@intel.com [build-test alert] BUILD FAILED Linux SUSE 9 gcc debug: drlvm test Tue, 26 Jun, 06:15
nom...@intel.com [build-test alert] BUILD SUCCEEDED Windows server 2003 msvc: jdktools_test Tue, 26 Jun, 08:40
nom...@intel.com [build-test alert] BUILD SUCCEEDED Linux SUSE 9 gcc debug: classlib over drlvm Tue, 26 Jun, 10:11
nom...@intel.com [build-test alert] BUILD SUCCEEDED Windows 2003 x86_64 msvc debug: classlib tests Tue, 26 Jun, 11:08
nom...@intel.com [build-test alert] BUILD SUCCEEDED Linux SUSE 9 gcc debug: drlvm test Tue, 26 Jun, 12:25
nbe...@kc.rr.com [build-test alert] BUILD FAILED Windows XP x86: classlib-test Tue, 26 Jun, 14:38
nbe...@kc.rr.com [build-test alert] BUILD FAILED Windows XP x86: drlvm-test Tue, 26 Jun, 18:49
nom...@intel.com [build-test alert] BUILD FAILED Windows 2003 x86_64 msvc debug: classlib tests Tue, 26 Jun, 19:10
nbe...@kc.rr.com [build-test alert] BUILD FAILED Windows XP x86: classlib-test Tue, 26 Jun, 20:34
nbe...@kc.rr.com [build-test alert] BUILD FAILED Windows 2000 x86: drlvm-test Tue, 26 Jun, 23:57
nbe...@kc.rr.com [build-test alert] BUILD PASSED Windows 2000 x86: classlib-test Wed, 27 Jun, 00:08
nbe...@kc.rr.com [build-test alert] BUILD FAILED Windows 2000 x86: drlvm-test Wed, 27 Jun, 00:54
nbe...@kc.rr.com [build-test alert] BUILD PASSED Windows 2000 x86: classlib-test Wed, 27 Jun, 01:05
nbe...@kc.rr.com [build-test alert] BUILD FAILED Windows XP x86: drlvm-test Wed, 27 Jun, 01:31
nom...@intel.com [build-test alert] BUILD FAILED LINUX SUSE 9 x86_64: harmony_hdk Wed, 27 Jun, 01:53
nom...@intel.com [build-test alert] BUILD SUCCEEDED Linux SUSE 9 x86_64: harmony_hdk Wed, 27 Jun, 02:48
nom...@intel.com [build-test alert] BUILD SUCCEEDED Windows 2003 x86_64 msvc debug: classlib tests Wed, 27 Jun, 07:36
nom...@intel.com [build-test alert] BUILD FAILED Linux SUSE 9 64bit gcc debug: drlvm tests Wed, 27 Jun, 09:05
nbe...@kc.rr.com [build-test alert] BUILD PASSED Windows XP x86: drlvm-test Wed, 27 Jun, 10:12
nom...@intel.com [build-test alert] BUILD SUCCEEDED Linux SUSE 9 64bit gcc debug: drlvm tests Wed, 27 Jun, 12:01
nom...@intel.com [build-test alert] BUILD FAILED Linux SUSE 9 64bit gcc debug: drlvm reg.test Wed, 27 Jun, 12:36
nom...@intel.com [build-test alert] BUILD SUCCEEDED Linux SUSE 9 64bit gcc debug: drlvm reg.test Wed, 27 Jun, 13:44
nbe...@kc.rr.com [build-test alert] BUILD FAILED Windows XP x86: drlvm-test Wed, 27 Jun, 14:43
nbe...@kc.rr.com [build-test alert] BUILD FAILED Windows XP x86: classlib-test Wed, 27 Jun, 15:44
nbe...@kc.rr.com [build-test alert] BUILD FAILED Windows XP x86: drlvm-test Wed, 27 Jun, 20:14
Message list« Previous · 1 · 2 · 3 · 4 · 5 · 6 · 7 · Next »Thread · Author · Date
Box list
Jul 20113
Dec 201029
Nov 20106
Oct 201046
Sep 201035
Aug 201017
Jul 201029
Jun 201041
May 201020
Apr 201040
Mar 2010102
Feb 201043
Jan 201014
Dec 200911
Nov 20099
Oct 200912
Sep 20093
Aug 200915
Jul 200959
Jun 200916
May 200930
Apr 200960
Mar 200919
Feb 200945
Jan 200957
Dec 200827
Nov 200815
Oct 200824
Sep 200854
Aug 200834
Jul 200841
Jun 200899
May 200862
Apr 2008113
Mar 2008133
Feb 2008164
Jan 2008291
Dec 2007335
Nov 2007454
Oct 2007405
Sep 2007259
Aug 2007368
Jul 2007618
Jun 2007607
May 2007672
Apr 2007455
Mar 20071104
Feb 2007389
Jan 2007418
Dec 200692