harmony-alerts mailing list archives: June 2007

Site index · List index
Message list« Previous · 1 · 2 · 3 · 4 · 5 · 6 · 7 · Next »Thread · Author · Date
nbe...@kc.rr.com [build-test alert] BUILD FAILED Windows XP x86: drlvm-test Fri, 08 Jun, 01:05
nbe...@kc.rr.com [build-test alert] BUILD FAILED Windows XP x86: classlib-test Fri, 08 Jun, 02:27
nom...@intel.com [build-test alert] BUILD FAILED LINUX SUSE 9 x86_64: harmony HDK Fri, 08 Jun, 03:37
nom...@intel.com [build-test alert] BUILD FAILED LINUX SUSE 9 x86_64: tomcat start Fri, 08 Jun, 03:39
nom...@intel.com [build-test alert] BUILD SUCCEEDED Linux SUSE9 64bit gcc debug: classlib Fri, 08 Jun, 04:18
nom...@intel.com [build-test alert] BUILD SUCCEEDED Linux SUSE 9 x86_64: harmony HDK Fri, 08 Jun, 04:41
nom...@intel.com [build-test alert] BUILD SUCCEEDED Linux SUSE 9 x86_64: tomcat start Fri, 08 Jun, 04:43
nbe...@kc.rr.com [build-test alert] BUILD FAILED Windows XP x86: drlvm-test Fri, 08 Jun, 06:00
nom...@intel.com [build-test alert] BUILD FAILED LINUX SUSE 9 x86: harmony HDK Fri, 08 Jun, 06:19
nom...@intel.com [build-test alert] BUILD FAILED Linux SUSE 9 64bit gcc debug: classlib over drlvm Fri, 08 Jun, 06:41
nbe...@kc.rr.com [build-test alert] BUILD PASSED Windows 2000 x86: classlib-test Fri, 08 Jun, 06:45
nom...@intel.com [build-test alert] BUILD SUCCEEDED Linux SUSE 9 x86: harmony HDK Fri, 08 Jun, 06:53
nbe...@kc.rr.com [build-test alert] BUILD FAILED Windows 2000 x86: drlvm-test Fri, 08 Jun, 06:55
nbe...@kc.rr.com [build-test alert] BUILD FAILED Windows XP x86: classlib-test Fri, 08 Jun, 07:21
nom...@intel.com [build-test alert] BUILD SUCCEEDED Linux SUSE 9 x86_64: jdktools_test Fri, 08 Jun, 07:51
nom...@intel.com [build-test alert] BUILD FAILED LINUX SUSE 9 x86_64: harmony_hdk Fri, 08 Jun, 08:38
nom...@intel.com [build-test alert] BUILD SUCCEEDED Windows 2003 x86_64 msvc debug: drlvm Fri, 08 Jun, 10:15
nom...@intel.com [build-test alert] BUILD SUCCEEDED Linux SUSE 9 64bit gcc debug: classlib over drlvm Fri, 08 Jun, 10:46
nbe...@kc.rr.com [build-test alert] BUILD FAILED Windows XP x86: drlvm-test Fri, 08 Jun, 10:55
nom...@intel.com [build-test alert] BUILD SUCCEEDED Windows 2003 x86_64 msvc debug: classlib tests Fri, 08 Jun, 11:07
nom...@intel.com [build-test alert] BUILD SUCCEEDED Linux SUSE 9 x86_64: harmony_hdk Fri, 08 Jun, 13:24
nom...@intel.com [build-test alert] BUILD FAILED Linux SUSE 9 64bit gcc debug: classlib over drlvm Fri, 08 Jun, 13:47
nbe...@kc.rr.com [build-test alert] BUILD FAILED Windows 2000 x86: drlvm-test Fri, 08 Jun, 13:57
nbe...@kc.rr.com [build-test alert] BUILD PASSED Windows 2000 x86: classlib-test Fri, 08 Jun, 14:11
nom...@intel.com [build-test alert] BUILD FAILED LINUX SUSE 9 x86_64: harmony_hdk Fri, 08 Jun, 15:43
nbe...@kc.rr.com [build-test alert] BUILD FAILED Windows XP x86: drlvm-test Fri, 08 Jun, 17:05
nbe...@kc.rr.com [build-test alert] BUILD FAILED Windows XP x86: classlib-test Fri, 08 Jun, 18:11
nom...@intel.com [build-test alert] BUILD SUCCEEDED Linux SUSE 9 64bit gcc debug: classlib over drlvm Fri, 08 Jun, 19:03
nom...@intel.com [build-test alert] BUILD FAILED LINUX SUSE 9 x86_64: tomcat start Fri, 08 Jun, 19:53
nom...@intel.com [build-test alert] BUILD FAILED LINUX SUSE 9 x86_64: harmony HDK Fri, 08 Jun, 20:11
nbe...@kc.rr.com [build-test alert] BUILD FAILED Windows 2000 x86: drlvm-test Fri, 08 Jun, 20:17
nom...@intel.com [build-test alert] BUILD FAILED Linux SUSE 9 64bit gcc debug: classlib over drlvm Fri, 08 Jun, 20:21
nbe...@kc.rr.com [build-test alert] BUILD PASSED Windows 2000 x86: classlib-test Fri, 08 Jun, 20:29
nbe...@kc.rr.com [build-test alert] BUILD FAILED Windows 2000 x86: drlvm-test Fri, 08 Jun, 21:16
nbe...@kc.rr.com [build-test alert] BUILD PASSED Windows 2000 x86: classlib-test Fri, 08 Jun, 21:27
nom...@intel.com [build-test alert] BUILD SUCCEEDED Linux SUSE 9 x86_64: harmony HDK Fri, 08 Jun, 21:36
nom...@intel.com [build-test alert] BUILD SUCCEEDED Linux SUSE 9 x86_64: tomcat start Fri, 08 Jun, 23:24
nom...@intel.com [build-test alert] BUILD SUCCEEDED Linux SUSE 9 64bit gcc debug: classlib over drlvm Sat, 09 Jun, 00:28
nbe...@kc.rr.com [build-test alert] BUILD FAILED Windows XP x86: drlvm-test Sat, 09 Jun, 00:41
nbe...@kc.rr.com [build-test alert] BUILD FAILED Windows XP x86: classlib-test Sat, 09 Jun, 01:55
nom...@intel.com [build-test alert] BUILD FAILED Linux SUSE 9 gcc debug: classlib over drlvm Sat, 09 Jun, 04:44
nbe...@kc.rr.com [build-test alert] BUILD FAILED Windows XP x86: drlvm-test Sat, 09 Jun, 05:35
nom...@intel.com [build-test alert] BUILD FAILED LINUX SUSE 9 x86_64: harmony HDK Sat, 09 Jun, 06:56
nom...@intel.com [build-test alert] BUILD SUCCEEDED Linux SUSE 9 gcc debug: classlib over drlvm Sat, 09 Jun, 08:06
nom...@intel.com [build-test alert] BUILD SUCCEEDED Windows XP SP2 x86: jdktools_test Sat, 09 Jun, 09:35
nom...@intel.com [build-test alert] BUILD FAILED Windows 2003 x86_64 msvc debug: drlvm Sat, 09 Jun, 09:58
nom...@intel.com [build-test alert] BUILD SUCCEEDED Linux SUSE 9 x86_64: harmony HDK Sat, 09 Jun, 10:18
nbe...@kc.rr.com [build-test alert] BUILD PASSED Windows 2000 x86: classlib-test Sat, 09 Jun, 10:46
nbe...@kc.rr.com [build-test alert] BUILD FAILED Windows 2000 x86: drlvm-test Sat, 09 Jun, 10:55
nbe...@kc.rr.com [build-test alert] BUILD PASSED Windows 2000 x86: classlib-test Sat, 09 Jun, 11:44
nbe...@kc.rr.com [build-test alert] BUILD FAILED Windows 2000 x86: drlvm-test Sat, 09 Jun, 11:53
nom...@intel.com [build-test alert] BUILD SUCCEEDED Linux SUSE 9 x86_64: harmony_hdk Sat, 09 Jun, 11:54
nom...@intel.com [build-test alert] BUILD FAILED Linux SUSE 9 64bit gcc debug: drlvm tests Sat, 09 Jun, 12:56
nbe...@kc.rr.com [build-test alert] BUILD FAILED Windows XP x86: drlvm-test Sat, 09 Jun, 14:02
nbe...@kc.rr.com [build-test alert] BUILD PASSED Windows 2000 x86: classlib-test Sat, 09 Jun, 14:45
nbe...@kc.rr.com [build-test alert] BUILD FAILED Windows 2000 x86: drlvm-test Sat, 09 Jun, 14:53
nbe...@kc.rr.com [build-test alert] BUILD FAILED Windows XP x86: classlib-test Sat, 09 Jun, 15:01
nom...@intel.com [build-test alert] BUILD FAILED LINUX SUSE 9 x86_64: harmony_hdk Sat, 09 Jun, 15:12
nom...@intel.com [build-test alert] BUILD SUCCEEDED Linux SUSE 9 64bit gcc debug: drlvm tests Sat, 09 Jun, 15:35
nbe...@kc.rr.com [build-test alert] BUILD PASSED Windows 2000 x86: classlib-test Sat, 09 Jun, 15:42
nbe...@kc.rr.com [build-test alert] BUILD FAILED Windows 2000 x86: drlvm-test Sat, 09 Jun, 15:52
nom...@intel.com [build-test alert] BUILD FAILED Linux SUSE 9 64bit gcc debug: classlib over drlvm Sat, 09 Jun, 16:00
nom...@intel.com [build-test alert] BUILD FAILED Linux SUSE 9 64bit gcc debug: drlvm reg.test Sat, 09 Jun, 16:07
nom...@intel.com [build-test alert] BUILD SUCCEEDED Linux SUSE 9 x86_64: harmony_hdk Sat, 09 Jun, 16:31
nbe...@kc.rr.com [build-test alert] BUILD FAILED Windows XP x86: drlvm-test Sat, 09 Jun, 17:33
nom...@intel.com [build-test alert] BUILD FAILED Linux SUSE 9 64bit gcc debug: drlvm tests Sat, 09 Jun, 18:15
nbe...@kc.rr.com [build-test alert] BUILD PASSED Windows 2000 x86: classlib-test Sun, 10 Jun, 03:47
nom...@intel.com [build-test alert] BUILD FAILED LINUX SUSE 9 x86_64: harmony_hdk Sun, 10 Jun, 03:53
nbe...@kc.rr.com [build-test alert] BUILD FAILED Windows 2000 x86: drlvm-test Sun, 10 Jun, 03:57
nom...@intel.com [build-test alert] BUILD SUCCEEDED Linux SUSE 9 x86_64: harmony_hdk Sun, 10 Jun, 04:39
nom...@intel.com [build-test alert] BUILD FAILED Linux SUSE9 64bit gcc debug: classlib Sun, 10 Jun, 17:49
nom...@intel.com [build-test alert] BUILD FAILED LINUX SUSE 9 x86_64: harmony HDK Sun, 10 Jun, 17:49
nbe...@kc.rr.com [build-test alert] BUILD FAILED Windows 2000 x86: drlvm-test Sun, 10 Jun, 18:42
nbe...@kc.rr.com [build-test alert] BUILD PASSED Windows 2000 x86: classlib-test Sun, 10 Jun, 18:55
nom...@intel.com [build-test alert] BUILD FAILED Linux SUSE 9 gcc debug: drlvm test Sun, 10 Jun, 19:33
nom...@intel.com [build-test alert] BUILD FAILED Linux SUSE 9 gcc debug: classlib over drlvm Sun, 10 Jun, 19:51
nom...@intel.com [build-test alert] BUILD FAILED Linux SUSE 9 gcc debug: drlvm reg.test Sun, 10 Jun, 20:08
nom...@intel.com [build-test alert] BUILD FAILED LINUX SUSE 9 x86_64: tomcat start Mon, 11 Jun, 04:25
nbe...@kc.rr.com [build-test alert] BUILD FAILED Windows 2000 x86: drlvm-test Mon, 11 Jun, 14:57
nbe...@kc.rr.com [build-test alert] BUILD PASSED Windows 2000 x86: classlib-test Mon, 11 Jun, 15:10
nbe...@kc.rr.com [build-test alert] BUILD FAILED Windows 2000 x86: drlvm-test Mon, 11 Jun, 15:58
nbe...@kc.rr.com [build-test alert] BUILD PASSED Windows 2000 x86: classlib-test Mon, 11 Jun, 16:10
nbe...@kc.rr.com [build-test alert] BUILD FAILED Windows 2000 x86: drlvm-test Mon, 11 Jun, 17:38
nbe...@kc.rr.com [build-test alert] BUILD PASSED Windows 2000 x86: classlib-test Mon, 11 Jun, 17:50
nbe...@kc.rr.com [build-test alert] BUILD FAILED Windows 2000 x86: drlvm-test Mon, 11 Jun, 19:05
nom...@intel.com [build-test alert] BUILD SUCCEEDED Linux SUSE 9 64bit gcc debug: drlvm reg.test Mon, 11 Jun, 19:14
nbe...@kc.rr.com [build-test alert] BUILD PASSED Windows 2000 x86: classlib-test Mon, 11 Jun, 19:18
nom...@intel.com [build-test alert] BUILD SUCCEEDED Linux SUSE 9 gcc debug: drlvm test Mon, 11 Jun, 21:27
nom...@intel.com [build-test alert] BUILD SUCCEEDED Linux SUSE 9 gcc debug: classlib over drlvm Mon, 11 Jun, 22:15
nbe...@kc.rr.com [build-test alert] BUILD PASSED Windows 2000 x86: classlib-test Tue, 12 Jun, 09:51
nbe...@kc.rr.com [build-test alert] BUILD FAILED Windows 2000 x86: drlvm-test Tue, 12 Jun, 10:00
nbe...@kc.rr.com [build-test alert] BUILD PASSED Windows 2000 x86: classlib-test Tue, 12 Jun, 11:17
nbe...@kc.rr.com [build-test alert] BUILD FAILED Windows 2000 x86: drlvm-test Tue, 12 Jun, 11:26
nbe...@kc.rr.com [build-test alert] BUILD PASSED Windows 2000 x86: classlib-test Tue, 12 Jun, 12:35
nbe...@kc.rr.com [build-test alert] BUILD FAILED Windows 2000 x86: drlvm-test Tue, 12 Jun, 12:44
nbe...@kc.rr.com [build-test alert] BUILD PASSED Windows 2000 x86: classlib-test Tue, 12 Jun, 13:32
nbe...@kc.rr.com [build-test alert] BUILD FAILED Windows 2000 x86: drlvm-test Tue, 12 Jun, 13:41
nom...@intel.com [build-test alert] BUILD FAILED Linux SUSE9 64bit gcc debug: drlvm Tue, 12 Jun, 13:59
nom...@intel.com [build-test alert] BUILD SUCCEEDED Linux SUSE9 64bit gcc debug: drlvm Tue, 12 Jun, 14:35
nom...@intel.com [build-test alert] BUILD FAILED Windows XP SP2 x86: jdktools_test Tue, 12 Jun, 15:55
Message list« Previous · 1 · 2 · 3 · 4 · 5 · 6 · 7 · Next »Thread · Author · Date
Box list
Jul 20113
Dec 201029
Nov 20106
Oct 201046
Sep 201035
Aug 201017
Jul 201029
Jun 201041
May 201020
Apr 201040
Mar 2010102
Feb 201043
Jan 201014
Dec 200911
Nov 20099
Oct 200912
Sep 20093
Aug 200915
Jul 200959
Jun 200916
May 200930
Apr 200960
Mar 200919
Feb 200945
Jan 200957
Dec 200827
Nov 200815
Oct 200824
Sep 200854
Aug 200834
Jul 200841
Jun 200899
May 200862
Apr 2008113
Mar 2008133
Feb 2008164
Jan 2008291
Dec 2007335
Nov 2007454
Oct 2007405
Sep 2007259
Aug 2007368
Jul 2007618
Jun 2007607
May 2007672
Apr 2007455
Mar 20071104
Feb 2007389
Jan 2007418
Dec 200692