harmony-alerts mailing list archives

Site index · List index
Message view « Date » · « Thread »
Top « Date » · « Thread »
From nbe...@kc.rr.com
Subject [build-test alert] BUILD FAILED Windows XP x86: drlvm-test
Date Wed, 27 Jun 2007 14:43:10 GMT
BUILD FAILED:
	Ant Error Message:
C:\harmony\buildtest2\scripts\cc-exec-adaptor.xml:101: The following error occurred while
executing this line: C:\harmony\buildtest2\adaptors\drlvm-test\adaptor.xml:75: There were
drlvm-test failures

Date of build:	06/27/2007 05:32:11
Time to build:	249 minutes 23 seconds
Last changed:	06/27/2007 05:18:24
Last log entry:	classlib

***********************************************************
Errors/Warnings:	(24)
            
[java] Java Result: 1
[java] Java Result: 1
[java] Java Result: 130
[java] Java Result: 1
[java] Java Result: 1
[java] Java Result: 130
[java] Java Result: 1
[java] Java Result: 1
[java] Java Result: 130
[java] Java Result: 1
[java] Java Result: 1
[java] Java Result: 130
[java] Java Result: 1
[java] Java Result: 1
[java] Java Result: 130
[junit] Tests FAILED
[junit] Tests FAILED
BUILD FAILED
C:\harmony\buildtest2\build\checkouts\drlvm\build\make\build.xml:398: The following error
occurred while executing this line:
C:\harmony\buildtest2\build\checkouts\drlvm\build\make\build_component.xml:73: The following
error occurred while executing this line:
C:\harmony\buildtest2\build\checkouts\drlvm\build\win_ia32_msvc_debug\semis\build\targets\test.xml:6:
Some tests failed
Total time: 247 minutes 43 seconds
The execution FAILED with the following exception:
The following error occurred while executing this line:
C:\harmony\buildtest2\adaptors\drlvm-test\adaptor.xml:75: There were drlvm-test failures

***********************************************************
Unit Tests: (4338)
        
failure: test_exec_Str java.lang.RuntimeTest2
failure: test_exec_Str java.lang.RuntimeTest2
Unit Test Error Details:	(2)
                
Test: test_exec_StrClass: java.lang.RuntimeTest2junit.framework.AssertionFailedError: check001:
the date's reply has not been received
	at junit.framework.Assert.fail(Assert.java:47)
	at java.lang.RuntimeTest2.exec_StrForWindows(RuntimeTest2.java:295)
	at java.lang.RuntimeTest2.test_exec_Str(RuntimeTest2.java:362)
	at java.lang.reflect.VMReflection.invokeMethod(VMReflection.java)
	at java.lang.reflect.Method.invoke(Method.java:317)
	at junit.framework.TestCase.runTest(TestCase.java:164)
	at junit.framework.TestCase.runBare(TestCase.java:130)
	at junit.framework.TestResult$1.protect(TestResult.java:106)
	at junit.framework.TestResult.runProtected(TestResult.java:124)
	at junit.framework.TestResult.run(TestResult.java:109)
	at junit.framework.TestCase.run(TestCase.java:120)
	at junit.framework.TestSuite.runTest(TestSuite.java:230)
	at junit.framework.TestSuite.run(TestSuite.java:225)
	at org.apache.tools.ant.taskdefs.optional.junit.JUnitTestRunner.run(JUnitTestRunner.java:297)
	at org.apache.tools.ant.taskdefs.optional.junit.JUnitTestRunner.launch(JUnitTestRunner.java:672)
	at org.apache.tools.ant.taskdefs.optional.junit.JUnitTestRunner.main(JUnitTestRunner.java:546)
Test: test_exec_StrClass: java.lang.RuntimeTest2junit.framework.AssertionFailedError: check001:
the date's reply has not been received
	at junit.framework.Assert.fail(Assert.java:47)
	at java.lang.RuntimeTest2.exec_StrForWindows(RuntimeTest2.java:295)
	at java.lang.RuntimeTest2.test_exec_Str(RuntimeTest2.java:362)
	at java.lang.reflect.VMReflection.invokeMethod(VMReflection.java)
	at java.lang.reflect.Method.invoke(Method.java:317)
	at junit.framework.TestCase.runTest(TestCase.java:164)
	at junit.framework.TestCase.runBare(TestCase.java)
	at junit.framework.TestResult$1.protect(TestResult.java)
	at junit.framework.TestResult.runProtected(TestResult.java)
	at junit.framework.TestResult.run(TestResult.java)
	at junit.framework.TestCase.run(TestCase.java)
	at junit.framework.TestSuite.runTest(TestSuite.java)
	at junit.framework.TestSuite.run(TestSuite.java)
	at org.apache.tools.ant.taskdefs.optional.junit.JUnitTestRunner.run(JUnitTestRunner.java)
	at org.apache.tools.ant.taskdefs.optional.junit.JUnitTestRunner.launch(JUnitTestRunner.java:672)
	at org.apache.tools.ant.taskdefs.optional.junit.JUnitTestRunner.main(JUnitTestRunner.java:546)

***********************************************************
Modifications since last successful build:	(4)
            
add cc-classlib log20070627051824Lbuild.35 06/27/2007 05:18:24classlib
modified smishura  /harmony/enhanced/classlib/trunk/modules/luni/src/main/native/fdlibm/unix/makefile
06/27/2007 01:45:48 Apply patch from HARMONY-4287:([classlib][build] failures in MathTest
and StrictMathTest if classlib is compiled in RELEASE mode)
modified smishura  /harmony/enhanced/classlib/trunk/modules/luni/src/main/native/fdlibm/unix/makefile
06/27/2007 01:45:48 Apply patch from HARMONY-4287:([classlib][build] failures in MathTest
and StrictMathTest if classlib is compiled in RELEASE mode)
modified smishura  /harmony/enhanced/classlib/trunk/modules/luni/src/main/native/fdlibm/unix/makefile
06/27/2007 01:45:48 Apply patch from HARMONY-4287:([classlib][build] failures in MathTest
and StrictMathTest if classlib is compiled in RELEASE mode)



Mime
View raw message