harmony-alerts mailing list archives

Site index · List index
Message view « Date » · « Thread »
Top « Date » · « Thread »
From nbe...@kc.rr.com
Subject [build-test alert] BUILD FAILED Windows XP x86: drlvm-test
Date Sat, 23 Jun 2007 12:25:55 GMT
BUILD FAILED:
	Ant Error Message:
C:\harmony\buildtest2\scripts\cc-exec-adaptor.xml:101: The following error occurred while
executing this line: C:\harmony\buildtest2\adaptors\drlvm-test\adaptor.xml:75: There were
drlvm-test failures

Date of build:	06/23/2007 02:15:49
Time to build:	309 minutes 0 seconds
Last changed:	06/23/2007 01:50:31
Last log entry:	drlvm

***********************************************************
Errors/Warnings:	(102)
            
[java] Java Result: 1
[java] Java Result: 1
[java] Java Result: 130
[java] Timeout: killed the sub-process
[java] 	at org.apache.tools.ant.taskdefs.Java.fork(Java.java:754)
[java] 	at org.apache.tools.ant.taskdefs.Java.executeJava(Java.java:171)
[java] 	at org.apache.tools.ant.taskdefs.Java.execute(Java.java:84)
[java] 	at org.apache.tools.ant.UnknownElement.execute(UnknownElement.java:275)
[java] 	at org.apache.tools.ant.Task.perform(Task.java:364)
[java] 	at org.apache.tools.ant.taskdefs.Sequential.execute(Sequential.java:64)
[java] 	at net.sf.antcontrib.logic.IfTask.execute(IfTask.java:197)
[java] 	at sun.reflect.GeneratedMethodAccessor132.invoke(Unknown Source)
[java] 	at sun.reflect.DelegatingMethodAccessorImpl.invoke(DelegatingMethodAccessorImpl.java:25)
[java] 	at java.lang.reflect.Method.invoke(Method.java:585)
[java] 	at org.apache.tools.ant.TaskAdapter.execute(TaskAdapter.java:123)
[java] 	at org.apache.tools.ant.UnknownElement.execute(UnknownElement.java:275)
[java] 	at org.apache.tools.ant.Task.perform(Task.java:364)
[java] 	at org.apache.tools.ant.taskdefs.Sequential.execute(Sequential.java:64)
[java] 	at org.apache.tools.ant.UnknownElement.execute(UnknownElement.java:275)
[java] 	at org.apache.tools.ant.Task.perform(Task.java:364)
[java] 	at org.apache.tools.ant.taskdefs.MacroInstance.execute(MacroInstance.java:378)
[java] 	at net.sf.antcontrib.logic.ForDelegate.doSequentialIteration(ForDelegate.java:228)
[java] 	at net.sf.antcontrib.logic.ForDelegate.doTheTasks(ForDelegate.java:281)
[java] 	at net.sf.antcontrib.logic.ForDelegate.execute(ForDelegate.java:213)
[java] 	at net.sf.antcontrib.logic.For.execute(For.java:166)
[java] 	at org.apache.tools.ant.UnknownElement.execute(UnknownElement.java:275)
[java] 	at org.apache.tools.ant.Task.perform(Task.java:364)
[java] 	at org.apache.tools.ant.Target.execute(Target.java:341)
[java] 	at org.apache.tools.ant.Target.performTasks(Target.java:369)
[java] 	at org.apache.tools.ant.Project.executeSortedTargets(Project.java:1216)
[java] 	at org.apache.tools.ant.helper.SingleCheckExecutor.executeTargets(SingleCheckExecutor.java:37)
[java] 	at org.apache.tools.ant.Project.executeTargets(Project.java:1068)
[java] 	at org.apache.tools.ant.taskdefs.Ant.execute(Ant.java:382)
[java] 	at org.apache.tools.ant.taskdefs.CallTarget.execute(CallTarget.java:107)
[java] 	at org.apache.tools.ant.UnknownElement.execute(UnknownElement.java:275)
[java] 	at org.apache.tools.ant.Task.perform(Task.java:364)
[java] 	at org.apache.tools.ant.taskdefs.Sequential.execute(Sequential.java:64)
[java] 	at org.apache.tools.ant.UnknownElement.execute(UnknownElement.java:275)
[java] 	at org.apache.tools.ant.Task.perform(Task.java:364)
[java] 	at org.apache.tools.ant.taskdefs.MacroInstance.execute(MacroInstance.java:378)
[java] 	at net.sf.antcontrib.logic.ForDelegate.doSequentialIteration(ForDelegate.java:228)
[java] 	at net.sf.antcontrib.logic.ForDelegate.doTheTasks(ForDelegate.java:253)
[java] 	at net.sf.antcontrib.logic.ForDelegate.execute(ForDelegate.java:213)
[java] 	at net.sf.antcontrib.logic.For.execute(For.java:166)
[java] 	at org.apache.tools.ant.UnknownElement.execute(UnknownElement.java:275)
[java] 	at org.apache.tools.ant.Task.perform(Task.java:364)
[java] 	at org.apache.tools.ant.Target.execute(Target.java:341)
[java] 	at org.apache.tools.ant.Target.performTasks(Target.java:369)
[java] 	at org.apache.tools.ant.Project.executeSortedTargets(Project.java:1216)
[java] 	at org.apache.tools.ant.Project.executeTarget(Project.java:1185)
[java] 	at net.sf.antcontrib.logic.AntFetch.execute(AntFetch.java:345)
[java] 	at org.apache.tools.ant.UnknownElement.execute(UnknownElement.java:275)
[java] 	at org.apache.tools.ant.Task.perform(Task.java:364)
[java] 	at org.apache.tools.ant.Target.execute(Target.java:341)
[java] 	at org.apache.tools.ant.Target.performTasks(Target.java:369)
[java] 	at org.apache.tools.ant.Project.executeSortedTargets(Project.java:1216)
[java] 	at org.apache.tools.ant.helper.SingleCheckExecutor.executeTargets(SingleCheckExecutor.java:37)
[java] 	at org.apache.tools.ant.Project.executeTargets(Project.java:1068)
[java] 	at org.apache.tools.ant.taskdefs.Ant.execute(Ant.java:382)
[java] 	at org.apache.tools.ant.UnknownElement.execute(UnknownElement.java:275)
[java] 	at org.apache.tools.ant.Task.perform(Task.java:364)
[java] 	at org.apache.tools.ant.Target.execute(Target.java:341)
[java] 	at org.apache.tools.ant.Target.performTasks(Target.java:369)
[java] 	at org.apache.tools.ant.Project.executeSortedTargets(Project.java:1216)
[java] 	at org.apache.tools.ant.helper.SingleCheckExecutor.executeTargets(SingleCheckExecutor.java:37)
[java] 	at org.apache.tools.ant.Project.executeTargets(Project.java:1068)
[java] 	at org.apache.tools.ant.taskdefs.Ant.execute(Ant.java:382)
[java] 	at org.apache.tools.ant.taskdefs.SubAnt.execute(SubAnt.java:277)
[java] 	at org.apache.tools.ant.taskdefs.SubAnt.execute(SubAnt.java:201)
[java] 	at org.apache.tools.ant.UnknownElement.execute(UnknownElement.java:275)
[java] 	at org.apache.tools.ant.Task.perform(Task.java:364)
[java] 	at org.apache.tools.ant.Target.execute(Target.java:341)
[java] 	at org.apache.tools.ant.Target.performTasks(Target.java:369)
[java] 	at org.apache.tools.ant.Project.executeSortedTargets(Project.java:1216)
[java] 	at org.apache.tools.ant.Project.executeTarget(Project.java:1185)
[java] 	at org.apache.tools.ant.helper.DefaultExecutor.executeTargets(DefaultExecutor.java:40)
[java] 	at org.apache.tools.ant.Project.executeTargets(Project.java:1068)
[java] 	at org.apache.tools.ant.Main.runBuild(Main.java:668)
[java] 	at org.apache.tools.ant.Main.startAnt(Main.java:187)
[java] 	at org.apache.tools.ant.launch.Launcher.run(Launcher.java:246)
[java] 	at org.apache.tools.ant.launch.Launcher.main(Launcher.java:67)
[java] Java Result: 1
[java] Java Result: 1
[java] Java Result: 130
[java] Java Result: 1
[java] Java Result: 1
[java] Java Result: 130
[java] Java Result: 1
[java] Java Result: 1
[java] Java Result: 130
[java] Java Result: 1
[java] Java Result: 1
[java] Java Result: 130
[junit] Tests FAILED
[junit] Tests FAILED
BUILD FAILED
C:\harmony\buildtest2\build\checkouts\drlvm\build\make\build.xml:400: The following error
occurred while executing this line:
C:\harmony\buildtest2\build\checkouts\drlvm\build\make\build_component.xml:73: The following
error occurred while executing this line:
C:\harmony\buildtest2\build\checkouts\drlvm\build\win_ia32_msvc_debug\semis\build\targets\test.xml:6:
Some tests failed
Total time: 307 minutes 26 seconds
The execution FAILED with the following exception:
The following error occurred while executing this line:
C:\harmony\buildtest2\adaptors\drlvm-test\adaptor.xml:75: There were drlvm-test failures

***********************************************************
Unit Tests: (4338)
        
failure: test_exec_Str java.lang.RuntimeTest2
failure: test_exec_Str java.lang.RuntimeTest2
Unit Test Error Details:	(2)
                
Test: test_exec_StrClass: java.lang.RuntimeTest2junit.framework.AssertionFailedError: check001:
the date's reply has not been received
	at junit.framework.Assert.fail(Assert.java:47)
	at java.lang.RuntimeTest2.exec_StrForWindows(RuntimeTest2.java:295)
	at java.lang.RuntimeTest2.test_exec_Str(RuntimeTest2.java:362)
	at java.lang.reflect.VMReflection.invokeMethod(VMReflection.java)
	at java.lang.reflect.Method.invoke(Method.java:317)
	at junit.framework.TestCase.runTest(TestCase.java:164)
	at junit.framework.TestCase.runBare(TestCase.java:130)
	at junit.framework.TestResult$1.protect(TestResult.java:106)
	at junit.framework.TestResult.runProtected(TestResult.java:124)
	at junit.framework.TestResult.run(TestResult.java:109)
	at junit.framework.TestCase.run(TestCase.java:120)
	at junit.framework.TestSuite.runTest(TestSuite.java:230)
	at junit.framework.TestSuite.run(TestSuite.java:225)
	at org.apache.tools.ant.taskdefs.optional.junit.JUnitTestRunner.run(JUnitTestRunner.java:297)
	at org.apache.tools.ant.taskdefs.optional.junit.JUnitTestRunner.launch(JUnitTestRunner.java:672)
	at org.apache.tools.ant.taskdefs.optional.junit.JUnitTestRunner.main(JUnitTestRunner.java:546)
Test: test_exec_StrClass: java.lang.RuntimeTest2junit.framework.AssertionFailedError: check001:
the date's reply has not been received
	at junit.framework.Assert.fail(Assert.java:47)
	at java.lang.RuntimeTest2.exec_StrForWindows(RuntimeTest2.java:295)
	at java.lang.RuntimeTest2.test_exec_Str(RuntimeTest2.java:362)
	at java.lang.reflect.VMReflection.invokeMethod(VMReflection.java)
	at java.lang.reflect.Method.invoke(Method.java:317)
	at junit.framework.TestCase.runTest(TestCase.java:164)
	at junit.framework.TestCase.runBare(TestCase.java)
	at junit.framework.TestResult$1.protect(TestResult.java)
	at junit.framework.TestResult.runProtected(TestResult.java)
	at junit.framework.TestResult.run(TestResult.java)
	at junit.framework.TestCase.run(TestCase.java)
	at junit.framework.TestSuite.runTest(TestSuite.java)
	at junit.framework.TestSuite.run(TestSuite.java)
	at org.apache.tools.ant.taskdefs.optional.junit.JUnitTestRunner.run(JUnitTestRunner.java)
	at org.apache.tools.ant.taskdefs.optional.junit.JUnitTestRunner.launch(JUnitTestRunner.java:672)
	at org.apache.tools.ant.taskdefs.optional.junit.JUnitTestRunner.main(JUnitTestRunner.java:546)

***********************************************************
Modifications since last successful build:	(1)
            
add cc-drlvm log20070623015031Lbuild.16 06/23/2007 01:50:31drlvm



Mime
View raw message