harmony-alerts mailing list archives

Site index · List index
Message view « Date » · « Thread »
Top « Date » · « Thread »
From nbe...@kc.rr.com
Subject [build-test alert] BUILD FAILED Windows XP x86: drlvm-test
Date Fri, 22 Jun 2007 14:27:48 GMT
BUILD FAILED:
	Ant Error Message:
C:\harmony\buildtest2\scripts\cc-exec-adaptor.xml:101: The following error occurred while
executing this line: C:\harmony\buildtest2\adaptors\drlvm-test\adaptor.xml:75: There were
drlvm-test failures

Date of build:	06/22/2007 05:14:34
Time to build:	251 minutes 59 seconds
Last changed:	06/22/2007 05:01:06
Last log entry:	classlib

***********************************************************
Errors/Warnings:	(23)
            
[java] Java Result: 1
[java] Java Result: 1
[java] Java Result: 130
[java] Java Result: 1
[java] Java Result: 1
[java] Java Result: 130
[java] Java Result: 1
[java] Java Result: 1
[java] Java Result: 130
[java] Java Result: 1
[java] Java Result: 1
[java] Java Result: 130
[java] Java Result: 1
[java] Java Result: 1
[java] Java Result: 130
[junit] Tests FAILED
BUILD FAILED
C:\harmony\buildtest2\build\checkouts\drlvm\build\make\build.xml:400: The following error
occurred while executing this line:
C:\harmony\buildtest2\build\checkouts\drlvm\build\make\build_component.xml:73: The following
error occurred while executing this line:
C:\harmony\buildtest2\build\checkouts\drlvm\build\win_ia32_msvc_debug\semis\build\targets\test.xml:6:
Some tests failed
Total time: 250 minutes 12 seconds
The execution FAILED with the following exception:
The following error occurred while executing this line:
C:\harmony\buildtest2\adaptors\drlvm-test\adaptor.xml:75: There were drlvm-test failures

***********************************************************
Unit Tests: (4338)
        
failure: test_exec_Str java.lang.RuntimeTest2
Unit Test Error Details:	(1)
                
Test: test_exec_StrClass: java.lang.RuntimeTest2junit.framework.AssertionFailedError: check001:
the date's reply has not been received
	at junit.framework.Assert.fail(Assert.java:47)
	at java.lang.RuntimeTest2.exec_StrForWindows(RuntimeTest2.java:295)
	at java.lang.RuntimeTest2.test_exec_Str(RuntimeTest2.java:362)
	at java.lang.reflect.VMReflection.invokeMethod(VMReflection.java)
	at java.lang.reflect.Method.invoke(Method.java:317)
	at junit.framework.TestCase.runTest(TestCase.java:164)
	at junit.framework.TestCase.runBare(TestCase.java)
	at junit.framework.TestResult$1.protect(TestResult.java)
	at junit.framework.TestResult.runProtected(TestResult.java)
	at junit.framework.TestResult.run(TestResult.java)
	at junit.framework.TestCase.run(TestCase.java)
	at junit.framework.TestSuite.runTest(TestSuite.java)
	at junit.framework.TestSuite.run(TestSuite.java)
	at org.apache.tools.ant.taskdefs.optional.junit.JUnitTestRunner.run(JUnitTestRunner.java)
	at org.apache.tools.ant.taskdefs.optional.junit.JUnitTestRunner.launch(JUnitTestRunner.java:672)
	at org.apache.tools.ant.taskdefs.optional.junit.JUnitTestRunner.main(JUnitTestRunner.java:546)

***********************************************************
Modifications since last successful build:	(37)
            
add cc-classlib log20070622050106Lbuild.30 06/22/2007 05:01:06classlib
modified tellison  /harmony/enhanced/classlib/trunk/modules/portlib/src/main/native/thread/shared/hythread.c
06/22/2007 04:26:08 Clarify thread detach semantics to fixHARMONY-4237 (hythread_detach()
documentation)
modified tellison  /harmony/enhanced/classlib/trunk/modules/portlib/src/main/native/thread/shared/hythread.c
06/22/2007 04:26:08 Clarify thread detach semantics to fixHARMONY-4237 (hythread_detach()
documentation)
modified tellison  /harmony/enhanced/classlib/trunk/modules/portlib/src/main/native/thread/shared/hythread.c
06/22/2007 04:26:08 Clarify thread detach semantics to fixHARMONY-4237 (hythread_detach()
documentation)
modified tonywu  /harmony/enhanced/classlib/trunk/modules/luni/src/main/java/java/net/URLClassLoader.java
06/22/2007 03:19:29 clean up compiler warning, no functionality modified.
modified tonywu  /harmony/enhanced/classlib/trunk/modules/luni/src/main/java/java/util/HugeEnumSet.java
06/22/2007 03:19:29 clean up compiler warning, no functionality modified.
modified tonywu  /harmony/enhanced/classlib/trunk/modules/luni/src/main/java/org/apache/harmony/luni/platform/INetworkSystem.java
06/22/2007 03:19:29 clean up compiler warning, no functionality modified.
modified tonywu  /harmony/enhanced/classlib/trunk/modules/luni/src/main/java/java/io/ObjectInputStream.java
06/22/2007 03:19:29 clean up compiler warning, no functionality modified.
modified tonywu  /harmony/enhanced/classlib/trunk/modules/luni/src/main/java/java/io/ObjectOutputStream.java
06/22/2007 03:19:29 clean up compiler warning, no functionality modified.
modified tonywu  /harmony/enhanced/classlib/trunk/modules/luni/src/main/java/java/net/ProxySelectorImpl.java
06/22/2007 03:19:29 clean up compiler warning, no functionality modified.
modified tonywu  /harmony/enhanced/classlib/trunk/modules/luni/src/main/java/org/apache/harmony/luni/util/TwoKeyHashMap.java
06/22/2007 03:19:29 clean up compiler warning, no functionality modified.
modified tonywu  /harmony/enhanced/classlib/trunk/modules/luni/src/main/java/java/util/EnumMap.java
06/22/2007 03:19:29 clean up compiler warning, no functionality modified.
modified tonywu  /harmony/enhanced/classlib/trunk/modules/luni/src/main/java/org/apache/harmony/luni/platform/OSNetworkSystem.java
06/22/2007 03:19:29 clean up compiler warning, no functionality modified.
modified tonywu  /harmony/enhanced/classlib/trunk/modules/luni/src/main/java/java/util/Stack.java
06/22/2007 03:19:29 clean up compiler warning, no functionality modified.
modified tonywu  /harmony/enhanced/classlib/trunk/modules/luni/src/main/java/org/apache/harmony/luni/util/FloatingPointParser.java
06/22/2007 03:19:29 clean up compiler warning, no functionality modified.
modified tonywu  /harmony/enhanced/classlib/trunk/modules/luni/src/main/java/java/net/URLClassLoader.java
06/22/2007 03:19:29 clean up compiler warning, no functionality modified.
modified tonywu  /harmony/enhanced/classlib/trunk/modules/luni/src/main/java/java/util/HugeEnumSet.java
06/22/2007 03:19:29 clean up compiler warning, no functionality modified.
modified tonywu  /harmony/enhanced/classlib/trunk/modules/luni/src/main/java/org/apache/harmony/luni/platform/INetworkSystem.java
06/22/2007 03:19:29 clean up compiler warning, no functionality modified.
modified tonywu  /harmony/enhanced/classlib/trunk/modules/luni/src/main/java/java/io/ObjectInputStream.java
06/22/2007 03:19:29 clean up compiler warning, no functionality modified.
modified tonywu  /harmony/enhanced/classlib/trunk/modules/luni/src/main/java/java/io/ObjectOutputStream.java
06/22/2007 03:19:29 clean up compiler warning, no functionality modified.
modified tonywu  /harmony/enhanced/classlib/trunk/modules/luni/src/main/java/java/net/ProxySelectorImpl.java
06/22/2007 03:19:29 clean up compiler warning, no functionality modified.
modified tonywu  /harmony/enhanced/classlib/trunk/modules/luni/src/main/java/org/apache/harmony/luni/util/TwoKeyHashMap.java
06/22/2007 03:19:29 clean up compiler warning, no functionality modified.
modified tonywu  /harmony/enhanced/classlib/trunk/modules/luni/src/main/java/java/util/EnumMap.java
06/22/2007 03:19:29 clean up compiler warning, no functionality modified.
modified tonywu  /harmony/enhanced/classlib/trunk/modules/luni/src/main/java/org/apache/harmony/luni/platform/OSNetworkSystem.java
06/22/2007 03:19:29 clean up compiler warning, no functionality modified.
modified tonywu  /harmony/enhanced/classlib/trunk/modules/luni/src/main/java/java/util/Stack.java
06/22/2007 03:19:29 clean up compiler warning, no functionality modified.
modified tonywu  /harmony/enhanced/classlib/trunk/modules/luni/src/main/java/org/apache/harmony/luni/util/FloatingPointParser.java
06/22/2007 03:19:29 clean up compiler warning, no functionality modified.
modified tonywu  /harmony/enhanced/classlib/trunk/modules/luni/src/main/java/java/net/URLClassLoader.java
06/22/2007 03:19:29 clean up compiler warning, no functionality modified.
modified tonywu  /harmony/enhanced/classlib/trunk/modules/luni/src/main/java/java/util/HugeEnumSet.java
06/22/2007 03:19:29 clean up compiler warning, no functionality modified.
modified tonywu  /harmony/enhanced/classlib/trunk/modules/luni/src/main/java/org/apache/harmony/luni/platform/INetworkSystem.java
06/22/2007 03:19:29 clean up compiler warning, no functionality modified.
modified tonywu  /harmony/enhanced/classlib/trunk/modules/luni/src/main/java/java/io/ObjectInputStream.java
06/22/2007 03:19:29 clean up compiler warning, no functionality modified.
modified tonywu  /harmony/enhanced/classlib/trunk/modules/luni/src/main/java/java/io/ObjectOutputStream.java
06/22/2007 03:19:29 clean up compiler warning, no functionality modified.
modified tonywu  /harmony/enhanced/classlib/trunk/modules/luni/src/main/java/java/net/ProxySelectorImpl.java
06/22/2007 03:19:29 clean up compiler warning, no functionality modified.
modified tonywu  /harmony/enhanced/classlib/trunk/modules/luni/src/main/java/org/apache/harmony/luni/util/TwoKeyHashMap.java
06/22/2007 03:19:29 clean up compiler warning, no functionality modified.
modified tonywu  /harmony/enhanced/classlib/trunk/modules/luni/src/main/java/java/util/EnumMap.java
06/22/2007 03:19:29 clean up compiler warning, no functionality modified.
modified tonywu  /harmony/enhanced/classlib/trunk/modules/luni/src/main/java/org/apache/harmony/luni/platform/OSNetworkSystem.java
06/22/2007 03:19:29 clean up compiler warning, no functionality modified.
modified tonywu  /harmony/enhanced/classlib/trunk/modules/luni/src/main/java/java/util/Stack.java
06/22/2007 03:19:29 clean up compiler warning, no functionality modified.
modified tonywu  /harmony/enhanced/classlib/trunk/modules/luni/src/main/java/org/apache/harmony/luni/util/FloatingPointParser.java
06/22/2007 03:19:29 clean up compiler warning, no functionality modified.



Mime
View raw message