harmony-alerts mailing list archives

Site index · List index
Message view « Date » · « Thread »
Top « Date » · « Thread »
From nbe...@kc.rr.com
Subject [build-test alert] BUILD FAILED Windows XP x86: drlvm-test
Date Thu, 21 Jun 2007 09:37:19 GMT
BUILD FAILED:
	Ant Error Message:
C:\harmony\buildtest2\scripts\cc-exec-adaptor.xml:101: The following error occurred while
executing this line: C:\harmony\buildtest2\adaptors\drlvm-test\adaptor.xml:75: There were
drlvm-test failures

Date of build:	06/21/2007 00:30:39
Time to build:	245 minutes 35 seconds
Last changed:	06/21/2007 00:15:36
Last log entry:	classlib

***********************************************************
Errors/Warnings:	(23)
            
[java] Java Result: 1
[java] Java Result: 1
[java] Java Result: 130
[java] Java Result: 1
[java] Java Result: 1
[java] Java Result: 130
[java] Java Result: 1
[java] Java Result: 1
[java] Java Result: 130
[java] Java Result: 1
[java] Java Result: 1
[java] Java Result: 130
[java] Java Result: 1
[java] Java Result: 1
[java] Java Result: 130
[junit] Tests FAILED
BUILD FAILED
C:\harmony\buildtest2\build\checkouts\drlvm\build\make\build.xml:400: The following error
occurred while executing this line:
C:\harmony\buildtest2\build\checkouts\drlvm\build\make\build_component.xml:73: The following
error occurred while executing this line:
C:\harmony\buildtest2\build\checkouts\drlvm\build\win_ia32_msvc_debug\semis\build\targets\test.xml:6:
Some tests failed
Total time: 244 minutes 10 seconds
The execution FAILED with the following exception:
The following error occurred while executing this line:
C:\harmony\buildtest2\adaptors\drlvm-test\adaptor.xml:75: There were drlvm-test failures

***********************************************************
Unit Tests: (4338)
        
failure: test_exec_Str java.lang.RuntimeTest2
Unit Test Error Details:	(1)
                
Test: test_exec_StrClass: java.lang.RuntimeTest2junit.framework.AssertionFailedError: check001:
the date's reply has not been received
	at junit.framework.Assert.fail(Assert.java:47)
	at java.lang.RuntimeTest2.exec_StrForWindows(RuntimeTest2.java:295)
	at java.lang.RuntimeTest2.test_exec_Str(RuntimeTest2.java:362)
	at java.lang.reflect.VMReflection.invokeMethod(VMReflection.java)
	at java.lang.reflect.Method.invoke(Method.java:317)
	at junit.framework.TestCase.runTest(TestCase.java:164)
	at junit.framework.TestCase.runBare(TestCase.java:130)
	at junit.framework.TestResult$1.protect(TestResult.java:106)
	at junit.framework.TestResult.runProtected(TestResult.java:124)
	at junit.framework.TestResult.run(TestResult.java:109)
	at junit.framework.TestCase.run(TestCase.java:120)
	at junit.framework.TestSuite.runTest(TestSuite.java:230)
	at junit.framework.TestSuite.run(TestSuite.java:225)
	at org.apache.tools.ant.taskdefs.optional.junit.JUnitTestRunner.run(JUnitTestRunner.java:297)
	at org.apache.tools.ant.taskdefs.optional.junit.JUnitTestRunner.launch(JUnitTestRunner.java:672)
	at org.apache.tools.ant.taskdefs.optional.junit.JUnitTestRunner.main(JUnitTestRunner.java:546)

***********************************************************
Modifications since last successful build:	(34)
            
add cc-classlib log20070621001536Lbuild.24 06/21/2007 00:15:36classlib
added pyang  /harmony/enhanced/classlib/trunk/modules/luni/src/test/api/windows/org 06/20/2007
22:31:59 Apply patch for HARMONY-3656([classlib][luni] File.mkdir does not support unicode)
with small modifications to make new FileTest for windows only compile
added pyang  /harmony/enhanced/classlib/trunk/modules/luni/src/test/api/windows/org/apache
06/20/2007 22:31:59 Apply patch for HARMONY-3656([classlib][luni] File.mkdir does not support
unicode) with small modifications to make new FileTest for windows only compile
modified pyang  /harmony/enhanced/classlib/trunk/modules/luni/src/main/java/java/io/File.java
06/20/2007 22:31:59 Apply patch for HARMONY-3656([classlib][luni] File.mkdir does not support
unicode) with small modifications to make new FileTest for windows only compile
modified pyang  /harmony/enhanced/classlib/trunk/modules/portlib/src/main/native/port/windows/hyfile.c
06/20/2007 22:31:59 Apply patch for HARMONY-3656([classlib][luni] File.mkdir does not support
unicode) with small modifications to make new FileTest for windows only compile
added pyang  /harmony/enhanced/classlib/trunk/modules/luni/src/test/api/windows/org/apache/harmony/luni
06/20/2007 22:31:59 Apply patch for HARMONY-3656([classlib][luni] File.mkdir does not support
unicode) with small modifications to make new FileTest for windows only compile
added pyang  /harmony/enhanced/classlib/trunk/modules/luni/src/test/api/windows/org/apache/harmony/luni/tests
06/20/2007 22:31:59 Apply patch for HARMONY-3656([classlib][luni] File.mkdir does not support
unicode) with small modifications to make new FileTest for windows only compile
added pyang  /harmony/enhanced/classlib/trunk/modules/luni/src/test/api/windows/org/apache/harmony/luni/tests/java
06/20/2007 22:31:59 Apply patch for HARMONY-3656([classlib][luni] File.mkdir does not support
unicode) with small modifications to make new FileTest for windows only compile
modified pyang  /harmony/enhanced/classlib/trunk/modules/luni/src/test/api/common/tests/api/java/io/FileTest.java
06/20/2007 22:31:59 Apply patch for HARMONY-3656([classlib][luni] File.mkdir does not support
unicode) with small modifications to make new FileTest for windows only compile
added pyang  /harmony/enhanced/classlib/trunk/modules/luni/src/test/api/windows/org/apache/harmony/luni/tests/java/io/WinFileTest.java
06/20/2007 22:31:59 Apply patch for HARMONY-3656([classlib][luni] File.mkdir does not support
unicode) with small modifications to make new FileTest for windows only compile
added pyang  /harmony/enhanced/classlib/trunk/modules/luni/src/test/api/windows/org/apache/harmony
06/20/2007 22:31:59 Apply patch for HARMONY-3656([classlib][luni] File.mkdir does not support
unicode) with small modifications to make new FileTest for windows only compile
added pyang  /harmony/enhanced/classlib/trunk/modules/luni/src/test/api/windows/org/apache/harmony/luni/tests/java/io
06/20/2007 22:31:59 Apply patch for HARMONY-3656([classlib][luni] File.mkdir does not support
unicode) with small modifications to make new FileTest for windows only compile
added pyang  /harmony/enhanced/classlib/trunk/modules/luni/src/test/api/windows/org 06/20/2007
22:31:59 Apply patch for HARMONY-3656([classlib][luni] File.mkdir does not support unicode)
with small modifications to make new FileTest for windows only compile
added pyang  /harmony/enhanced/classlib/trunk/modules/luni/src/test/api/windows/org/apache
06/20/2007 22:31:59 Apply patch for HARMONY-3656([classlib][luni] File.mkdir does not support
unicode) with small modifications to make new FileTest for windows only compile
modified pyang  /harmony/enhanced/classlib/trunk/modules/luni/src/main/java/java/io/File.java
06/20/2007 22:31:59 Apply patch for HARMONY-3656([classlib][luni] File.mkdir does not support
unicode) with small modifications to make new FileTest for windows only compile
modified pyang  /harmony/enhanced/classlib/trunk/modules/portlib/src/main/native/port/windows/hyfile.c
06/20/2007 22:31:59 Apply patch for HARMONY-3656([classlib][luni] File.mkdir does not support
unicode) with small modifications to make new FileTest for windows only compile
added pyang  /harmony/enhanced/classlib/trunk/modules/luni/src/test/api/windows/org/apache/harmony/luni
06/20/2007 22:31:59 Apply patch for HARMONY-3656([classlib][luni] File.mkdir does not support
unicode) with small modifications to make new FileTest for windows only compile
added pyang  /harmony/enhanced/classlib/trunk/modules/luni/src/test/api/windows/org/apache/harmony/luni/tests
06/20/2007 22:31:59 Apply patch for HARMONY-3656([classlib][luni] File.mkdir does not support
unicode) with small modifications to make new FileTest for windows only compile
added pyang  /harmony/enhanced/classlib/trunk/modules/luni/src/test/api/windows/org/apache/harmony/luni/tests/java
06/20/2007 22:31:59 Apply patch for HARMONY-3656([classlib][luni] File.mkdir does not support
unicode) with small modifications to make new FileTest for windows only compile
modified pyang  /harmony/enhanced/classlib/trunk/modules/luni/src/test/api/common/tests/api/java/io/FileTest.java
06/20/2007 22:31:59 Apply patch for HARMONY-3656([classlib][luni] File.mkdir does not support
unicode) with small modifications to make new FileTest for windows only compile
added pyang  /harmony/enhanced/classlib/trunk/modules/luni/src/test/api/windows/org/apache/harmony/luni/tests/java/io/WinFileTest.java
06/20/2007 22:31:59 Apply patch for HARMONY-3656([classlib][luni] File.mkdir does not support
unicode) with small modifications to make new FileTest for windows only compile
added pyang  /harmony/enhanced/classlib/trunk/modules/luni/src/test/api/windows/org/apache/harmony
06/20/2007 22:31:59 Apply patch for HARMONY-3656([classlib][luni] File.mkdir does not support
unicode) with small modifications to make new FileTest for windows only compile
added pyang  /harmony/enhanced/classlib/trunk/modules/luni/src/test/api/windows/org/apache/harmony/luni/tests/java/io
06/20/2007 22:31:59 Apply patch for HARMONY-3656([classlib][luni] File.mkdir does not support
unicode) with small modifications to make new FileTest for windows only compile
added pyang  /harmony/enhanced/classlib/trunk/modules/luni/src/test/api/windows/org 06/20/2007
22:31:59 Apply patch for HARMONY-3656([classlib][luni] File.mkdir does not support unicode)
with small modifications to make new FileTest for windows only compile
added pyang  /harmony/enhanced/classlib/trunk/modules/luni/src/test/api/windows/org/apache
06/20/2007 22:31:59 Apply patch for HARMONY-3656([classlib][luni] File.mkdir does not support
unicode) with small modifications to make new FileTest for windows only compile
modified pyang  /harmony/enhanced/classlib/trunk/modules/luni/src/main/java/java/io/File.java
06/20/2007 22:31:59 Apply patch for HARMONY-3656([classlib][luni] File.mkdir does not support
unicode) with small modifications to make new FileTest for windows only compile
modified pyang  /harmony/enhanced/classlib/trunk/modules/portlib/src/main/native/port/windows/hyfile.c
06/20/2007 22:31:59 Apply patch for HARMONY-3656([classlib][luni] File.mkdir does not support
unicode) with small modifications to make new FileTest for windows only compile
added pyang  /harmony/enhanced/classlib/trunk/modules/luni/src/test/api/windows/org/apache/harmony/luni
06/20/2007 22:31:59 Apply patch for HARMONY-3656([classlib][luni] File.mkdir does not support
unicode) with small modifications to make new FileTest for windows only compile
added pyang  /harmony/enhanced/classlib/trunk/modules/luni/src/test/api/windows/org/apache/harmony/luni/tests
06/20/2007 22:31:59 Apply patch for HARMONY-3656([classlib][luni] File.mkdir does not support
unicode) with small modifications to make new FileTest for windows only compile
added pyang  /harmony/enhanced/classlib/trunk/modules/luni/src/test/api/windows/org/apache/harmony/luni/tests/java
06/20/2007 22:31:59 Apply patch for HARMONY-3656([classlib][luni] File.mkdir does not support
unicode) with small modifications to make new FileTest for windows only compile
modified pyang  /harmony/enhanced/classlib/trunk/modules/luni/src/test/api/common/tests/api/java/io/FileTest.java
06/20/2007 22:31:59 Apply patch for HARMONY-3656([classlib][luni] File.mkdir does not support
unicode) with small modifications to make new FileTest for windows only compile
added pyang  /harmony/enhanced/classlib/trunk/modules/luni/src/test/api/windows/org/apache/harmony/luni/tests/java/io/WinFileTest.java
06/20/2007 22:31:59 Apply patch for HARMONY-3656([classlib][luni] File.mkdir does not support
unicode) with small modifications to make new FileTest for windows only compile
added pyang  /harmony/enhanced/classlib/trunk/modules/luni/src/test/api/windows/org/apache/harmony
06/20/2007 22:31:59 Apply patch for HARMONY-3656([classlib][luni] File.mkdir does not support
unicode) with small modifications to make new FileTest for windows only compile
added pyang  /harmony/enhanced/classlib/trunk/modules/luni/src/test/api/windows/org/apache/harmony/luni/tests/java/io
06/20/2007 22:31:59 Apply patch for HARMONY-3656([classlib][luni] File.mkdir does not support
unicode) with small modifications to make new FileTest for windows only compile



Mime
View raw message