harmony-alerts mailing list archives

Site index · List index
Message view « Date » · « Thread »
Top « Date » · « Thread »
From nom...@intel.com
Subject [build-test alert] BUILD FAILED Linux SUSE9 64bit gcc debug: drlvm
Date Wed, 20 Jun 2007 07:25:58 GMT
BUILD FAILED:
	Ant Error Message:
/export/cruise_short/trunk/cc/projects/drlvm/trunk/build/make/build.xml:481: The following
error occurred while executing this line: /export/cruise_short/trunk/cc/projects/drlvm/trunk/build/make/build.xml:488:
The following error occurred while executing this line: /export/cruise_short/trunk/cc/projects/drlvm/trunk/build/make/build_component.xml:73:
The following error occurred while executing this line: /export/cruise_short/trunk/cc/projects/drlvm/trunk/build/lnx_em64t_gcc_debug/semis/build/targets/build.native.xml:157:
Could not launch ar: java.io.IOException: java.io.IOException: Cannot allocate memory

Date of build:	06/20/2007 14:06:43
Time to build:	18 minutes 27 seconds
Last changed:	06/20/2007 13:49:14
Last log entry:	classlib

***********************************************************
Errors/Warnings:	(47)
            
 Using CLASSLIB = /export/cruise_short/trunk/cc/projects/classlib/trunk
jars: true
using proxy settings: proxy.ims.intel.com port:911
 Using CLASSLIB = /export/cruise_short/trunk/cc/projects/classlib/trunk
jars: true
using proxy settings: proxy.ims.intel.com port:911
Configuration:
     Hosting Java = 1.5.0_09 (Sun Microsystems Inc.)
    classlib root = /export/cruise_short/trunk/cc/projects/classlib/trunk
               os = Linux
             arch = em64t
              cxx = gcc
              cfg = debug
     svn revision = 548958
       components = deploy
extra
extra.apr
extra.apriconv
extra.aprutil
extra.eclipse_script
extra.hyplugin
extra.java_script
extra.jre_libraries
extra.log4cxx
extra.zlib
vm
vm.em
vm.encoder
vm.gc_cc
vm.gc_gen
vm.hythr
vm.interpreter
vm.jitrino
vm.jthread
vm.kernel_classes
vm.port
vm.vmcore
vm.vmi
cat: /etc/ld.so.conf.d/*.conf: No such file or directory
cat: /etc/ld.so.conf.d/*.conf: No such file or directory
cat: /etc/ld.so.conf.d/*.conf: No such file or directory
## Building native of 'extra.apr'
## Building native of 'extra.apriconv'
apriconv: /export/cruise_short/trunk/cc/projects/drlvm/trunk/build/pre-copied/lnx/APRICONV/apr-iconv-1.1.1/include

## Building native of 'extra.aprutil'
## Building native of 'extra.log4cxx'

***********************************************************
Unit Tests: (0)
        
No Tests Run: This project doesn't have any tests

***********************************************************
Modifications since last successful build:	(3)
            
add cc-classlib log20070620134914Lbuild.451 06/20/2007 13:49:14classlib
modified leoli  /harmony/enhanced/classlib/trunk/modules/beans/make/exclude.common 06/20/2007
13:41:01 1. Copy ${hy.beans.src.test.support} to ${hy.beans.bin.test.support} as part of the
classpath of running testcases.2. Remove org.apache.harmony.beans.tests.java.beans.beancontext.BeanContextSupportTest
from the exclude tests list.
modified leoli  /harmony/enhanced/classlib/trunk/modules/beans/build.xml 06/20/2007 13:41:01
1. Copy ${hy.beans.src.test.support} to ${hy.beans.bin.test.support} as part of the classpath
of running testcases.2. Remove org.apache.harmony.beans.tests.java.beans.beancontext.BeanContextSupportTest
from the exclude tests list.

Mime
View raw message