harmony-alerts mailing list archives

Site index · List index
Message view « Date » · « Thread »
Top « Date » · « Thread »
From nom...@intel.com
Subject [build-test alert] BUILD FAILED Linux SUSE 9 gcc debug: classlib over drlvm
Date Tue, 19 Jun 2007 10:07:05 GMT
BUILD FAILED:
	Ant Error Message:
/export/cruise/trunk/cc/projects/classlib/trunk/build.xml:169: The following error occurred
while executing this line: /export/cruise/trunk/cc/projects/classlib/trunk/make/build-test.xml:148:
There were test failures.

Date of build:	06/19/2007 16:24:55
Time to build:	41 minutes 41 seconds
Last changed:	06/19/2007 16:01:38
Last log entry:	Fix bug in java.beans.beancontext.BeanContextServiceRevokedEvent.

***********************************************************
Execution log (errors/warnings messages):	

========================================
Testing class libraries...
========================================
Checking for depends/jars/yoko_M2-20070130/yoko.jar
Checking for depends/jars/yoko_M2-20070130/yoko-core.jar
Checking for depends/jars/yoko_M2-20070130/yoko-rmi-impl.jar
Checking for depends/jars/yoko_M2-20070130/yoko-rmi-spec.jar
Checking for depends/jars/bcel-5.2/bcel-5.2.jar
Checking for depends/jars/xalan-j_2.7.0/xalan.jar
Checking for depends/jars/xerces_2.9.0/xerces.zip
Checking for depends/jars/junit_3.8.2/junit.jar
Checking for depends/jars/bcprov-jdk15-136/bcprov.jar
Checking for depends/jars/icu4j_3.4.4/icu4j_3_4_4.jar
Checking for depends/jars/mx4j_3.0.2/mx4j.zip
Checking for depends/jars/jetty/jetty-6.0.0.jar
Checking for depends/jars/jetty/jetty-util-6.0.0.jar
Checking for depends/jars/jetty/servlet-api-2.5-6.0.0.jar
Checking for depends/libs/build/lcms/icc34.h
Checking for depends/libs/build/lcms/lcms.h
Checking for depends/libs/build/png/pngconf.h
Checking for depends/libs/build/png/png.h
Checking for depends/libs/build/jpeg/jconfig.lnx
Checking for depends/libs/build/jpeg/jpeglib.h
Checking for depends/libs/build/jpeg/jmorecfg.h
Checking for depends/libs/build/jpeg/jerror.h
Checking for depends/libs/build/lcms/liblcms.linux.x86
Checking for depends/libs/build/png/libpng.linux.x86
Checking for depends/libs/build/jpeg/libjpeg.linux.x86
hy.test.vm.name = drl
Compiling ACCESSIBILITY classes
Compiling ACCESSIBILITY tests
Since fork is false, ignoring memoryMaximumSize setting
Compiling ANNOTATION classes
Compiling ANNOTATION tests
Since fork is false, ignoring memoryMaximumSize setting
----------
1. WARNING in /export/cruise/trunk/cc/projects/classlib/trunk/modules/annotation/src/test/java/org/apache/harmony/annotation/tests/java/lang/annotation/IncompleteAnnotationExceptionTest.java
 (at line 53)
	clazz, elementName);
	^^^^^
Type safety: The expression of type Class needs unchecked conversion to conform to Class<?
extends Annotation>
----------
1 problem (1 warning)
Compiling APPLET classes
Compiling APPLET tests
Since fork is false, ignoring memoryMaximumSize setting
Compiling ARCHIVE classes
Compiling ARCHIVE tests
Since fork is false, ignoring memoryMaximumSize setting
The GC did not provide gc_add_weak_root_set_entry()
Compiling AUTH classes
Compiling AUTH tests
Since fork is false, ignoring memoryMaximumSize setting
The GC did not provide gc_add_weak_root_set_entry()
Compiling AWT classes
Compiling AWT tests
Since fork is false, ignoring memoryMaximumSize setting
The GC did not provide gc_add_weak_root_set_entry()
The GC did not provide gc_add_weak_root_set_entry()
Compiling BEANS classes
Compiling support classes for BEANS tests
Compiling internal BEANS tests
Compiling BEANS tests
Since fork is false, ignoring memoryMaximumSize setting
Running internal BEANS tests
Running BEANS tests
The GC did not provide gc_add_weak_root_set_entry()
Compiling CRYPTO classes
Compiling CRYPTO test support files
Compiling CRYPTO api tests
Since fork is false, ignoring memoryMaximumSize setting
Compiling CRYPTO api injected tests
Since fork is false, ignoring memoryMaximumSize setting
Compiling CRYPTO impl injected tests
Since fork is false, ignoring memoryMaximumSize setting
Compiling CRYPTO impl tests
Since fork is false, ignoring memoryMaximumSize setting
Running CRYPTO api tests
The GC did not provide gc_add_weak_root_set_entry()
Running CRYPTO api.injected tests
The GC did not provide gc_add_weak_root_set_entry()
Running CRYPTO impl tests
The GC did not provide gc_add_weak_root_set_entry()
Running CRYPTO impl injected tests
Compiling ImageIO classes
Compiling ImageIO tests
Since fork is false, ignoring memoryMaximumSize setting
Compiling INSTRUMENT classes
Compiling INSTRUMENT tests
Since fork is false, ignoring memoryMaximumSize setting
Compiling JNDI classes
Compiling JNDI tests
Since fork is false, ignoring memoryMaximumSize setting
The GC did not provide gc_add_weak_root_set_entry()
Compiling LANG-MANAGEMENT classes
Compiling LANG-MANAGEMENT API tests
Since fork is false, ignoring memoryMaximumSize setting
Compiling LANG-MANAGEMENT Implementation tests
Since fork is false, ignoring memoryMaximumSize setting
Compiling LOGGING classes
Compiling LOGGING tests
Since fork is false, ignoring memoryMaximumSize setting
The GC did not provide gc_add_weak_root_set_entry()
Compiling LUNI classes
Compiling LUNI JUnit Tests
Since fork is false, ignoring memoryMaximumSize setting
Running LUNI JUnit Tests
The GC did not provide gc_add_weak_root_set_entry()
2007-06-19 16:41:23.434::INFO:  Logging to STDERR via org.mortbay.log.StdErrLog
2007-06-19 16:41:23.689::INFO:  jetty-6.0.x
2007-06-19 16:41:24.004::INFO:  Started SocketConnector @ 0.0.0.0:45624
2007-06-19 16:42:05.136::INFO:  jetty-6.0.x
2007-06-19 16:42:05.141::INFO:  Started SocketConnector @ 0.0.0.0:45733
2007-06-19 16:42:05.797::INFO:  jetty-6.0.x
2007-06-19 16:42:05.798::INFO:  Started SocketConnector @ 0.0.0.0:45742
Compiling MATH classes
Compiling MATH tests
Since fork is false, ignoring memoryMaximumSize setting
The GC did not provide gc_add_weak_root_set_entry()
Compiling MISC classes
Compiling MISC tests
Since fork is false, ignoring memoryMaximumSize setting
Compiling NIO classes
Compiling NIO tests
Since fork is false, ignoring memoryMaximumSize setting
The GC did not provide gc_add_weak_root_set_entry()
Compiling NIO_CHAR classes
Compiling NIO_CHAR tests
Since fork is false, ignoring memoryMaximumSize setting
The GC did not provide gc_add_weak_root_set_entry()
Cannot find unmappable byte array for US-ASCII
Cannot find unmappable byte array for GB18030
Cannot find unmappable byte array for ISO-8859-1
Cannot find malform byte array for ISO-8859-1
Cannot find unmappable byte array for UTF-16BE
Cannot find malform byte array for UTF-16BE
Cannot find unmappable byte array for UTF-16
Cannot find malform byte array for UTF-16
Cannot find unmappable byte array for UTF-16LE
Cannot find malform byte array for UTF-16LE
Cannot find unmappable byte array for UTF-8
Compiling PACK200 classes
Compiling PACK200 tests
Since fork is false, ignoring memoryMaximumSize setting
Running PACK200 tests
Compiling PREFS classes
Compiling PREFS tests
Since fork is false, ignoring memoryMaximumSize setting
The GC did not provide gc_add_weak_root_set_entry()
Compiling PRINT classes
Compiling Print tests
Since fork is false, ignoring memoryMaximumSize setting
java.net.ConnectException: localhost/127.0.0.1:631 - Connection refused
	at org.apache.harmony.luni.net.PlainSocketImpl.connect(PlainSocketImpl.java:229)
	at org.apache.harmony.luni.net.PlainSocketImpl.connect(PlainSocketImpl.java:509)
	at java.net.Socket.connect(Socket.java:932)
	at org.apache.harmony.luni.internal.net.www.protocol.http.HttpURLConnection.getHTTPConnection(HttpURLConnection.java:635)
	at org.apache.harmony.luni.internal.net.www.protocol.http.HttpURLConnection.connect(HttpURLConnection.java:619)
	at org.apache.harmony.x.print.ipp.IppClient.request(IppClient.java:111)
	at org.apache.harmony.x.print.ipp.IppClient.request(IppClient.java:87)
	at org.apache.harmony.x.print.cups.CUPSPrintServiceProvider.findDefaultPrintService(CUPSPrintServiceProvider.java:471)
	at org.apache.harmony.x.print.cups.CUPSPrintServiceProvider.getDefaultPrintService(CUPSPrintServiceProvider.java:169)
	at javax.print.PrintServiceLookup.lookupDefaultPrintService(PrintServiceLookup.java:139)
	at javax.print.attribute.HashAttributeTest.testAdd2(HashAttributeTest.java:128)
	at java.lang.reflect.VMReflection.invokeMethod(VMReflection.java)
	at java.lang.reflect.Method.invoke(Method.java:317)
	at junit.framework.TestCase.runTest(TestCase.java:154)
	at junit.framework.TestCase.runBare(TestCase.java:127)
	at junit.framework.TestResult$1.protect(TestResult.java:106)
	at junit.framework.TestResult.runProtected(TestResult.java:124)
	at junit.framework.TestResult.run(TestResult.java:109)
	at junit.framework.TestCase.run(TestCase.java:118)
	at junit.framework.TestSuite.runTest(TestSuite.java:208)
	at junit.framework.TestSuite.run(TestSuite.java:203)
	at org.apache.tools.ant.taskdefs.optional.junit.JUnitTestRunner.run(JUnitTestRunner.java:297)
	at org.apache.tools.ant.taskdefs.optional.junit.JUnitTestRunner.launch(JUnitTestRunner.java:672)
	at org.apache.tools.ant.taskdefs.optional.junit.JUnitTestRunner.main(JUnitTestRunner.java:546)
java.net.ConnectException: localhost/127.0.0.1:631 - Connection refused
	at org.apache.harmony.luni.net.PlainSocketImpl.connect(PlainSocketImpl.java:229)
	at org.apache.harmony.luni.net.PlainSocketImpl.connect(PlainSocketImpl.java:509)
	at java.net.Socket.connect(Socket.java:932)
	at org.apache.harmony.luni.internal.net.www.protocol.http.HttpURLConnection.getHTTPConnection(HttpURLConnection.java:635)
	at org.apache.harmony.luni.internal.net.www.protocol.http.HttpURLConnection.connect(HttpURLConnection.java:619)
	at org.apache.harmony.x.print.ipp.IppClient.request(IppClient.java:111)
	at org.apache.harmony.x.print.ipp.IppClient.request(IppClient.java:87)
	at org.apache.harmony.x.print.cups.CUPSPrintServiceProvider.findDefaultPrintService(CUPSPrintServiceProvider.java:471)
	at org.apache.harmony.x.print.cups.CUPSPrintServiceProvider.getDefaultPrintService(CUPSPrintServiceProvider.java:169)
	at javax.print.PrintServiceLookup.lookupDefaultPrintService(PrintServiceLookup.java:139)
	at javax.print.attribute.HashAttributeTest.testEquals(HashAttributeTest.java:284)
	at java.lang.reflect.VMReflection.invokeMethod(VMReflection.java)
	at java.lang.reflect.Method.invoke(Method.java:317)
	at junit.framework.TestCase.runTest(TestCase.java:154)
	at junit.framework.TestCase.runBare(TestCase.java:127)
	at junit.framework.TestResult$1.protect(TestResult.java:106)
	at junit.framework.TestResult.runProtected(TestResult.java:124)
	at junit.framework.TestResult.run(TestResult.java:109)
	at junit.framework.TestCase.run(TestCase.java:118)
	at junit.framework.TestSuite.runTest(TestSuite.java:208)
	at junit.framework.TestSuite.run(TestSuite.java:203)
	at org.apache.tools.ant.taskdefs.optional.junit.JUnitTestRunner.run(JUnitTestRunner.java:297)
	at org.apache.tools.ant.taskdefs.optional.junit.JUnitTestRunner.launch(JUnitTestRunner.java:672)
	at org.apache.tools.ant.taskdefs.optional.junit.JUnitTestRunner.main(JUnitTestRunner.java:546)
java.net.ConnectException: localhost/127.0.0.1:631 - Connection refused
	at org.apache.harmony.luni.net.PlainSocketImpl.connect(PlainSocketImpl.java:229)
	at org.apache.harmony.luni.net.PlainSocketImpl.connect(PlainSocketImpl.java:509)
	at java.net.Socket.connect(Socket.java:932)
	at org.apache.harmony.luni.internal.net.www.protocol.http.HttpURLConnection.getHTTPConnection(HttpURLConnection.java:635)
	at org.apache.harmony.luni.internal.net.www.protocol.http.HttpURLConnection.connect(HttpURLConnection.java:619)
	at org.apache.harmony.x.print.ipp.IppClient.request(IppClient.java:111)
	at org.apache.harmony.x.print.ipp.IppClient.request(IppClient.java:87)
	at org.apache.harmony.x.print.cups.CUPSPrintServiceProvider.findDefaultPrintService(CUPSPrintServiceProvider.java:471)
	at org.apache.harmony.x.print.cups.CUPSPrintServiceProvider.getDefaultPrintService(CUPSPrintServiceProvider.java:169)
	at javax.print.PrintServiceLookup.lookupDefaultPrintService(PrintServiceLookup.java:139)
	at javax.print.attribute.HashAttributeTest.testAdd2(HashAttributeTest.java:128)
	at java.lang.reflect.VMReflection.invokeMethod(VMReflection.java)
	at java.lang.reflect.Method.invoke(Method.java:317)
	at junit.framework.TestCase.runTest(TestCase.java:154)
	at junit.framework.TestCase.runBare(TestCase.java:127)
	at junit.framework.TestResult$1.protect(TestResult.java:106)
	at junit.framework.TestResult.runProtected(TestResult.java:124)
	at junit.framework.TestResult.run(TestResult.java:109)
	at junit.framework.TestCase.run(TestCase.java:118)
	at junit.framework.TestSuite.runTest(TestSuite.java:208)
	at junit.framework.TestSuite.run(TestSuite.java:203)
	at junit.framework.TestSuite.runTest(TestSuite.java:208)
	at junit.framework.TestSuite.run(TestSuite.java:203)
	at org.apache.tools.ant.taskdefs.optional.junit.JUnitTestRunner.run(JUnitTestRunner.java:297)
	at org.apache.tools.ant.taskdefs.optional.junit.JUnitTestRunner.launch(JUnitTestRunner.java:672)
	at org.apache.tools.ant.taskdefs.optional.junit.JUnitTestRunner.main(JUnitTestRunner.java:546)
java.net.ConnectException: localhost/127.0.0.1:631 - Connection refused
	at org.apache.harmony.luni.net.PlainSocketImpl.connect(PlainSocketImpl.java:229)
	at org.apache.harmony.luni.net.PlainSocketImpl.connect(PlainSocketImpl.java:509)
	at java.net.Socket.connect(Socket.java:932)
	at org.apache.harmony.luni.internal.net.www.protocol.http.HttpURLConnection.getHTTPConnection(HttpURLConnection.java:635)
	at org.apache.harmony.luni.internal.net.www.protocol.http.HttpURLConnection.connect(HttpURLConnection.java:619)
	at org.apache.harmony.x.print.ipp.IppClient.request(IppClient.java:111)
	at org.apache.harmony.x.print.ipp.IppClient.request(IppClient.java:87)
	at org.apache.harmony.x.print.cups.CUPSPrintServiceProvider.findDefaultPrintService(CUPSPrintServiceProvider.java:471)
	at org.apache.harmony.x.print.cups.CUPSPrintServiceProvider.getDefaultPrintService(CUPSPrintServiceProvider.java:169)
	at javax.print.PrintServiceLookup.lookupDefaultPrintService(PrintServiceLookup.java:139)
	at javax.print.attribute.HashAttributeTest.testEquals(HashAttributeTest.java:284)
	at java.lang.reflect.VMReflection.invokeMethod(VMReflection.java)
	at java.lang.reflect.Method.invoke(Method.java:317)
	at junit.framework.TestCase.runTest(TestCase.java:154)
	at junit.framework.TestCase.runBare(TestCase.java:127)
	at junit.framework.TestResult$1.protect(TestResult.java:106)
	at junit.framework.TestResult.runProtected(TestResult.java:124)
	at junit.framework.TestResult.run(TestResult.java:109)
	at junit.framework.TestCase.run(TestCase.java:118)
	at junit.framework.TestSuite.runTest(TestSuite.java:208)
	at junit.framework.TestSuite.run(TestSuite.java:203)
	at junit.framework.TestSuite.runTest(TestSuite.java:208)
	at junit.framework.TestSuite.run(TestSuite.java:203)
	at org.apache.tools.ant.taskdefs.optional.junit.JUnitTestRunner.run(JUnitTestRunner.java:297)
	at org.apache.tools.ant.taskdefs.optional.junit.JUnitTestRunner.launch(JUnitTestRunner.java:672)
	at org.apache.tools.ant.taskdefs.optional.junit.JUnitTestRunner.main(JUnitTestRunner.java:546)
The GC did not provide gc_add_weak_root_set_entry()
Compiling REGEX classes
Compiling REGEX tests
Since fork is false, ignoring memoryMaximumSize setting
The GC did not provide gc_add_weak_root_set_entry()
Compiling RMI classes
Compiling RMI api tests
Since fork is false, ignoring memoryMaximumSize setting
Running RMI api tests
testDirectSocket_SingleVM starting
Test server started.
Object: MyRemoteObject[UnicastServerRef[endpoint:[[10.125.122.35:46335]](local), ObjID[65536,
UID[42b3d420:113436391f2:-8000]]]] created and exported.
Jun 19, 2007 4:50:09 PM org.apache.harmony.rmi.server.RMIReference makeStrong
FINER: main: Strongly referenced RegistryImpl
Registry created.
Object bound in the registry.
Registry located.
Jun 19, 2007 4:50:11 PM org.apache.harmony.rmi.client.ClientConnection sendDGCAck
FINER: main: Sent DGC ack to [localhost:1099] for UID[42b3d420:113436391f2:-7ffd]
Lookup object is: Proxy[interf:[org.apache.harmony.rmi.test.MyRemoteInterface, java.rmi.Remote],
RemoteObjectInvocationHandler[UnicastRef[endpoint:[[10.125.122.35:46335]](remote), ObjID[65536,
UID[42b3d420:113436391f2:-8000]]]]]
Testing test_String_Void...
Done.
Testing test_Void_String...
Returned: MyRemoteObject.test_Void_String
Done.
Testing test_Int_Void...
Done.
Testing test_Void_Int...
Returned: 987654321
Done.
Testing test_Remote_Void...
Done.
Testing test_Remote_Void with remote object extending another remote object...
Done.
Testing test_Void_Remote...
Jun 19, 2007 4:50:11 PM org.apache.harmony.rmi.client.ClientConnection sendDGCAck
FINER: main: Sent DGC ack to [10.125.122.35:46335] for UID[42b3d420:113436391f2:-7fe8]
Returned: Proxy[interf:[org.apache.harmony.rmi.test.MyRemoteInterface2, java.rmi.Remote],
RemoteObjectInvocationHandler[UnicastRef[endpoint:[[10.125.122.35:46343]](remote), ObjID[65539,
UID[42b3d420:113436391f2:-7fe9]]]]]
Done.
Testing test_Long_Long...
Returned: 998877665544332211
Done.
Testing test_String_String...
Returned: MyRemoteObject.test_String_String
Done.
Testing test_Remote_Remote...
Jun 19, 2007 4:50:12 PM org.apache.harmony.rmi.client.ClientConnection sendDGCAck
FINER: main: Sent DGC ack to [10.125.122.35:46335] for UID[42b3d420:113436391f2:-7fde]
Returned: Proxy[interf:[org.apache.harmony.rmi.test.MyRemoteInterface2, java.rmi.Remote],
RemoteObjectInvocationHandler[UnicastRef[endpoint:[[10.125.122.35:46347]](remote), ObjID[65541,
UID[42b3d420:113436391f2:-7fdf]]]]]
Done.
Testing test_RemoteString_Void...
Done.
Testing test_RemoteRemote_Remote...
The GC did not provide gc_add_weak_root_set_entry()
Jun 19, 2007 4:50:12 PM org.apache.harmony.rmi.client.ClientConnection sendDGCAck
FINER: main: Sent DGC ack to [10.125.122.35:46335] for UID[42b3d420:113436391f2:-7fd0]
Returned: Proxy[interf:[org.apache.harmony.rmi.test.MyRemoteInterface2, java.rmi.Remote],
RemoteObjectInvocationHandler[UnicastRef[endpoint:[[10.125.122.35:46354]](remote), ObjID[65545,
UID[42b3d420:113436391f2:-7fd1]]]]]
Done.
Testing test_BooleanStringRemote_Void...
Done.
Testing test_Proxy_Void...
Done.
Testing test_Array_Void...
Done.
Testing test_Void_Array...
Done.
Testing test_RemoteArray_Void...
Done.
Testing test_Void_RemoteArray...
Jun 19, 2007 4:50:13 PM org.apache.harmony.rmi.client.ClientConnection sendDGCAck
FINER: main: Sent DGC ack to [10.125.122.35:46335] for UID[42b3d420:113436391f2:-7fbd]
Done.
Testing test_Exception...
org.apache.harmony.rmi.test.MyException: MyRemoteObject.test_Exception
Done.
Testing test_Error...
java.rmi.ServerError: Error occurred while remote method invocation; nested exception is:
	java.lang.Error: MyRemoteObject.test_Error
Done.
Testing test_RuntimeException...
java.lang.RuntimeException: MyRemoteObject.text_RuntimeException
Done.
Testing test_RemoteException...
java.rmi.ServerException: RemoteException occurred while remote method invocation; nested
exception is:
	java.rmi.RemoteException: MyRemoteObject.text_RemoteException
Done.
Test server complete.
Test server closing.
Unexporting MyRemoteObject[UnicastServerRef[endpoint:[[10.125.122.35:46335]](local), ObjID[65536,
UID[42b3d420:113436391f2:-8000]]]] ...
Done.
Unexporting MyRemoteObject1[UnicastServerRef[endpoint:[[10.125.122.35:46339]](local), ObjID[65537,
UID[42b3d420:113436391f2:-7ff4]]]] ...
Done.
Unexporting MyRemoteObject4[UnicastServerRef[endpoint:[[10.125.122.35:46341]](local), ObjID[65538,
UID[42b3d420:113436391f2:-7fef]]]] ...
Done.
Unexporting MyRemoteObject1[UnicastServerRef[endpoint:[[10.125.122.35:46345]](local), ObjID[65540,
UID[42b3d420:113436391f2:-7fe3]]]] ...
Done.
Unexporting MyRemoteObject1[UnicastServerRef[endpoint:[[10.125.122.35:46348]](local), ObjID[65542,
UID[42b3d420:113436391f2:-7fdd]]]] ...
Done.
Unexporting MyRemoteObject1[UnicastServerRef[endpoint:[[10.125.122.35:46350]](local), ObjID[65543,
UID[42b3d420:113436391f2:-7fd8]]]] ...
Done.
Unexporting MyRemoteObject3[UnicastServerRef[endpoint:[[10.125.122.35:46351]](local), ObjID[65544,
UID[42b3d420:113436391f2:-7fd7]]]] ...
Done.
Unexporting MyRemoteObject1[UnicastServerRef[endpoint:[[10.125.122.35:46355]](local), ObjID[65546,
UID[42b3d420:113436391f2:-7fcf]]]] ...
Done.
Unexporting MyRemoteObject1[UnicastServerRef[endpoint:[[10.125.122.35:46357]](local), ObjID[65547,
UID[42b3d420:113436391f2:-7fc4]]]] ...
Done.
Unexporting MyRemoteObject1[UnicastServerRef[endpoint:[[10.125.122.35:46358]](local), ObjID[65548,
UID[42b3d420:113436391f2:-7fc3]]]] ...
Done.
Unexporting RegistryImpl ...
Done.
Test server exiting.
testDirectHTTP_SingleVM starting
Test server started.
Object: MyRemoteObject[UnicastServerRef[endpoint:[[10.125.122.35:46363]](local), ObjID[65536,
UID[42b3d420:1134363c064:-8000]]]] created and exported.
Jun 19, 2007 4:50:21 PM org.apache.harmony.rmi.server.RMIReference makeStrong
FINER: main: Strongly referenced RegistryImpl
Registry created.
Object bound in the registry.
Registry located.
Jun 19, 2007 4:50:23 PM org.apache.harmony.rmi.client.ClientConnection sendDGCAck
FINER: main: Sent DGC ack to [localhost:1099] for UID[42b3d420:1134363c064:-7ffd]
Lookup object is: Proxy[interf:[org.apache.harmony.rmi.test.MyRemoteInterface, java.rmi.Remote],
RemoteObjectInvocationHandler[UnicastRef[endpoint:[[10.125.122.35:46363]](remote), ObjID[65536,
UID[42b3d420:1134363c064:-8000]]]]]
Testing test_String_Void...
Done.
Testing test_Void_String...
Returned: MyRemoteObject.test_Void_String
Done.
Testing test_Int_Void...
Done.
Testing test_Void_Int...
Returned: 987654321
Done.
Testing test_Remote_Void...
Done.
Testing test_Remote_Void with remote object extending another remote object...
Done.
Testing test_Void_Remote...
Jun 19, 2007 4:50:23 PM org.apache.harmony.rmi.client.ClientConnection sendDGCAck
FINER: main: Sent DGC ack to [10.125.122.35:46363] for UID[42b3d420:1134363c064:-7fe8]
Returned: Proxy[interf:[org.apache.harmony.rmi.test.MyRemoteInterface2, java.rmi.Remote],
RemoteObjectInvocationHandler[UnicastRef[endpoint:[[10.125.122.35:46371]](remote), ObjID[65539,
UID[42b3d420:1134363c064:-7fe9]]]]]
Done.
Testing test_Long_Long...
Returned: 998877665544332211
Done.
Testing test_String_String...
Returned: MyRemoteObject.test_String_String
Done.
Testing test_Remote_Remote...
Jun 19, 2007 4:50:24 PM org.apache.harmony.rmi.client.ClientConnection sendDGCAck
FINER: main: Sent DGC ack to [10.125.122.35:46363] for UID[42b3d420:1134363c064:-7fde]
Returned: Proxy[interf:[org.apache.harmony.rmi.test.MyRemoteInterface2, java.rmi.Remote],
RemoteObjectInvocationHandler[UnicastRef[endpoint:[[10.125.122.35:46375]](remote), ObjID[65541,
UID[42b3d420:1134363c064:-7fdf]]]]]
Done.
Testing test_RemoteString_Void...
Done.
Testing test_RemoteRemote_Remote...
The GC did not provide gc_add_weak_root_set_entry()
Jun 19, 2007 4:50:24 PM org.apache.harmony.rmi.client.ClientConnection sendDGCAck
FINER: main: Sent DGC ack to [10.125.122.35:46363] for UID[42b3d420:1134363c064:-7fd0]
Returned: Proxy[interf:[org.apache.harmony.rmi.test.MyRemoteInterface2, java.rmi.Remote],
RemoteObjectInvocationHandler[UnicastRef[endpoint:[[10.125.122.35:46382]](remote), ObjID[65545,
UID[42b3d420:1134363c064:-7fd1]]]]]
Done.
Testing test_BooleanStringRemote_Void...
Done.
Testing test_Proxy_Void...
Done.
Testing test_Array_Void...
Done.
Testing test_Void_Array...
Done.
Testing test_RemoteArray_Void...
Done.
Testing test_Void_RemoteArray...
Jun 19, 2007 4:50:25 PM org.apache.harmony.rmi.client.ClientConnection sendDGCAck
FINER: main: Sent DGC ack to [10.125.122.35:46363] for UID[42b3d420:1134363c064:-7fbd]
Done.
Testing test_Exception...
org.apache.harmony.rmi.test.MyException: MyRemoteObject.test_Exception
Done.
Testing test_Error...
java.rmi.ServerError: Error occurred while remote method invocation; nested exception is:
	java.lang.Error: MyRemoteObject.test_Error
Done.
Testing test_RuntimeException...
java.lang.RuntimeException: MyRemoteObject.text_RuntimeException
Done.
Testing test_RemoteException...
java.rmi.ServerException: RemoteException occurred while remote method invocation; nested
exception is:
	java.rmi.RemoteException: MyRemoteObject.text_RemoteException
Done.
Test server complete.
Test server closing.
Unexporting MyRemoteObject[UnicastServerRef[endpoint:[[10.125.122.35:46363]](local), ObjID[65536,
UID[42b3d420:1134363c064:-8000]]]] ...
Done.
Unexporting MyRemoteObject1[UnicastServerRef[endpoint:[[10.125.122.35:46367]](local), ObjID[65537,
UID[42b3d420:1134363c064:-7ff4]]]] ...
Done.
Unexporting MyRemoteObject4[UnicastServerRef[endpoint:[[10.125.122.35:46369]](local), ObjID[65538,
UID[42b3d420:1134363c064:-7fef]]]] ...
Done.
Unexporting MyRemoteObject1[UnicastServerRef[endpoint:[[10.125.122.35:46373]](local), ObjID[65540,
UID[42b3d420:1134363c064:-7fe3]]]] ...
Done.
Unexporting MyRemoteObject1[UnicastServerRef[endpoint:[[10.125.122.35:46376]](local), ObjID[65542,
UID[42b3d420:1134363c064:-7fdd]]]] ...
Done.
Unexporting MyRemoteObject1[UnicastServerRef[endpoint:[[10.125.122.35:46378]](local), ObjID[65543,
UID[42b3d420:1134363c064:-7fd8]]]] ...
Done.
Unexporting MyRemoteObject3[UnicastServerRef[endpoint:[[10.125.122.35:46379]](local), ObjID[65544,
UID[42b3d420:1134363c064:-7fd7]]]] ...
Done.
Unexporting MyRemoteObject1[UnicastServerRef[endpoint:[[10.125.122.35:46383]](local), ObjID[65546,
UID[42b3d420:1134363c064:-7fcf]]]] ...
Done.
Unexporting MyRemoteObject1[UnicastServerRef[endpoint:[[10.125.122.35:46385]](local), ObjID[65547,
UID[42b3d420:1134363c064:-7fc4]]]] ...
Done.
Unexporting MyRemoteObject1[UnicastServerRef[endpoint:[[10.125.122.35:46386]](local), ObjID[65548,
UID[42b3d420:1134363c064:-7fc3]]]] ...
Done.
Unexporting RegistryImpl ...
Done.
Test server exiting.
The GC did not provide gc_add_weak_root_set_entry()
Unexporting MyRemoteObject1[UnicastServerRef[endpoint:[[10.125.122.35:46391]](local), ObjID[65536,
UID[4309e8b0:1134363ea4b:-7ff7]]]] ...
Done.
Unexporting MyRemoteObject1[UnicastServerRef[endpoint:[[10.125.122.35:46392]](local), ObjID[65537,
UID[4309e8b0:1134363ea4b:-7ff6]]]] ...
Done.
Unexporting MyRemoteObject1[UnicastServerRef[endpoint:[[10.125.122.35:46393]](local), ObjID[65538,
UID[4309e8b0:1134363ea4b:-7ff5]]]] ...
Done.
Unexporting MyRemoteObject1[UnicastServerRef[endpoint:[[10.125.122.35:46394]](local), ObjID[65539,
UID[4309e8b0:1134363ea4b:-7ff4]]]] ...
Done.
Unexporting MyRemoteObject1[UnicastServerRef[endpoint:[[10.125.122.35:46395]](local), ObjID[65540,
UID[4309e8b0:1134363ea4b:-7ff3]]]] ...
Done.
Unexporting MyRemoteObject1[UnicastServerRef[endpoint:[[10.125.122.35:46396]](local), ObjID[65541,
UID[4309e8b0:1134363ea4b:-7ff2]]]] ...
Done.
Unexporting MyRemoteObject1[UnicastServerRef[endpoint:[[10.125.122.35:46397]](local), ObjID[65542,
UID[4309e8b0:1134363ea4b:-7ff1]]]] ...
Done.
Unexporting MyRemoteObject1[UnicastServerRef[endpoint:[[10.125.122.35:46398]](local), ObjID[65543,
UID[4309e8b0:1134363ea4b:-7ff0]]]] ...
Done.
LogStream[tst]:
Compiling SECURITY classes
Compiling SECURITY test support files
Since fork is false, ignoring memoryMaximumSize setting
Compiling SECURITY api tests
Since fork is false, ignoring memoryMaximumSize setting
Compiling SECURITY api injected tests
Since fork is false, ignoring memoryMaximumSize setting
Compiling SECURITY impl injected tests
Since fork is false, ignoring memoryMaximumSize setting
Compiling SECURITY impl tests
Since fork is false, ignoring memoryMaximumSize setting
Running SECURITY api tests
The GC did not provide gc_add_weak_root_set_entry()
Running SECURITY api.injected tests
Running SECURITY impl tests
The GC did not provide gc_add_weak_root_set_entry()
Running SECURITY impl injected tests
The GC did not provide gc_add_weak_root_set_entry()
Compiling SOUND classes
Compiling SOUND tests
Since fork is false, ignoring memoryMaximumSize setting
The GC did not provide gc_add_weak_root_set_entry()
Compiling SQL classes
Compiling SQL tests
Since fork is false, ignoring memoryMaximumSize setting
The GC did not provide gc_add_weak_root_set_entry()
Compiling Sun Compat classes
Compiling SUNCOMPAT tests
Compiling TEXT classes
Compiling TEXT tests
Since fork is false, ignoring memoryMaximumSize setting
The GC did not provide gc_add_weak_root_set_entry()
Compiling X-NET classes
Compiling X-NET test support files
Compiling X-NET api tests
Since fork is false, ignoring memoryMaximumSize setting
Compiling X-NET impl injected tests
Since fork is false, ignoring memoryMaximumSize setting
Compiling X-NET impl tests
Since fork is false, ignoring memoryMaximumSize setting
Running X-NET api tests
The GC did not provide gc_add_weak_root_set_entry()
Running X-NET impl tests
The GC did not provide gc_add_weak_root_set_entry()
Running X-NET impl injected tests
The GC did not provide gc_add_weak_root_set_entry()
The test report is in /export/cruise/trunk/cc/projects/classlib/trunk/build/test_report/html/index.html

***********************************************************
Unit Tests: (16584)
        
failure: testPropertyExpansion org.apache.harmony.security.tests.java.security.PolicyTest
Unit Test Error Details:	(1)
                
Test: testPropertyExpansionClass: org.apache.harmony.security.tests.java.security.PolicyTestjunit.framework.AssertionFailedError:
Failed to find SecurityPermission for codeSource=/11111/*, codeBase=/11111/-
	at org.apache.harmony.security.tests.java.security.PolicyTest.assertCodeBasePropertyExpansion(PolicyTest.java:251)
	at org.apache.harmony.security.tests.java.security.PolicyTest.testPropertyExpansion(PolicyTest.java:207)
	at java.lang.reflect.VMReflection.invokeMethod(VMReflection.java)


***********************************************************
Modifications since last successful build:	(56)
            
modified leoli  /harmony/enhanced/classlib/trunk/modules/beans/src/main/java/java/beans/beancontext/BeanContextServiceRevokedEvent.java
06/19/2007 16:01:38 Fix bug in java.beans.beancontext.BeanContextServiceRevokedEvent.
modified leoli  /harmony/enhanced/classlib/trunk/modules/beans/src/main/java/java/beans/beancontext/BeanContextMembershipEvent.java
06/19/2007 15:58:44 Fix bug in java.security.beancontext.BeanContextMembershipEvent.
modified leoli  /harmony/enhanced/classlib/trunk/modules/beans/src/main/java/org/apache/harmony/beans/internal/nls/messages.properties
06/19/2007 15:27:53 Add new exception message in org.apache.harmony.beans.internal.nls.messages.properties.
modified leoli  /harmony/enhanced/classlib/trunk/modules/beans/src/main/java/java/beans/beancontext/BeanContextServicesSupport.java
06/19/2007 15:07:11 Fix bugs and refractor in java.beans.beancontext.BeanContextServicesSupport.
modified apetrenko  /harmony/enhanced/classlib/trunk/modules/awt/src/main/native/fontlib/shared/TypeDefinition.cpp
06/19/2007 15:06:41 Fontlib crash on em64t fix
modified leoli  /harmony/enhanced/classlib/trunk/modules/beans/src/main/java/java/beans/beancontext/BeanContextSupport.java
06/19/2007 15:03:43 Fix bugs and refractor in java.beans.beancontext.BeanContextSupport.
modified leoli  /harmony/enhanced/classlib/trunk/modules/beans/src/main/java/java/beans/beancontext/BeanContextChildSupport.java
06/19/2007 15:01:09 Fix bugs in java.beans.beancontext.BeanContextChildSupport.
modified hindessm  /harmony/enhanced/classlib/trunk/modules/luni/src/main/native/launcher/windows/java.rc
06/19/2007 14:56:35 Updating Apache License in a few files.
modified hindessm  /harmony/enhanced/classlib/trunk/modules/swing/src/test/api/java.injected/org/apache/harmony/swing/tests/javax/swing/text/parser/ContentModelSemanticTest.java
06/19/2007 14:56:35 Updating Apache License in a few files.
modified hindessm  /harmony/enhanced/classlib/trunk/modules/luni/src/main/native/vmi/windows/vmi.rc
06/19/2007 14:56:35 Updating Apache License in a few files.
modified hindessm  /harmony/enhanced/classlib/trunk/modules/prefs/src/main/native/prefs/windows/hyprefs.rc
06/19/2007 14:56:35 Updating Apache License in a few files.
modified hindessm  /harmony/enhanced/classlib/trunk/modules/luni/src/main/native/launcher/windows/javaw.rc
06/19/2007 14:56:35 Updating Apache License in a few files.
modified hindessm  /harmony/enhanced/classlib/trunk/modules/portlib/src/main/native/sig/windows/hysig.rc
06/19/2007 14:56:35 Updating Apache License in a few files.
modified hindessm  /harmony/enhanced/classlib/trunk/modules/portlib/src/main/native/thread/windows/hythr.rc
06/19/2007 14:56:35 Updating Apache License in a few files.
modified hindessm  /harmony/enhanced/classlib/trunk/modules/portlib/src/main/native/thrstub/windows/hythr.rc
06/19/2007 14:56:35 Updating Apache License in a few files.
modified hindessm  /harmony/enhanced/classlib/trunk/modules/misc/src/main/native/accessors/windows/accessors.rc
06/19/2007 14:56:35 Updating Apache License in a few files.
modified hindessm  /harmony/enhanced/classlib/trunk/modules/portlib/src/main/native/port/windows/hyprt.rc
06/19/2007 14:56:35 Updating Apache License in a few files.
modified hindessm  /harmony/enhanced/classlib/trunk/modules/luni/src/main/native/luni/windows/hyluni.rc
06/19/2007 14:56:35 Updating Apache License in a few files.
modified hindessm  /harmony/enhanced/classlib/trunk/modules/portlib/src/main/native/sig/windows/makefile
06/19/2007 14:56:35 Updating Apache License in a few files.
modified leoli  /harmony/enhanced/classlib/trunk/modules/security/src/main/java/common/org/apache/harmony/security/fortress/DefaultPolicyParser.java
06/19/2007 14:17:54 Fix HARMONY-4184
added leoli  /harmony/enhanced/classlib/trunk/modules/security/src/test/resources/serialization/org/apache/harmony/security/tests/java/security/UnresolvedPermissionTest.golden.ser
06/19/2007 13:38:51 Fix bugs for java.security.UnresolvedPermission is not serialization compatible
with RI.
modified leoli  /harmony/enhanced/classlib/trunk/modules/security/src/test/api/java/org/apache/harmony/security/tests/java/security/UnresolvedPermissionTest.java
06/19/2007 13:38:51 Fix bugs for java.security.UnresolvedPermission is not serialization compatible
with RI.
modified leoli  /harmony/enhanced/classlib/trunk/modules/security/src/main/java/common/java/security/UnresolvedPermission.java
06/19/2007 13:38:51 Fix bugs for java.security.UnresolvedPermission is not serialization compatible
with RI.
added tonywu  /harmony/enhanced/classlib/trunk/modules/jndi/src/main/java/org/apache/harmony/jndi/asn1/ASN1Implicit.java
06/19/2007 12:58:08 Apply patch HARMONY-4226 ([classlib][jndi] Class SortResponseControl has
some failures)
added tonywu  /harmony/enhanced/classlib/trunk/modules/jndi/src/main/java/org/apache/harmony/jndi/asn1/ASN1UTCTime.java
06/19/2007 12:58:08 Apply patch HARMONY-4226 ([classlib][jndi] Class SortResponseControl has
some failures)
modified tonywu  /harmony/enhanced/classlib/trunk/modules/jndi/src/main/java/javax/naming/ldap/SortResponseControl.java
06/19/2007 12:58:08 Apply patch HARMONY-4226 ([classlib][jndi] Class SortResponseControl has
some failures)
added tonywu  /harmony/enhanced/classlib/trunk/modules/jndi/src/main/java/org/apache/harmony/jndi/asn1/ASN1Constants.java
06/19/2007 12:58:08 Apply patch HARMONY-4226 ([classlib][jndi] Class SortResponseControl has
some failures)
added tonywu  /harmony/enhanced/classlib/trunk/modules/jndi/src/main/java/org/apache/harmony/jndi/asn1/ASN1SetOf.java
06/19/2007 12:58:08 Apply patch HARMONY-4226 ([classlib][jndi] Class SortResponseControl has
some failures)
modified tonywu  /harmony/enhanced/classlib/trunk/modules/jndi/src/test/java/org/apache/harmony/jndi/tests/javax/naming/ldap/TestSortResponseControl.java
06/19/2007 12:58:08 Apply patch HARMONY-4226 ([classlib][jndi] Class SortResponseControl has
some failures)
added tonywu  /harmony/enhanced/classlib/trunk/modules/jndi/src/main/java/org/apache/harmony/jndi/asn1/BerInputStream.java
06/19/2007 12:58:08 Apply patch HARMONY-4226 ([classlib][jndi] Class SortResponseControl has
some failures)
added tonywu  /harmony/enhanced/classlib/trunk/modules/jndi/src/main/java/org/apache/harmony/jndi/asn1/ASN1Type.java
06/19/2007 12:58:08 Apply patch HARMONY-4226 ([classlib][jndi] Class SortResponseControl has
some failures)
added tonywu  /harmony/enhanced/classlib/trunk/modules/jndi/src/main/java/org/apache/harmony/jndi/asn1/ASN1Explicit.java
06/19/2007 12:58:08 Apply patch HARMONY-4226 ([classlib][jndi] Class SortResponseControl has
some failures)
added tonywu  /harmony/enhanced/classlib/trunk/modules/jndi/src/main/java/org/apache/harmony/jndi/asn1/BitString.java
06/19/2007 12:58:08 Apply patch HARMONY-4226 ([classlib][jndi] Class SortResponseControl has
some failures)
added tonywu  /harmony/enhanced/classlib/trunk/modules/jndi/src/main/java/org/apache/harmony/jndi/asn1/BerOutputStream.java
06/19/2007 12:58:08 Apply patch HARMONY-4226 ([classlib][jndi] Class SortResponseControl has
some failures)
added tonywu  /harmony/enhanced/classlib/trunk/modules/jndi/src/main/java/org/apache/harmony/jndi/asn1/ASN1Any.java
06/19/2007 12:58:08 Apply patch HARMONY-4226 ([classlib][jndi] Class SortResponseControl has
some failures)
added tonywu  /harmony/enhanced/classlib/trunk/modules/jndi/src/main/java/org/apache/harmony/jndi/asn1/ASN1ValueCollection.java
06/19/2007 12:58:08 Apply patch HARMONY-4226 ([classlib][jndi] Class SortResponseControl has
some failures)
added tonywu  /harmony/enhanced/classlib/trunk/modules/jndi/src/main/java/org/apache/harmony/jndi/asn1/ASN1Enumerated.java
06/19/2007 12:58:08 Apply patch HARMONY-4226 ([classlib][jndi] Class SortResponseControl has
some failures)
added tonywu  /harmony/enhanced/classlib/trunk/modules/jndi/src/main/java/org/apache/harmony/jndi/asn1/ASN1Choice.java
06/19/2007 12:58:08 Apply patch HARMONY-4226 ([classlib][jndi] Class SortResponseControl has
some failures)
added tonywu  /harmony/enhanced/classlib/trunk/modules/jndi/src/main/java/org/apache/harmony/jndi/asn1/ASN1Set.java
06/19/2007 12:58:08 Apply patch HARMONY-4226 ([classlib][jndi] Class SortResponseControl has
some failures)
added tonywu  /harmony/enhanced/classlib/trunk/modules/jndi/src/main/java/org/apache/harmony/jndi/asn1/ASN1TypeCollection.java
06/19/2007 12:58:08 Apply patch HARMONY-4226 ([classlib][jndi] Class SortResponseControl has
some failures)
added tonywu  /harmony/enhanced/classlib/trunk/modules/jndi/src/main/java/org/apache/harmony/jndi/asn1/ASN1SequenceOf.java
06/19/2007 12:58:08 Apply patch HARMONY-4226 ([classlib][jndi] Class SortResponseControl has
some failures)
added tonywu  /harmony/enhanced/classlib/trunk/modules/jndi/src/main/java/org/apache/harmony/jndi/asn1
06/19/2007 12:58:08 Apply patch HARMONY-4226 ([classlib][jndi] Class SortResponseControl has
some failures)
added tonywu  /harmony/enhanced/classlib/trunk/modules/jndi/src/main/java/org/apache/harmony/jndi/asn1/ASN1Time.java
06/19/2007 12:58:08 Apply patch HARMONY-4226 ([classlib][jndi] Class SortResponseControl has
some failures)
added tonywu  /harmony/enhanced/classlib/trunk/modules/jndi/src/main/java/org/apache/harmony/jndi/asn1/ASN1Exception.java
06/19/2007 12:58:08 Apply patch HARMONY-4226 ([classlib][jndi] Class SortResponseControl has
some failures)
added tonywu  /harmony/enhanced/classlib/trunk/modules/jndi/src/main/java/org/apache/harmony/jndi/asn1/ASN1Constructured.java
06/19/2007 12:58:08 Apply patch HARMONY-4226 ([classlib][jndi] Class SortResponseControl has
some failures)
modified tonywu  /harmony/enhanced/classlib/trunk/modules/jndi/src/main/java/org/apache/harmony/jndi/internal/nls/messages.properties
06/19/2007 12:58:08 Apply patch HARMONY-4226 ([classlib][jndi] Class SortResponseControl has
some failures)
added tonywu  /harmony/enhanced/classlib/trunk/modules/jndi/src/main/java/org/apache/harmony/jndi/asn1/ASN1BitString.java
06/19/2007 12:58:08 Apply patch HARMONY-4226 ([classlib][jndi] Class SortResponseControl has
some failures)
added tonywu  /harmony/enhanced/classlib/trunk/modules/jndi/src/main/java/org/apache/harmony/jndi/asn1/ASN1OctetString.java
06/19/2007 12:58:08 Apply patch HARMONY-4226 ([classlib][jndi] Class SortResponseControl has
some failures)
added tonywu  /harmony/enhanced/classlib/trunk/modules/jndi/src/main/java/org/apache/harmony/jndi/asn1/ASN1StringType.java
06/19/2007 12:58:08 Apply patch HARMONY-4226 ([classlib][jndi] Class SortResponseControl has
some failures)
added tonywu  /harmony/enhanced/classlib/trunk/modules/jndi/src/main/java/org/apache/harmony/jndi/asn1/ASN1Primitive.java
06/19/2007 12:58:08 Apply patch HARMONY-4226 ([classlib][jndi] Class SortResponseControl has
some failures)
added tonywu  /harmony/enhanced/classlib/trunk/modules/jndi/src/main/java/org/apache/harmony/jndi/asn1/ASN1Sequence.java
06/19/2007 12:58:08 Apply patch HARMONY-4226 ([classlib][jndi] Class SortResponseControl has
some failures)
modified smishura  /harmony/enhanced/classlib/trunk/modules/awt/make/exclude.windows.x86_64.drl
06/19/2007 12:53:32 Exclude java/awt/geom/AreaTest.java on x86_64 platform because of HARMONY-4181
modified smishura  /harmony/enhanced/classlib/trunk/modules/awt/make/exclude.linux.x86_64.drl
06/19/2007 12:53:32 Exclude java/awt/geom/AreaTest.java on x86_64 platform because of HARMONY-4181
modified leoli  /harmony/enhanced/classlib/trunk/modules/security/src/main/java/common/java/security/KeyStore.java
06/19/2007 12:44:12 java.security.KeyStore.store(null, null) is allowed.
modified leoli  /harmony/enhanced/classlib/trunk/modules/security/src/test/impl/java/org/apache/harmony/security/tests/java/security/KeyStore_Impl3Test.java
06/19/2007 12:44:12 java.security.KeyStore.store(null, null) is allowed.
modified leoli  /harmony/enhanced/classlib/trunk/modules/security/src/test/api/java/org/apache/harmony/security/tests/java/security/KeyStore3Test.java
06/19/2007 12:44:12 java.security.KeyStore.store(null, null) is allowed.

Mime
View raw message