harmony-alerts mailing list archives

Site index · List index
Message view « Date » · « Thread »
Top « Date » · « Thread »
From nom...@intel.com
Subject [build-test alert] BUILD FAILED Windows 2003 x86_64 msvc debug: drlvm regression tests
Date Mon, 18 Jun 2007 18:55:58 GMT
BUILD FAILED:
	Ant Error Message:
C:\cruise\cc\projects\drlvm\trunk\build\make\build.xml:474: The following error occurred while
executing this line: C:\cruise\cc\projects\drlvm\trunk\build\make\targets\reg.test.run.xml:122:
There were test failures

Date of build:	06/19/2007 00:21:43
Time to build:	93 minutes 56 seconds
Last changed:	06/18/2007 23:40:26
Last log entry:	Applied HARMONY-4118
[drlvm][jit] Stack overflow handling support in Jitrino compiler



***********************************************************
Execution log (errors/warnings messages):	
cl : Command line warning D9035 : option 'GZ' has been deprecated and will be removed in a
future release
cl : Command line warning D9035 : option 'GZ' has been deprecated and will be removed in a
future release
cl : Command line warning D9036 : use 'RTC1' instead of 'GZ'
cl : Command line warning D9035 : option 'GZ' has been deprecated and will be removed in a
future release
cl : Command line warning D9036 : use 'RTC1' instead of 'GZ'
cl : Command line warning D9035 : option 'GZ' has been deprecated and will be removed in a
future release
cl : Command line warning D9036 : use 'RTC1' instead of 'GZ'
cl : Command line warning D9035 : option 'GZ' has been deprecated and will be removed in a
future release
cl : Command line warning D9036 : use 'RTC1' instead of 'GZ'
cl : Command line warning D9035 : option 'GZ' has been deprecated and will be removed in a
future release
cl : Command line warning D9036 : use 'RTC1' instead of 'GZ'
cl : Command line warning D9035 : option 'GZ' has been deprecated and will be removed in a
future release
cl : Command line warning D9036 : use 'RTC1' instead of 'GZ'
cl : Command line warning D9035 : option 'GZ' has been deprecated and will be removed in a
future release
cl : Command line warning D9036 : use 'RTC1' instead of 'GZ'
cl : Command line warning D9035 : option 'GZ' has been deprecated and will be removed in a
future release
cl : Command line warning D9036 : use 'RTC1' instead of 'GZ'
cl : Command line warning D9035 : option 'GZ' has been deprecated and will be removed in a
future release
cl : Command line warning D9036 : use 'RTC1' instead of 'GZ'
cl : Command line warning D9035 : option 'GZ' has been deprecated and will be removed in a
future release
cl : Command line warning D9036 : use 'RTC1' instead of 'GZ'
cl : Command line warning D9035 : option 'GZ' has been deprecated and will be removed in a
future release
cl : Command line warning D9036 : use 'RTC1' instead of 'GZ'
cl : Command line warning D9035 : option 'GZ' has been deprecated and will be removed in a
future release
cl : Command line warning D9036 : use 'RTC1' instead of 'GZ'
cl : Command line warning D9035 : option 'GZ' has been deprecated and will be removed in a
future release
cl : Command line warning D9036 : use 'RTC1' instead of 'GZ'
cl : Command line warning D9035 : option 'GZ' has been deprecated and will be removed in a
future release
cl : Command line warning D9036 : use 'RTC1' instead of 'GZ'
cl : Command line warning D9035 : option 'GZ' has been deprecated and will be removed in a
future release
cl : Command line warning D9036 : use 'RTC1' instead of 'GZ'
Test org.apache.harmony.drlvm.tests.regression.h3652.Test FAILED
Configuration:
     Hosting Java = 1.5.0_10 (Sun Microsystems Inc.)
    classlib root = C:\cruise\cc\projects\classlib\trunk
               os = Windows
             arch = em64t
              cxx = msvc
              cfg = debug
     svn revision = ${svn.revision}
       components = deploy
Adding manifest to C:\cruise\cc\projects\drlvm\trunk\build\win_em64t_msvc_debug\semis\reg.tests\native/H0000/DirectByteBufferTest.dll
Adding manifest to C:\cruise\cc\projects\drlvm\trunk\build\win_em64t_msvc_debug\semis\reg.tests\native/H2151/VMInit1.dll
Adding manifest to C:\cruise\cc\projects\drlvm\trunk\build\win_em64t_msvc_debug\semis\reg.tests\native/H2899/ManyArgs.dll
Adding manifest to C:\cruise\cc\projects\drlvm\trunk\build\win_em64t_msvc_debug\semis\reg.tests\native/H2926/test.dll
Adding manifest to C:\cruise\cc\projects\drlvm\trunk\build\win_em64t_msvc_debug\semis\reg.tests\native/H3027/AgentLib.dll
Adding manifest to C:\cruise\cc\projects\drlvm\trunk\build\win_em64t_msvc_debug\semis\reg.tests\native/H3074/natives.dll
Adding manifest to C:\cruise\cc\projects\drlvm\trunk\build\win_em64t_msvc_debug\semis\reg.tests\native/H3130/CallNativeTest.dll
Adding manifest to C:\cruise\cc\projects\drlvm\trunk\build\win_em64t_msvc_debug\semis\reg.tests\native/H3317/GetFieldDeclaringClassTest.dll
Adding manifest to C:\cruise\cc\projects\drlvm\trunk\build\win_em64t_msvc_debug\semis\reg.tests\native/H3404/H3404.dll
Adding manifest to C:\cruise\cc\projects\drlvm\trunk\build\win_em64t_msvc_debug\semis\reg.tests\native/H3505/GetFieldModifiersTest.dll
Adding manifest to C:\cruise\cc\projects\drlvm\trunk\build\win_em64t_msvc_debug\semis\reg.tests\native/H3698/ExceptionLocation.dll
Adding manifest to C:\cruise\cc\projects\drlvm\trunk\build\win_em64t_msvc_debug\semis\reg.tests\native/H3730/StepM2N.dll
Adding manifest to C:\cruise\cc\projects\drlvm\trunk\build\win_em64t_msvc_debug\semis\reg.tests\native/H3784/check.dll
Adding manifest to C:\cruise\cc\projects\drlvm\trunk\build\win_em64t_msvc_debug\semis\reg.tests\native/H3894/ThreadGroupChildren.dll
Adding manifest to C:\cruise\cc\projects\drlvm\trunk\build\win_em64t_msvc_debug\semis\reg.tests\native/H3909/FinalizerThreadGroup.dll
Adding manifest to C:\cruise\cc\projects\drlvm\trunk\build\win_em64t_msvc_debug\semis\reg.tests\native/H3982/EmptyStackTrace.dll

=====================================
DRLVM Regression Testing on platform: windows.x86_64
=====================================
        
vf_debug: verifying class org/apache/harmony/drlvm/tests/regression/h1857/TestClass (method
tryMe()V) couldn't load class "org/apache/harmony/drlvm/tests/regression/h1857/MissedThrowable"
vf_debug: VerifyError: Couldn't load class: org/apache/harmony/drlvm/tests/regression/h1857/MissedThrowable
The GC did not provide gc_add_weak_root_set_entry()
Running on JET
Running on OPT
Running on interpreter
vf_debug: VerifyError: (class: org/apache/harmony/drlvm/tests/regression/h2103/SupClass, method:
test()I) Incompatible object argument for invokespecial
vf_debug: verifying class org/apache/harmony/drlvm/tests/regression/h2808/finTest1 (method
test()V) couldn't load class "org/apache/harmony/drlvm/tests/regression/h2808/finTest2"
vf_debug: VerifyError: Couldn't load class: org/apache/harmony/drlvm/tests/regression/h2808/finTest2
The GC did not provide gc_add_weak_root_set_entry()
vf_debug: verifying class org/apache/harmony/drlvm/tests/regression/h3048/MyTestSuper (method
<clinit>()V) couldn't load class "org/apache/harmony/drlvm/tests/regression/h3048/MyException"
vf_debug: VerifyError: Couldn't load class: org/apache/harmony/drlvm/tests/regression/h3048/MyException
Running on OPT
Running on OPT
Heap operand o32[o30(RSP)+o31(-8)]:intptr contains no sub-operands of type Object or ManagedPointer

Heap address type verification failure
Verification failure after stack
The GC did not provide gc_add_weak_root_set_entry()
========================================
Regression testing report was stored in:
========================================
C:\cruise\cc\projects\drlvm\trunk\build\win_em64t_msvc_debug\semis\reg.tests/reports/html
========================================

***********************************************************
Unit Tests: (96)
        

***********************************************************
Modifications since last successful build:	(38)
            
modified gshimansky  /harmony/enhanced/drlvm/trunk/vm/jitrino/src/codegenerator/ia32/Ia32Inst.h
06/18/2007 23:40:26 Applied HARMONY-4118[drlvm][jit] Stack overflow handling support in Jitrino
compiler
modified gshimansky  /harmony/enhanced/drlvm/trunk/vm/jitrino/src/codegenerator/ia32/Ia32StackLayout.cpp
06/18/2007 23:40:26 Applied HARMONY-4118[drlvm][jit] Stack overflow handling support in Jitrino
compiler
modified gshimansky  /harmony/enhanced/drlvm/trunk/vm/jitrino/src/codegenerator/ia32/Ia32IRManager.cpp
06/18/2007 23:40:26 Applied HARMONY-4118[drlvm][jit] Stack overflow handling support in Jitrino
compiler
modified gshimansky  /harmony/enhanced/drlvm/trunk/vm/jitrino/src/codegenerator/ia32/Ia32IRManager.h
06/18/2007 23:40:26 Applied HARMONY-4118[drlvm][jit] Stack overflow handling support in Jitrino
compiler
modified gshimansky  /harmony/enhanced/drlvm/trunk/src/test/regression/excludes/exclude.windows.x86_64
06/18/2007 23:40:26 Applied HARMONY-4118[drlvm][jit] Stack overflow handling support in Jitrino
compiler
added gshimansky  /harmony/enhanced/drlvm/trunk/src/test/regression/H1859/Test.java 06/18/2007
23:40:26 Applied HARMONY-4118[drlvm][jit] Stack overflow handling support in Jitrino compiler
modified gshimansky  /harmony/enhanced/drlvm/trunk/vm/jitrino/src/jet/cg.cpp 06/18/2007 23:40:26
Applied HARMONY-4118[drlvm][jit] Stack overflow handling support in Jitrino compiler
added gshimansky  /harmony/enhanced/drlvm/trunk/src/test/regression/H1859 06/18/2007 23:40:26
Applied HARMONY-4118[drlvm][jit] Stack overflow handling support in Jitrino compiler
added gshimansky  /harmony/enhanced/drlvm/trunk/src/test/regression/H1859/run.test.xml 06/18/2007
23:40:26 Applied HARMONY-4118[drlvm][jit] Stack overflow handling support in Jitrino compiler
modified gshimansky  /harmony/enhanced/drlvm/trunk/src/test/regression/excludes/exclude.linux.x86_64
06/18/2007 23:40:26 Applied HARMONY-4118[drlvm][jit] Stack overflow handling support in Jitrino
compiler
modified gshimansky  /harmony/enhanced/drlvm/trunk/vm/vmcore/src/kernel_classes/native/org_apache_harmony_vm_VMStack.cpp
06/18/2007 23:38:45 Applied HARMONY-3542[drlvm][thread] VM crashes on getting stack traces
modified gshimansky  /harmony/enhanced/drlvm/trunk/vm/vmcore/src/jvmti/jvmti_stack.cpp 06/18/2007
23:38:45 Applied HARMONY-3542[drlvm][thread] VM crashes on getting stack traces
modified gshimansky  /harmony/enhanced/drlvm/trunk/vm/vmcore/src/class_support/classloader.cpp
06/18/2007 23:37:02 Applied HARMONY-4063[drlvm][classloader] Crash in the classoader on BootstrapClassLoader
initialization
modified gshimansky  /harmony/enhanced/drlvm/trunk/vm/vmcore/src/class_support/Class_File_Loader.cpp
06/18/2007 23:35:49 Applied HARMONY-4193[drlvm][classloader] Improvements to Class_File_Loader.cpp
modified gshimansky  /harmony/enhanced/drlvm/trunk/build/make/excludes/exclude.drlvm_smoke.windows.x86.srv
06/18/2007 23:33:35 Applied HARMONY-3731[drlvm][shutdown] FinalizeStackTest failed in opt/srv
mode on Win32and unexcluded FinalizeStackTest for win32 configs
modified gshimansky  /harmony/enhanced/drlvm/trunk/build/make/excludes/exclude.drlvm_smoke.windows.x86.opt
06/18/2007 23:33:35 Applied HARMONY-3731[drlvm][shutdown] FinalizeStackTest failed in opt/srv
mode on Win32and unexcluded FinalizeStackTest for win32 configs
modified gshimansky  /harmony/enhanced/drlvm/trunk/vm/vmcore/src/init/vm_shutdown.cpp 06/18/2007
23:33:35 Applied HARMONY-3731[drlvm][shutdown] FinalizeStackTest failed in opt/srv mode on
Win32and unexcluded FinalizeStackTest for win32 configs
modified mfursov  /harmony/enhanced/drlvm/trunk/vm/jitrino/src/codegenerator/ia32/Ia32I8Lowerer.cpp
06/18/2007 21:33:55 HARMONY-4218: fix for a build with gc4.1.0
modified mfursov  /harmony/enhanced/drlvm/trunk/vm/jitrino/src/codegenerator/ia32/Ia32Inst.h
06/18/2007 18:34:08 HARMONY-2092: fixes for volatile longs handling in Jitrino.OPT and Jitrino.JET
jits with regression test.(previous commit was not done from the root folder)
modified mfursov  /harmony/enhanced/drlvm/trunk/vm/jitrino/src/jet/cg.h 06/18/2007 18:34:08
HARMONY-2092: fixes for volatile longs handling in Jitrino.OPT and Jitrino.JET jits with regression
test.(previous commit was not done from the root folder)
modified mfursov  /harmony/enhanced/drlvm/trunk/vm/jitrino/src/codegenerator/ia32/Ia32Printer.cpp
06/18/2007 18:34:08 HARMONY-2092: fixes for volatile longs handling in Jitrino.OPT and Jitrino.JET
jits with regression test.(previous commit was not done from the root folder)
modified mfursov  /harmony/enhanced/drlvm/trunk/vm/jitrino/src/codegenerator/ia32/Ia32IRManager.cpp
06/18/2007 18:34:08 HARMONY-2092: fixes for volatile longs handling in Jitrino.OPT and Jitrino.JET
jits with regression test.(previous commit was not done from the root folder)
modified mfursov  /harmony/enhanced/drlvm/trunk/vm/jitrino/src/jet/cg_fld_arr.cpp 06/18/2007
18:34:08 HARMONY-2092: fixes for volatile longs handling in Jitrino.OPT and Jitrino.JET jits
with regression test.(previous commit was not done from the root folder)
modified mfursov  /harmony/enhanced/drlvm/trunk/vm/jitrino/src/jet/enc_ia32.cpp 06/18/2007
18:34:08 HARMONY-2092: fixes for volatile longs handling in Jitrino.OPT and Jitrino.JET jits
with regression test.(previous commit was not done from the root folder)
modified mfursov  /harmony/enhanced/drlvm/trunk/vm/jitrino/src/codegenerator/ia32/Ia32IRManager.h
06/18/2007 18:34:08 HARMONY-2092: fixes for volatile longs handling in Jitrino.OPT and Jitrino.JET
jits with regression test.(previous commit was not done from the root folder)
modified mfursov  /harmony/enhanced/drlvm/trunk/vm/port/src/encoder/ia32_em64t/enc_tabl.cpp
06/18/2007 18:34:08 HARMONY-2092: fixes for volatile longs handling in Jitrino.OPT and Jitrino.JET
jits with regression test.(previous commit was not done from the root folder)
modified mfursov  /harmony/enhanced/drlvm/trunk/vm/jitrino/src/jet/cg_regs.cpp 06/18/2007
18:34:08 HARMONY-2092: fixes for volatile longs handling in Jitrino.OPT and Jitrino.JET jits
with regression test.(previous commit was not done from the root folder)
modified mfursov  /harmony/enhanced/drlvm/trunk/vm/jitrino/src/jet/enc.h 06/18/2007 18:34:08
HARMONY-2092: fixes for volatile longs handling in Jitrino.OPT and Jitrino.JET jits with regression
test.(previous commit was not done from the root folder)
modified mfursov  /harmony/enhanced/drlvm/trunk/vm/jitrino/src/codegenerator/ia32/Ia32CopyExpansion.cpp
06/18/2007 18:34:08 HARMONY-2092: fixes for volatile longs handling in Jitrino.OPT and Jitrino.JET
jits with regression test.(previous commit was not done from the root folder)
modified mfursov  /harmony/enhanced/drlvm/trunk/vm/port/src/encoder/ia32_em64t/enc_defs.h
06/18/2007 18:34:08 HARMONY-2092: fixes for volatile longs handling in Jitrino.OPT and Jitrino.JET
jits with regression test.(previous commit was not done from the root folder)
modified mfursov  /harmony/enhanced/drlvm/trunk/vm/jitrino/src/codegenerator/ia32/Ia32I8Lowerer.cpp
06/18/2007 18:34:08 HARMONY-2092: fixes for volatile longs handling in Jitrino.OPT and Jitrino.JET
jits with regression test.(previous commit was not done from the root folder)
added mfursov  /harmony/enhanced/drlvm/trunk/src/test/regression/H2092/Test.java 06/18/2007
18:32:36 HARMONY-2092: fixes for volatile longs handling in Jitrino.OPT and Jitrino.JET jits
with regression test.
added mfursov  /harmony/enhanced/drlvm/trunk/src/test/regression/H2092 06/18/2007 18:32:36
HARMONY-2092: fixes for volatile longs handling in Jitrino.OPT and Jitrino.JET jits with regression
test.
added mfursov  /harmony/enhanced/drlvm/trunk/src/test/regression/H2092/run.test.xml 06/18/2007
18:32:36 HARMONY-2092: fixes for volatile longs handling in Jitrino.OPT and Jitrino.JET jits
with regression test.
modified mfursov  /harmony/enhanced/drlvm/trunk/vm/jitrino/src/jet/cg_meth.cpp 06/18/2007
17:41:19 HARMONY-4016: Fixes in lazy resolution mode helpers
modified mfursov  /harmony/enhanced/drlvm/trunk/vm/vmcore/src/jit/jit_runtime_support.cpp
06/18/2007 17:41:19 HARMONY-4016: Fixes in lazy resolution mode helpers
modified mfursov  /harmony/enhanced/drlvm/trunk/vm/vmcore/src/class_support/Prepare.cpp 06/18/2007
17:41:19 HARMONY-4016: Fixes in lazy resolution mode helpers
modified mfursov  /harmony/enhanced/drlvm/trunk/vm/vmcore/src/kernel_classes/native/java_lang_reflect_VMField.cpp
06/18/2007 17:41:19 HARMONY-4016: Fixes in lazy resolution mode helpers

Mime
View raw message