harmony-alerts mailing list archives

Site index · List index
Message view « Date » · « Thread »
Top « Date » · « Thread »
From nom...@intel.com
Subject [build-test alert] BUILD FAILED Linux SUSE 9 64bit gcc debug: drlvm reg.test
Date Mon, 18 Jun 2007 13:56:50 GMT
BUILD FAILED:
	Ant Error Message:
/export/cruise/trunk/cc/projects/drlvm/trunk/build/make/build.xml:474: The following error
occurred while executing this line: /export/cruise/trunk/cc/projects/drlvm/trunk/build/make/targets/reg.test.xml:128:
The following error occurred while executing this line: /export/cruise/trunk/cc/projects/drlvm/trunk/build/make/targets/reg.test.xml:169:
gcc failed with return code 1

Date of build:	06/18/2007 20:56:31
Time to build:	10 seconds
Last changed:	06/18/2007 18:34:08
Last log entry:	HARMONY-2092: fixes for volatile longs handling in Jitrino.OPT and Jitrino.JET
jits with regression test.
(previous commit was not done from the root folder)



***********************************************************
Execution log (errors/warnings messages):	
/export/cruise/trunk/cc/projects/drlvm/trunk/src/test/regression/H2151/VMInit1.cpp:2:19: jvmti.h:
No such file or directory
/export/cruise/trunk/cc/projects/drlvm/trunk/src/test/regression/H2151/VMInit1.cpp:4: error:
syntax
   error before `(' token
/export/cruise/trunk/cc/projects/drlvm/trunk/src/test/regression/H2151/VMInit1.cpp:10: error:
syntax
   error before `=' token
/export/cruise/trunk/cc/projects/drlvm/trunk/src/test/regression/H2151/VMInit1.cpp:14: error:
syntax
   error before `->' token
/export/cruise/trunk/cc/projects/drlvm/trunk/src/test/regression/H2151/VMInit1.cpp:17: error:
syntax
   error before `Agent_OnLoad'
/export/cruise/trunk/cc/projects/drlvm/trunk/src/test/regression/H2151/VMInit1.cpp:24: error:
'
   jvmtiCapabilities' is used as a type, but is not defined as a type.
/export/cruise/trunk/cc/projects/drlvm/trunk/src/test/regression/H2151/VMInit1.cpp:25: error:
syntax
   error before `=' token
/export/cruise/trunk/cc/projects/drlvm/trunk/src/test/regression/H2151/VMInit1.cpp:30: error:
ISO
   C++ forbids declaration of `result' with no type
/export/cruise/trunk/cc/projects/drlvm/trunk/src/test/regression/H2151/VMInit1.cpp:30: error:
`
   jvmti_env' was not declared in this scope
/export/cruise/trunk/cc/projects/drlvm/trunk/src/test/regression/H2151/VMInit1.cpp:30: error:
`
   capabilities' was not declared in this scope
/export/cruise/trunk/cc/projects/drlvm/trunk/src/test/regression/H2151/VMInit1.cpp:31: error:
syntax
   error before `if'
/export/cruise/trunk/cc/projects/drlvm/trunk/src/test/regression/H2151/VMInit1.cpp:34: error:
'
   jvmtiEventCallbacks' is used as a type, but is not defined as a type.
/export/cruise/trunk/cc/projects/drlvm/trunk/src/test/regression/H2151/VMInit1.cpp:35: error:
`
   callbacks' was not declared in this scope
/export/cruise/trunk/cc/projects/drlvm/trunk/src/test/regression/H2151/VMInit1.cpp:35: error:
`
   jvmtiEventCallbacks' was not declared in this scope
/export/cruise/trunk/cc/projects/drlvm/trunk/src/test/regression/H2151/VMInit1.cpp:35: error:
ISO
   C++ forbids declaration of `memset' with no type
/export/cruise/trunk/cc/projects/drlvm/trunk/src/test/regression/H2151/VMInit1.cpp:35: error:
`
   int memset' redeclared as different kind of symbol
/usr/include/string.h:58: error: previous declaration of `void* memset(void*, 
   int, long unsigned int)'
/export/cruise/trunk/cc/projects/drlvm/trunk/src/test/regression/H2151/VMInit1.cpp:35: error:
initializer
   list being treated as compound expression
/export/cruise/trunk/cc/projects/drlvm/trunk/src/test/regression/H2151/VMInit1.cpp:36: error:
syntax
   error before `.' token
/export/cruise/trunk/cc/projects/drlvm/trunk/src/test/regression/H2151/VMInit1.cpp:39: error:
ISO
   C++ forbids declaration of `result' with no type
/export/cruise/trunk/cc/projects/drlvm/trunk/src/test/regression/H2151/VMInit1.cpp:39: error:
redefinition
   of `int result'
/export/cruise/trunk/cc/projects/drlvm/trunk/src/test/regression/H2151/VMInit1.cpp:30: error:
`
   int result' previously defined here
/export/cruise/trunk/cc/projects/drlvm/trunk/src/test/regression/H2151/VMInit1.cpp:39: error:
`
   jvmti_env' was not declared in this scope
/export/cruise/trunk/cc/projects/drlvm/trunk/src/test/regression/H2151/VMInit1.cpp:39: error:
`
   callbacks' was not declared in this scope
/export/cruise/trunk/cc/projects/drlvm/trunk/src/test/regression/H2151/VMInit1.cpp:39: error:
`
   jint' was not declared in this scope
/export/cruise/trunk/cc/projects/drlvm/trunk/src/test/regression/H2151/VMInit1.cpp:39: error:
syntax
   error before `sizeof'
/export/cruise/trunk/cc/projects/drlvm/trunk/src/test/regression/H2151/VMInit1.cpp:44: error:
ISO
   C++ forbids declaration of `result' with no type
/export/cruise/trunk/cc/projects/drlvm/trunk/src/test/regression/H2151/VMInit1.cpp:44: error:
redefinition
   of `int result'
/export/cruise/trunk/cc/projects/drlvm/trunk/src/test/regression/H2151/VMInit1.cpp:39: error:
`
   int result' previously defined here
/export/cruise/trunk/cc/projects/drlvm/trunk/src/test/regression/H2151/VMInit1.cpp:44: error:
`
   jvmti_env' was not declared in this scope
/export/cruise/trunk/cc/projects/drlvm/trunk/src/test/regression/H2151/VMInit1.cpp:44: error:
`
   JVMTI_ENABLE' was not declared in this scope
/export/cruise/trunk/cc/projects/drlvm/trunk/src/test/regression/H2151/VMInit1.cpp:44: error:
`
   JVMTI_EVENT_VM_INIT' was not declared in this scope
/export/cruise/trunk/cc/projects/drlvm/trunk/src/test/regression/H2151/VMInit1.cpp:45: error:
syntax
Configuration:
     Hosting Java = 1.5.0_09 (Sun Microsystems Inc.)
    classlib root = /export/cruise/trunk/cc/projects/classlib/trunk
               os = Linux
             arch = em64t
              cxx = gcc
              cfg = debug
     svn revision = ${svn.revision}
       components = deploy

***********************************************************
Unit Tests: (0)
        
No Tests Run: This project doesn't have any tests or tests were not run

***********************************************************
Modifications since last successful build:	(16)
            
modified mfursov  /harmony/enhanced/drlvm/trunk/vm/jitrino/src/codegenerator/ia32/Ia32Inst.h
06/18/2007 18:34:08 HARMONY-2092: fixes for volatile longs handling in Jitrino.OPT and Jitrino.JET
jits with regression test.(previous commit was not done from the root folder)
modified mfursov  /harmony/enhanced/drlvm/trunk/vm/jitrino/src/jet/cg.h 06/18/2007 18:34:08
HARMONY-2092: fixes for volatile longs handling in Jitrino.OPT and Jitrino.JET jits with regression
test.(previous commit was not done from the root folder)
modified mfursov  /harmony/enhanced/drlvm/trunk/vm/jitrino/src/codegenerator/ia32/Ia32Printer.cpp
06/18/2007 18:34:08 HARMONY-2092: fixes for volatile longs handling in Jitrino.OPT and Jitrino.JET
jits with regression test.(previous commit was not done from the root folder)
modified mfursov  /harmony/enhanced/drlvm/trunk/vm/jitrino/src/codegenerator/ia32/Ia32IRManager.cpp
06/18/2007 18:34:08 HARMONY-2092: fixes for volatile longs handling in Jitrino.OPT and Jitrino.JET
jits with regression test.(previous commit was not done from the root folder)
modified mfursov  /harmony/enhanced/drlvm/trunk/vm/jitrino/src/jet/cg_fld_arr.cpp 06/18/2007
18:34:08 HARMONY-2092: fixes for volatile longs handling in Jitrino.OPT and Jitrino.JET jits
with regression test.(previous commit was not done from the root folder)
modified mfursov  /harmony/enhanced/drlvm/trunk/vm/jitrino/src/jet/enc_ia32.cpp 06/18/2007
18:34:08 HARMONY-2092: fixes for volatile longs handling in Jitrino.OPT and Jitrino.JET jits
with regression test.(previous commit was not done from the root folder)
modified mfursov  /harmony/enhanced/drlvm/trunk/vm/jitrino/src/codegenerator/ia32/Ia32IRManager.h
06/18/2007 18:34:08 HARMONY-2092: fixes for volatile longs handling in Jitrino.OPT and Jitrino.JET
jits with regression test.(previous commit was not done from the root folder)
modified mfursov  /harmony/enhanced/drlvm/trunk/vm/port/src/encoder/ia32_em64t/enc_tabl.cpp
06/18/2007 18:34:08 HARMONY-2092: fixes for volatile longs handling in Jitrino.OPT and Jitrino.JET
jits with regression test.(previous commit was not done from the root folder)
modified mfursov  /harmony/enhanced/drlvm/trunk/vm/jitrino/src/jet/cg_regs.cpp 06/18/2007
18:34:08 HARMONY-2092: fixes for volatile longs handling in Jitrino.OPT and Jitrino.JET jits
with regression test.(previous commit was not done from the root folder)
modified mfursov  /harmony/enhanced/drlvm/trunk/vm/jitrino/src/jet/enc.h 06/18/2007 18:34:08
HARMONY-2092: fixes for volatile longs handling in Jitrino.OPT and Jitrino.JET jits with regression
test.(previous commit was not done from the root folder)
modified mfursov  /harmony/enhanced/drlvm/trunk/vm/jitrino/src/codegenerator/ia32/Ia32CopyExpansion.cpp
06/18/2007 18:34:08 HARMONY-2092: fixes for volatile longs handling in Jitrino.OPT and Jitrino.JET
jits with regression test.(previous commit was not done from the root folder)
modified mfursov  /harmony/enhanced/drlvm/trunk/vm/port/src/encoder/ia32_em64t/enc_defs.h
06/18/2007 18:34:08 HARMONY-2092: fixes for volatile longs handling in Jitrino.OPT and Jitrino.JET
jits with regression test.(previous commit was not done from the root folder)
modified mfursov  /harmony/enhanced/drlvm/trunk/vm/jitrino/src/codegenerator/ia32/Ia32I8Lowerer.cpp
06/18/2007 18:34:08 HARMONY-2092: fixes for volatile longs handling in Jitrino.OPT and Jitrino.JET
jits with regression test.(previous commit was not done from the root folder)
added mfursov  /harmony/enhanced/drlvm/trunk/src/test/regression/H2092/Test.java 06/18/2007
18:32:36 HARMONY-2092: fixes for volatile longs handling in Jitrino.OPT and Jitrino.JET jits
with regression test.
added mfursov  /harmony/enhanced/drlvm/trunk/src/test/regression/H2092 06/18/2007 18:32:36
HARMONY-2092: fixes for volatile longs handling in Jitrino.OPT and Jitrino.JET jits with regression
test.
added mfursov  /harmony/enhanced/drlvm/trunk/src/test/regression/H2092/run.test.xml 06/18/2007
18:32:36 HARMONY-2092: fixes for volatile longs handling in Jitrino.OPT and Jitrino.JET jits
with regression test.

Mime
View raw message