harmony-alerts mailing list archives

Site index · List index
Message view « Date » · « Thread »
Top « Date » · « Thread »
From nom...@intel.com
Subject [build-test alert] BUILD FAILED Windows 2003 x86_64 msvc debug: drlvm
Date Mon, 18 Jun 2007 10:42:50 GMT
BUILD FAILED:
	Ant Error Message:
C:\cruise\cc\projects\drlvm\trunk\build\make\build.xml:400: The following error occurred while executing this line: C:\cruise\cc\projects\drlvm\trunk\build\make\build_component.xml:73: The following error occurred while executing this line: C:\cruise\cc\projects\drlvm\trunk\build\win_em64t_msvc_debug\semis\build\targets\test.xml:6: Some tests failed

Date of build:	06/18/2007 12:34:13
Time to build:	308 minutes 20 seconds

***********************************************************
Execution log (errors/warnings messages):	
cl : Command line warning D9035 : option 'GZ' has been deprecated and will be removed in a future release
cl : Command line warning D9035 : option 'GZ' has been deprecated and will be removed in a future release
cl : Command line warning D9036 : use 'RTC1' instead of 'GZ'
cl : Command line warning D9035 : option 'GZ' has been deprecated and will be removed in a future release
cl : Command line warning D9036 : use 'RTC1' instead of 'GZ'
cl : Command line warning D9035 : option 'GZ' has been deprecated and will be removed in a future release
cl : Command line warning D9036 : use 'RTC1' instead of 'GZ'
cl : Command line warning D9035 : option 'GZ' has been deprecated and will be removed in a future release
cl : Command line warning D9036 : use 'RTC1' instead of 'GZ'
cl : Command line warning D9035 : option 'GZ' has been deprecated and will be removed in a future release
cl : Command line warning D9036 : use 'RTC1' instead of 'GZ'
cl : Command line warning D9035 : option 'GZ' has been deprecated and will be removed in a future release
cl : Command line warning D9036 : use 'RTC1' instead of 'GZ'
cl : Command line warning D9035 : option 'GZ' has been deprecated and will be removed in a future release
cl : Command line warning D9036 : use 'RTC1' instead of 'GZ'
cl : Command line warning D9035 : option 'GZ' has been deprecated and will be removed in a future release
cl : Command line warning D9036 : use 'RTC1' instead of 'GZ'
Java Result: 1
Java Result: 1
Java Result: 130
Java Result: 1
Java Result: 1
Java Result: 130
Java Result: 1
Java Result: 1
Java Result: 130
Java Result: 1
Java Result: 1
Java Result: 130
Java Result: 1
Java Result: 1
Java Result: 130
Tests FAILED
 Using CLASSLIB = C:\cruise\cc\projects\classlib\trunk
jars: true
using proxy settings: proxy.ims.intel.com port:911
Configuration:
     Hosting Java = 1.5.0_10 (Sun Microsystems Inc.)
    classlib root = C:\cruise\cc\projects\classlib\trunk
               os = Windows
             arch = em64t
              cxx = msvc
              cfg = debug
     svn revision = 548193
       components = deploy
## Compiling JVMTI natives in: C:\cruise\cc\projects\drlvm\trunk\vm\tests\jvmti\Breakpoint1
Adding manifest to C:\cruise\cc\projects\drlvm\trunk\build\win_em64t_msvc_debug\semis\jvmti.tests\native/Breakpoint1/Breakpoint1.dll
## Compiling JVMTI natives in: C:\cruise\cc\projects\drlvm\trunk\vm\tests\jvmti\PopFrame1
Adding manifest to C:\cruise\cc\projects\drlvm\trunk\build\win_em64t_msvc_debug\semis\jvmti.tests\native/PopFrame1/PopFrame1.dll
## Compiling JVMTI natives in: C:\cruise\cc\projects\drlvm\trunk\vm\tests\jvmti\SingleStep1
Adding manifest to C:\cruise\cc\projects\drlvm\trunk\build\win_em64t_msvc_debug\semis\jvmti.tests\native/SingleStep1/SingleStep1.dll
## Compiling JVMTI natives in: C:\cruise\cc\projects\drlvm\trunk\vm\tests\jvmti\VMInit1
Adding manifest to C:\cruise\cc\projects\drlvm\trunk\build\win_em64t_msvc_debug\semis\jvmti.tests\native/VMInit1/VMInit1.dll

        ==================================
        Run JVMTI tests using interpreter
        ==================================
        
Running Breakpoint1
Running PopFrame1
Running SingleStep1
Running VMInit1
## Compiling framework...
## Compiling C unit tests
## Linking C unit test: test_java_attrs
## Linking C unit test: test_java_basic
## Linking C unit test: test_java_identify
## Linking C unit test: test_java_interrupt
## Linking C unit test: test_java_monitors
## Linking C unit test: test_java_park
## Linking C unit test: test_java_ptr_conv
## Linking C unit test: test_java_suspend
## Linking C unit test: test_native_basic
## Linking C unit test: test_native_fat_monitor
## Linking C unit test: test_native_suspend
## Linking C unit test: test_native_thin_monitor
## Linking C unit test: test_ti_instrum
## Linking C unit test: test_ti_local_storage
## Linking C unit test: test_ti_monitor_info
## Linking C unit test: test_ti_peak_count
## Linking C unit test: test_ti_raw_monitors
## Linking C unit test: test_ti_state
## Linking C unit test: test_ti_timing
## Executing C unit test: test_java_attrs
INFO: TEST test_jthread_get_priority start
INFO: TEST test_jthread_get_priority: PASSED
INFO: TEST test_jthread_set_priority start
INFO: TEST test_jthread_set_priority: PASSED
## TEST PASSED
## Executing C unit test: test_java_basic
INFO: TEST test_jthread_attach start
INFO: TEST test_jthread_attach: PASSED
INFO: TEST test_jthread_detach start
INFO: TEST test_jthread_detach: PASSED
INFO: TEST test_hythread_create start
INFO: TEST test_hythread_create: PASSED
INFO: TEST test_hythread_create_with_function start
INFO: TEST test_hythread_create_with_function: PASSED
INFO: TEST test_jthread_get_JNI_env start
INFO: TEST test_jthread_get_JNI_env: PASSED
INFO: TEST test_jthread_join start
INFO: TEST test_jthread_join: PASSED
INFO: TEST test_jthread_timed_join start
-------- status = 00011177 (70007) 100
-------- status = 00011177 (70007) 100
-------- status = 00011177 (70007) 100
-------- status = 00011177 (70007) 100
-------- status = 00000000 (0) 50000
-------- status = 00000000 (0) 50000
-------- status = 00000000 (0) 50000
-------- status = 00000000 (0) 50000
INFO: TEST test_jthread_timed_join: PASSED
INFO: TEST test_jthread_exception_stop start
INFO: TEST test_jthread_exception_stop: PASSED
INFO: TEST test_jthread_sleep start
INFO: TEST test_jthread_sleep: PASSED
INFO: TEST test_hythread_yield start
INFO: TEST test_hythread_yield: PASSED
## TEST PASSED
## Executing C unit test: test_java_identify
INFO: TEST test_jthread_self start
INFO: TEST test_jthread_self: PASSED
INFO: TEST test_jthread_get_id start
INFO: TEST test_jthread_get_id: PASSED
INFO: TEST test_jthread_get_thread start
INFO: TEST test_jthread_get_thread: PASSED
## TEST PASSED
## Executing C unit test: test_java_interrupt
INFO: TEST test_jthread_interrupt start
INFO: TEST test_jthread_interrupt: PASSED
INFO: TEST test_jthread_is_interrupted start
INFO: TEST test_jthread_is_interrupted: PASSED
INFO: TEST test_jthread_clear_interrupted start
INFO: TEST test_jthread_clear_interrupted: PASSED
## TEST PASSED
## Executing C unit test: test_java_monitors
INFO: TEST test_jthread_monitor_init start
INFO: TEST test_jthread_monitor_init: PASSED
INFO: TEST test_jthread_monitor_enter start
INFO: TEST test_jthread_monitor_enter: PASSED
INFO: TEST test_jthread_monitor_try_enter start
INFO: TEST test_jthread_monitor_try_enter: PASSED
INFO: TEST test_jthread_monitor_exit start
INFO: TEST test_jthread_monitor_exit: PASSED
INFO: TEST test_jthread_monitor_notify_all start
INFO: TEST test_jthread_monitor_notify_all: PASSED
INFO: TEST test_jthread_monitor_wait start
INFO: TEST test_jthread_monitor_wait: PASSED
INFO: TEST test_jthread_monitor_timed_wait start
INFO: TEST test_jthread_monitor_timed_wait: PASSED
INFO: TEST test_jthread_monitor_timed_wait_timeout start
INFO: TEST test_jthread_monitor_timed_wait_timeout: PASSED
## TEST PASSED
## Executing C unit test: test_java_park
INFO: TEST test_jthread_park_unpark start
INFO: TEST test_jthread_park_unpark: PASSED
INFO: TEST test_jthread_park_interrupt start
INFO: TEST test_jthread_park_interrupt: PASSED
INFO: TEST test_jthread_timed_park start
INFO: TEST test_jthread_timed_park: PASSED
## TEST PASSED
## Executing C unit test: test_java_ptr_conv
INFO: TEST test_jthread_get_java_thread start
INFO: TEST test_jthread_get_java_thread: PASSED
INFO: TEST test_jthread_get_native_thread start
INFO: TEST test_jthread_get_native_thread: PASSED
## TEST PASSED
## Executing C unit test: test_java_suspend
INFO: TEST test_jthread_suspend_resume start
INFO: TEST test_jthread_suspend_resume: PASSED
INFO: TEST test_jthread_suspend_all_resume_all start
INFO: TEST test_jthread_suspend_all_resume_all: PASSED
## TEST PASSED
## Executing C unit test: test_native_basic
INFO: TEST test_hythread_self_base start
INFO: TEST test_hythread_self_base: PASSED
INFO: TEST test_hythread_create start
INFO: TEST test_hythread_create: PASSED
INFO: TEST test_hythread_create_many start
INFO: TEST test_hythread_create_many: PASSED
INFO: TEST test_hythread_iterator start
iterator size: 100
INFO: TEST test_hythread_iterator: PASSED
INFO: TEST test_hythread_iterator_default start
default group iterator: 106
INFO: TEST test_hythread_iterator_default: PASSED
## TEST PASSED
## Executing C unit test: test_native_fat_monitor
INFO: TEST test_wait_signal start
INFO: TEST test_wait_signal: PASSED
## TEST PASSED
## Executing C unit test: test_native_suspend
INFO: TEST test_hythread_thread_suspend start
INFO: TEST test_hythread_thread_suspend: PASSED
INFO: TEST test_hythread_thread_suspend_all start
INFO: TEST test_hythread_thread_suspend_all: PASSED
## TEST PASSED
## Executing C unit test: test_native_thin_monitor
INFO: TEST test_hythread_thin_monitor_enter start
INFO: TEST test_hythread_thin_monitor_enter: PASSED
INFO: TEST test_hythread_thin_monitor_try_enter start
INFO: TEST test_hythread_thin_monitor_try_enter: PASSED
INFO: TEST test_hythread_thin_monitor_wait_timed_illegal start
INFO: TEST test_hythread_thin_monitor_wait_timed_illegal: PASSED
INFO: TEST test_hythread_thin_monitor_wait_timed start
INFO: TEST test_hythread_thin_monitor_wait_timed: PASSED
INFO: TEST test_hythread_thin_monitor_fat_unlock start
status: 70007
INFO: TEST test_hythread_thin_monitor_fat_unlock: PASSED
INFO: TEST test_hythread_thin_monitor_enter_contended start
INFO: TEST test_hythread_thin_monitor_enter_contended: PASSED
## TEST PASSED
## Executing C unit test: test_ti_instrum
INFO: TEST test_jthread_get_all_threads start
INFO: TEST test_jthread_get_all_threads: PASSED
INFO: TEST test_jthread_get_thread_count start
INFO: TEST test_jthread_get_thread_count: PASSED
INFO: TEST test_jthread_get_blocked_count start
INFO: TEST test_jthread_get_blocked_count: PASSED
## TEST PASSED
## Executing C unit test: test_ti_local_storage
## TEST PASSED
## Executing C unit test: test_ti_monitor_info
INFO: TEST test_jthread_get_contended_monitor start
INFO: TEST test_jthread_get_contended_monitor: PASSED
INFO: TEST test_jthread_holds_lock start
INFO: TEST test_jthread_holds_lock: PASSED
INFO: TEST test_jthread_get_lock_owner start
INFO: TEST test_jthread_get_lock_owner: PASSED
INFO: TEST test_jthread_get_owned_monitors start
INFO: TEST test_jthread_get_owned_monitors: PASSED
## TEST PASSED
## Executing C unit test: test_ti_peak_count
## TEST PASSED
## Executing C unit test: test_ti_raw_monitors
INFO: TEST test_jthread_raw_monitor_create start
INFO: TEST test_jthread_raw_monitor_create: PASSED
INFO: TEST test_jthread_raw_monitor_destroy start
INFO: TEST test_jthread_raw_monitor_destroy: PASSED
INFO: TEST test_jthread_raw_monitor_enter start
INFO: TEST test_jthread_raw_monitor_enter: PASSED
INFO: TEST test_jthread_raw_monitor_try_enter start
INFO: TEST test_jthread_raw_monitor_try_enter: PASSED
INFO: TEST test_jthread_raw_monitor_exit start
INFO: TEST test_jthread_raw_monitor_exit: PASSED
## TEST PASSED
## Executing C unit test: test_ti_state
INFO: TEST test_jthread_get_state_6 start
state = 00000002 (00000002)
state = 00000002 (00000002)
state = 00000002 (00000002)
state = 00000002 (00000002)
state = 00000002 (00000002)
INFO: TEST test_jthread_get_state_6: PASSED
## TEST PASSED
## Executing C unit test: test_ti_timing
## TEST PASSED
## Please find tests and results at C:\cruise\cc\projects\drlvm\trunk\build\win_em64t_msvc_debug\semis/vm/_cunit.tests/
Note: C:\cruise\cc\projects\drlvm\trunk\vm\tests\smoke\gc\RunFinalizersOnExitTest.java uses or overrides a deprecated API.
Note: Recompile with -Xlint:deprecation for details.
Note: Some input files use unchecked or unsafe operations.
Note: Recompile with -Xlint:unchecked for details.
Compiling C:\cruise\cc\projects\drlvm\trunk\build\win_em64t_msvc_debug\semis\vm\_smoke.tests\natives/shutdown/TestDaemonOnWait
Adding manifest to C:\cruise\cc\projects\drlvm\trunk\build\win_em64t_msvc_debug\semis\vm\_smoke.tests\natives/shutdown/TestDaemonOnWait.dll
Compiling C:\cruise\cc\projects\drlvm\trunk\build\win_em64t_msvc_debug\semis\vm\_smoke.tests\natives/shutdown/TestFatalError
Adding manifest to C:\cruise\cc\projects\drlvm\trunk\build\win_em64t_msvc_debug\semis\vm\_smoke.tests\natives/shutdown/TestFatalError.dll
Compiling C:\cruise\cc\projects\drlvm\trunk\build\win_em64t_msvc_debug\semis\vm\_smoke.tests\natives/shutdown/TestInterrupt
Adding manifest to C:\cruise\cc\projects\drlvm\trunk\build\win_em64t_msvc_debug\semis\vm\_smoke.tests\natives/shutdown/TestInterrupt.dll

        ==================================
        Smoke tests on Client mode JIT (default)
        ==================================
        

Using exclude file = C:\cruise\cc\projects\drlvm\trunk\build\make\excludes\exclude.drlvm_smoke.windows.x86_64.jit   
        
Check.java
PerfCheck.java

# HARMONY-3338
gc/LOS.java
gc/MultiThreads.java
perf/MultiThreadsSimple.java

# HARMONY-2972
StackTest.java
exception/FinalizeStackTest.java
stress/Stack.java

# HARMONY-2977
io/Integers.java

# HARMONY-3917
gc/PhantomReferenceTest.java
gc/WeakReferenceTest.java

# HARMONY-4185
gc/Mark.java


                  
Running test : Hi
 PASSED : Hi
Running test : classloader.ClassTestGetDeclaringClass
 PASSED : classloader.ClassTestGetDeclaringClass
Running test : classloader.ExceptionInInitializerTest
 PASSED : classloader.ExceptionInInitializerTest
Running test : classloader.LogLoader
 PASSED : classloader.LogLoader
Running test : classloader.NotFound
 PASSED : classloader.NotFound
Running test : classloader.StressLoader
 PASSED : classloader.StressLoader
Running test : exception.ExceptionStackTest
 PASSED : exception.ExceptionStackTest
Running test : exception.NPE
 PASSED : exception.NPE
Running test : gc.FinAlloc
 PASSED : gc.FinAlloc
Running test : gc.Finalizer
 PASSED : gc.Finalizer
Running test : gc.Force
 PASSED : gc.Force
Running test : gc.Fragment
 PASSED : gc.Fragment
Running test : gc.Free
 PASSED : gc.Free
Running test : gc.List
 PASSED : gc.List
Running test : gc.NPE
 PASSED : gc.NPE
Running test : gc.PhantomReferenceQueueTest
 PASSED : gc.PhantomReferenceQueueTest
Running test : gc.RefRemove
 PASSED : gc.RefRemove
Running test : gc.RunFinalizersOnExitTest
 PASSED : gc.RunFinalizersOnExitTest
Running test : gc.StressRef
 PASSED : gc.StressRef
Running test : gc.SynchronizedFinalizersTest
 PASSED : gc.SynchronizedFinalizersTest
Running test : gc.ThreadSuspension
 PASSED : gc.ThreadSuspension
Running test : init.ErrorInInitializer
 PASSED : init.ErrorInInitializer
Running test : init.Other
 PASSED : init.Other
Running test : io.ArrayList
 PASSED : io.ArrayList
Running test : jni.LoadLibrary
 PASSED : jni.LoadLibrary
Running test : outofmemory.Double
 PASSED : outofmemory.Double
Running test : outofmemory.Int
 PASSED : outofmemory.Int
Running test : outofmemory.Plain
 PASSED : outofmemory.Plain
Running test : outofmemory.Ref
 PASSED : outofmemory.Ref
Running test : outofmemory.Throw
 PASSED : outofmemory.Throw
Running test : outofmemory.Vector
 PASSED : outofmemory.Vector
Running test : outofmemory.VectorDouble
 PASSED : outofmemory.VectorDouble
Running test : outofmemory.VectorInt
 PASSED : outofmemory.VectorInt
Running test : outofmemory.VectorRef
 PASSED : outofmemory.VectorRef
Running test : perf.CreateManyExceptions
 PASSED : perf.CreateManyExceptions
Running test : perf.CreateManyExceptions_depth
 PASSED : perf.CreateManyExceptions_depth
Running test : perf.SeveralThreads
 PASSED : perf.SeveralThreads
Running test : perf.StressCornerSize
 PASSED : perf.StressCornerSize
Running test : perf.StressCornerSize_a
 PASSED : perf.StressCornerSize_a
Running test : perf.ThrowMany
 PASSED : perf.ThrowMany
Running test : perf.ThrowManyExceptions
 PASSED : perf.ThrowManyExceptions
Running test : perf.ThrowManyExceptions_depth
 PASSED : perf.ThrowManyExceptions_depth
Running test : perf.ThrowMany_depth
 PASSED : perf.ThrowMany_depth
Running test : reflect.GetMethod
 PASSED : reflect.GetMethod
Running test : shutdown.TestDaemonOnWait
 PASSED : shutdown.TestDaemonOnWait
Running test : shutdown.TestFatalError
 PASSED : shutdown.TestFatalError
Running test : shutdown.TestInterrupt
 PASSED : shutdown.TestInterrupt
Running test : shutdown.TestLock
 PASSED : shutdown.TestLock
Running test : stress.BigStringBuffer
 PASSED : stress.BigStringBuffer
Running test : stress.Finalizer
 PASSED : stress.Finalizer
Running test : stress.Intern
 PASSED : stress.Intern
Running test : stress.Mix
 PASSED : stress.Mix
Running test : stress.Sync
 PASSED : stress.Sync
Running test : stress.Threads
 PASSED : stress.Threads
Running test : stress.Vector
 PASSED : stress.Vector
Running test : stress.WeakHashmapTest
 PASSED : stress.WeakHashmapTest
Running test : thread.ExitShutdownHook
 PASSED : thread.ExitShutdownHook
Running test : thread.InfiniteFinalizer
 PASSED : thread.InfiniteFinalizer
Running test : thread.InterruptWait
 PASSED : thread.InterruptWait
Running test : thread.ManyThreadsTest
 PASSED : thread.ManyThreadsTest
Running test : thread.Sleep
 PASSED : thread.Sleep
Running test : thread.ThreadInterrupt
 PASSED : thread.ThreadInterrupt
Running test : thread.ThreadOOM
 PASSED : thread.ThreadOOM
Running test : util.Date
 PASSED : util.Date
Running test : util.DoPriveleged
 PASSED : util.DoPriveleged
Running test : util.Prop
 PASSED : util.Prop
Running test : util.StringIntern
 PASSED : util.StringIntern
Please find test classes and results at C:\cruise\cc\projects\drlvm\trunk\build\win_em64t_msvc_debug\semis/vm/_smoke.tests/

        ==================================
        Smoke tests on jitrino.JET
        ==================================
        

Using exclude file = C:\cruise\cc\projects\drlvm\trunk\build\make\excludes\exclude.drlvm_smoke.windows.x86_64.jet   
        
Check.java
PerfCheck.java

# HARMONY-2972
StackTest.java
stress/Stack.java

# HARMONY-2977
io/Integers.java

# HARMONY-3917
gc/PhantomReferenceTest.java
gc/WeakReferenceTest.java

# HARMONY-4185
gc/Mark.java

                  
Running test : Hi
 PASSED : Hi
Running test : classloader.ClassTestGetDeclaringClass
 PASSED : classloader.ClassTestGetDeclaringClass
Running test : classloader.ExceptionInInitializerTest
 PASSED : classloader.ExceptionInInitializerTest
Running test : classloader.LogLoader
 PASSED : classloader.LogLoader
Running test : classloader.NotFound
 PASSED : classloader.NotFound
Running test : classloader.StressLoader
 PASSED : classloader.StressLoader
Running test : exception.ExceptionStackTest
 PASSED : exception.ExceptionStackTest
Running test : exception.FinalizeStackTest
 PASSED : exception.FinalizeStackTest
Running test : exception.NPE
 PASSED : exception.NPE
Running test : gc.FinAlloc
 PASSED : gc.FinAlloc
Running test : gc.Finalizer
 PASSED : gc.Finalizer
Running test : gc.Force
 PASSED : gc.Force
Running test : gc.Fragment
 PASSED : gc.Fragment
Running test : gc.Free
 PASSED : gc.Free
Running test : gc.LOS
 PASSED : gc.LOS
Running test : gc.List
 PASSED : gc.List
Running test : gc.MultiThreads
 PASSED : gc.MultiThreads
Running test : gc.NPE
 PASSED : gc.NPE
Running test : gc.PhantomReferenceQueueTest
 PASSED : gc.PhantomReferenceQueueTest
Running test : gc.RefRemove
 PASSED : gc.RefRemove
Running test : gc.RunFinalizersOnExitTest
 PASSED : gc.RunFinalizersOnExitTest
Running test : gc.StressRef
 PASSED : gc.StressRef
Running test : gc.SynchronizedFinalizersTest
 PASSED : gc.SynchronizedFinalizersTest
Running test : gc.ThreadSuspension
 PASSED : gc.ThreadSuspension
Running test : init.ErrorInInitializer
 PASSED : init.ErrorInInitializer
Running test : init.Other
 PASSED : init.Other
Running test : io.ArrayList
 PASSED : io.ArrayList
Running test : jni.LoadLibrary
 PASSED : jni.LoadLibrary
Running test : outofmemory.Double
 PASSED : outofmemory.Double
Running test : outofmemory.Int
 PASSED : outofmemory.Int
Running test : outofmemory.Plain
 PASSED : outofmemory.Plain
Running test : outofmemory.Ref
 PASSED : outofmemory.Ref
Running test : outofmemory.Throw
 PASSED : outofmemory.Throw
Running test : outofmemory.Vector
 PASSED : outofmemory.Vector
Running test : outofmemory.VectorDouble
 PASSED : outofmemory.VectorDouble
Running test : outofmemory.VectorInt
 PASSED : outofmemory.VectorInt
Running test : outofmemory.VectorRef
 PASSED : outofmemory.VectorRef
Running test : perf.CreateManyExceptions
 PASSED : perf.CreateManyExceptions
Running test : perf.CreateManyExceptions_depth
 PASSED : perf.CreateManyExceptions_depth
Running test : perf.MultiThreadsSimple
 PASSED : perf.MultiThreadsSimple
Running test : perf.SeveralThreads
 PASSED : perf.SeveralThreads
Running test : perf.StressCornerSize
 PASSED : perf.StressCornerSize
Running test : perf.StressCornerSize_a
 PASSED : perf.StressCornerSize_a
Running test : perf.ThrowMany
 PASSED : perf.ThrowMany
Running test : perf.ThrowManyExceptions
 PASSED : perf.ThrowManyExceptions
Running test : perf.ThrowManyExceptions_depth
 PASSED : perf.ThrowManyExceptions_depth
Running test : perf.ThrowMany_depth
 PASSED : perf.ThrowMany_depth
Running test : reflect.GetMethod
 PASSED : reflect.GetMethod
Running test : shutdown.TestDaemonOnWait
 PASSED : shutdown.TestDaemonOnWait
Running test : shutdown.TestFatalError
 PASSED : shutdown.TestFatalError
Running test : shutdown.TestInterrupt
 PASSED : shutdown.TestInterrupt
Running test : shutdown.TestLock
 PASSED : shutdown.TestLock
Running test : stress.BigStringBuffer
 PASSED : stress.BigStringBuffer
Running test : stress.Finalizer
 PASSED : stress.Finalizer
Running test : stress.Intern
 PASSED : stress.Intern
Running test : stress.Mix
 PASSED : stress.Mix
Running test : stress.Sync
 PASSED : stress.Sync
Running test : stress.Threads
 PASSED : stress.Threads
Running test : stress.Vector
 PASSED : stress.Vector
Running test : stress.WeakHashmapTest
 PASSED : stress.WeakHashmapTest
Running test : thread.ExitShutdownHook
 PASSED : thread.ExitShutdownHook
Running test : thread.InfiniteFinalizer
 PASSED : thread.InfiniteFinalizer
Running test : thread.InterruptWait
 PASSED : thread.InterruptWait
Running test : thread.ManyThreadsTest
 PASSED : thread.ManyThreadsTest
Running test : thread.Sleep
 PASSED : thread.Sleep
Running test : thread.ThreadInterrupt
 PASSED : thread.ThreadInterrupt
Running test : thread.ThreadOOM
 PASSED : thread.ThreadOOM
Running test : util.Date
 PASSED : util.Date
Running test : util.DoPriveleged
 PASSED : util.DoPriveleged
Running test : util.Prop
 PASSED : util.Prop
Running test : util.StringIntern
 PASSED : util.StringIntern
Please find test classes and results at C:\cruise\cc\projects\drlvm\trunk\build\win_em64t_msvc_debug\semis/vm/_smoke.tests/

        ==================================
        Smoke tests on jitrino.OPT
        ==================================
        

Using exclude file = C:\cruise\cc\projects\drlvm\trunk\build\make\excludes\exclude.drlvm_smoke.windows.x86_64.opt   
        
Check.java
PerfCheck.java

# HARMONY-3338
gc/LOS.java
gc/MultiThreads.java
perf/MultiThreadsSimple.java

# HARMONY-3349
gc/Finalizer.java
gc/RunFinalizersOnExitTest.java
gc/ThreadSuspension.java


# HARMONY-2972
StackTest.java
exception/FinalizeStackTest.java
stress/Stack.java

# HARMONY-3917
gc/PhantomReferenceTest.java
gc/WeakReferenceTest.java


                  
Running test : Hi
 PASSED : Hi
Running test : classloader.ClassTestGetDeclaringClass
 PASSED : classloader.ClassTestGetDeclaringClass
Running test : classloader.ExceptionInInitializerTest
 PASSED : classloader.ExceptionInInitializerTest
Running test : classloader.LogLoader
 PASSED : classloader.LogLoader
Running test : classloader.NotFound
 PASSED : classloader.NotFound
Running test : classloader.StressLoader
 PASSED : classloader.StressLoader
Running test : exception.ExceptionStackTest
 PASSED : exception.ExceptionStackTest
Running test : exception.NPE
 PASSED : exception.NPE
Running test : gc.FinAlloc
 PASSED : gc.FinAlloc
Running test : gc.Force
 PASSED : gc.Force
Running test : gc.Fragment
 PASSED : gc.Fragment
Running test : gc.Free
 PASSED : gc.Free
Running test : gc.List
 PASSED : gc.List
Running test : gc.Mark
 PASSED : gc.Mark
Running test : gc.NPE
 PASSED : gc.NPE
Running test : gc.PhantomReferenceQueueTest
 PASSED : gc.PhantomReferenceQueueTest
Running test : gc.RefRemove
 PASSED : gc.RefRemove
Running test : gc.StressRef
 PASSED : gc.StressRef
Running test : gc.SynchronizedFinalizersTest
 PASSED : gc.SynchronizedFinalizersTest
Running test : init.ErrorInInitializer
 PASSED : init.ErrorInInitializer
Running test : init.Other
 PASSED : init.Other
Running test : io.ArrayList
 PASSED : io.ArrayList
Running test : io.Integers
 PASSED : io.Integers
Running test : jni.LoadLibrary
 PASSED : jni.LoadLibrary
Running test : outofmemory.Double
 PASSED : outofmemory.Double
Running test : outofmemory.Int
 PASSED : outofmemory.Int
Running test : outofmemory.Plain
 PASSED : outofmemory.Plain
Running test : outofmemory.Ref
 PASSED : outofmemory.Ref
Running test : outofmemory.Throw
 PASSED : outofmemory.Throw
Running test : outofmemory.Vector
 PASSED : outofmemory.Vector
Running test : outofmemory.VectorDouble
 PASSED : outofmemory.VectorDouble
Running test : outofmemory.VectorInt
 PASSED : outofmemory.VectorInt
Running test : outofmemory.VectorRef
 PASSED : outofmemory.VectorRef
Running test : perf.CreateManyExceptions
 PASSED : perf.CreateManyExceptions
Running test : perf.CreateManyExceptions_depth
 PASSED : perf.CreateManyExceptions_depth
Running test : perf.SeveralThreads
 PASSED : perf.SeveralThreads
Running test : perf.StressCornerSize
 PASSED : perf.StressCornerSize
Running test : perf.StressCornerSize_a
 PASSED : perf.StressCornerSize_a
Running test : perf.ThrowMany
 PASSED : perf.ThrowMany
Running test : perf.ThrowManyExceptions
 PASSED : perf.ThrowManyExceptions
Running test : perf.ThrowManyExceptions_depth
 PASSED : perf.ThrowManyExceptions_depth
Running test : perf.ThrowMany_depth
 PASSED : perf.ThrowMany_depth
Running test : reflect.GetMethod
 PASSED : reflect.GetMethod
Running test : shutdown.TestDaemonOnWait
 PASSED : shutdown.TestDaemonOnWait
Running test : shutdown.TestFatalError
 PASSED : shutdown.TestFatalError
Running test : shutdown.TestInterrupt
 PASSED : shutdown.TestInterrupt
Running test : shutdown.TestLock
 PASSED : shutdown.TestLock
Running test : stress.BigStringBuffer
 PASSED : stress.BigStringBuffer
Running test : stress.Finalizer
 PASSED : stress.Finalizer
Running test : stress.Intern
 PASSED : stress.Intern
Running test : stress.Mix
 PASSED : stress.Mix
Running test : stress.Sync
 PASSED : stress.Sync
Running test : stress.Threads
 PASSED : stress.Threads
Running test : stress.Vector
 PASSED : stress.Vector
Running test : stress.WeakHashmapTest
 PASSED : stress.WeakHashmapTest
Running test : thread.ExitShutdownHook
 PASSED : thread.ExitShutdownHook
Running test : thread.InfiniteFinalizer
 PASSED : thread.InfiniteFinalizer
Running test : thread.InterruptWait
 PASSED : thread.InterruptWait
Running test : thread.ManyThreadsTest
 PASSED : thread.ManyThreadsTest
Running test : thread.Sleep
 PASSED : thread.Sleep
Running test : thread.ThreadInterrupt
 PASSED : thread.ThreadInterrupt
Running test : thread.ThreadOOM
 PASSED : thread.ThreadOOM
Running test : util.Date
 PASSED : util.Date
Running test : util.DoPriveleged
 PASSED : util.DoPriveleged
Running test : util.Prop
 PASSED : util.Prop
Running test : util.StringIntern
 PASSED : util.StringIntern
Please find test classes and results at C:\cruise\cc\projects\drlvm\trunk\build\win_em64t_msvc_debug\semis/vm/_smoke.tests/

        ==================================
        Smoke tests on interpreter
        ==================================
        

Using exclude file = C:\cruise\cc\projects\drlvm\trunk\build\make\excludes\exclude.drlvm_smoke.windows.x86_64.int   
        
Check.java
PerfCheck.java

# HARMONY-2977
io/Integers.java

# unknown failure
gc/Mark.java

# HARMONY-3917
gc/PhantomReferenceTest.java
gc/WeakReferenceTest.java

# This stress test is very slow on interpreter
stress/Intern.java


                  
Running test : Hi
 PASSED : Hi
Running test : StackTest
 PASSED : StackTest
Running test : classloader.ClassTestGetDeclaringClass
 PASSED : classloader.ClassTestGetDeclaringClass
Running test : classloader.ExceptionInInitializerTest
 PASSED : classloader.ExceptionInInitializerTest
Running test : classloader.LogLoader
 PASSED : classloader.LogLoader
Running test : classloader.NotFound
 PASSED : classloader.NotFound
Running test : classloader.StressLoader
 PASSED : classloader.StressLoader
Running test : exception.ExceptionStackTest
 PASSED : exception.ExceptionStackTest
Running test : exception.FinalizeStackTest
 PASSED : exception.FinalizeStackTest
Running test : exception.NPE
 PASSED : exception.NPE
Running test : gc.FinAlloc
 PASSED : gc.FinAlloc
Running test : gc.Finalizer
 PASSED : gc.Finalizer
Running test : gc.Force
 PASSED : gc.Force
Running test : gc.Fragment
 PASSED : gc.Fragment
Running test : gc.Free
 PASSED : gc.Free
Running test : gc.LOS
 PASSED : gc.LOS
Running test : gc.List
 PASSED : gc.List
Running test : gc.MultiThreads
 PASSED : gc.MultiThreads
Running test : gc.NPE
 PASSED : gc.NPE
Running test : gc.PhantomReferenceQueueTest
 PASSED : gc.PhantomReferenceQueueTest
Running test : gc.RefRemove
 PASSED : gc.RefRemove
Running test : gc.RunFinalizersOnExitTest
 PASSED : gc.RunFinalizersOnExitTest
Running test : gc.StressRef
 PASSED : gc.StressRef
Running test : gc.SynchronizedFinalizersTest
 PASSED : gc.SynchronizedFinalizersTest
Running test : gc.ThreadSuspension
 PASSED : gc.ThreadSuspension
Running test : init.ErrorInInitializer
 PASSED : init.ErrorInInitializer
Running test : init.Other
 PASSED : init.Other
Running test : io.ArrayList
 PASSED : io.ArrayList
Running test : jni.LoadLibrary
 PASSED : jni.LoadLibrary
Running test : outofmemory.Double
 PASSED : outofmemory.Double
Running test : outofmemory.Int
 PASSED : outofmemory.Int
Running test : outofmemory.Plain
 PASSED : outofmemory.Plain
Running test : outofmemory.Ref
 PASSED : outofmemory.Ref
Running test : outofmemory.Throw
 PASSED : outofmemory.Throw
Running test : outofmemory.Vector
 PASSED : outofmemory.Vector
Running test : outofmemory.VectorDouble
 PASSED : outofmemory.VectorDouble
Running test : outofmemory.VectorInt
 PASSED : outofmemory.VectorInt
Running test : outofmemory.VectorRef
 PASSED : outofmemory.VectorRef
Running test : perf.CreateManyExceptions
 PASSED : perf.CreateManyExceptions
Running test : perf.CreateManyExceptions_depth
 PASSED : perf.CreateManyExceptions_depth
Running test : perf.MultiThreadsSimple
 PASSED : perf.MultiThreadsSimple
Running test : perf.SeveralThreads
 PASSED : perf.SeveralThreads
Running test : perf.StressCornerSize
 PASSED : perf.StressCornerSize
Running test : perf.StressCornerSize_a
 PASSED : perf.StressCornerSize_a
Running test : perf.ThrowMany
 PASSED : perf.ThrowMany
Running test : perf.ThrowManyExceptions
 PASSED : perf.ThrowManyExceptions
Running test : perf.ThrowManyExceptions_depth
 PASSED : perf.ThrowManyExceptions_depth
Running test : perf.ThrowMany_depth
 PASSED : perf.ThrowMany_depth
Running test : reflect.GetMethod
 PASSED : reflect.GetMethod
Running test : shutdown.TestDaemonOnWait
 PASSED : shutdown.TestDaemonOnWait
Running test : shutdown.TestFatalError
 PASSED : shutdown.TestFatalError
Running test : shutdown.TestInterrupt
 PASSED : shutdown.TestInterrupt
Running test : shutdown.TestLock
 PASSED : shutdown.TestLock
Running test : stress.BigStringBuffer
 PASSED : stress.BigStringBuffer
Running test : stress.Finalizer
 PASSED : stress.Finalizer
Running test : stress.Mix
 PASSED : stress.Mix
Running test : stress.Stack
 PASSED : stress.Stack
Running test : stress.Sync
 PASSED : stress.Sync
Running test : stress.Threads
 PASSED : stress.Threads
Running test : stress.Vector
 PASSED : stress.Vector
Running test : stress.WeakHashmapTest
 PASSED : stress.WeakHashmapTest
Running test : thread.ExitShutdownHook
 PASSED : thread.ExitShutdownHook
Running test : thread.InfiniteFinalizer
 PASSED : thread.InfiniteFinalizer
Running test : thread.InterruptWait
 PASSED : thread.InterruptWait
Running test : thread.ManyThreadsTest
 PASSED : thread.ManyThreadsTest
Running test : thread.Sleep
 PASSED : thread.Sleep
Running test : thread.ThreadInterrupt
 PASSED : thread.ThreadInterrupt
Running test : thread.ThreadOOM
 PASSED : thread.ThreadOOM
Running test : util.Date
 PASSED : util.Date
Running test : util.DoPriveleged
 PASSED : util.DoPriveleged
Running test : util.Prop
 PASSED : util.Prop
Running test : util.StringIntern
 PASSED : util.StringIntern
Please find test classes and results at C:\cruise\cc\projects\drlvm\trunk\build\win_em64t_msvc_debug\semis/vm/_smoke.tests/

        ==================================
        Smoke tests on Server mode JIT
        ==================================
        

Using exclude file = C:\cruise\cc\projects\drlvm\trunk\build\make\excludes\exclude.drlvm_smoke.windows.x86_64.srv   
        
Check.java
PerfCheck.java

# HARMONY-3338
gc/LOS.java
gc/MultiThreads.java
perf/MultiThreadsSimple.java

# HARMONY-3349
gc/Finalizer.java
gc/RunFinalizersOnExitTest.java

# HARMONY-2972
StackTest.java
exception/FinalizeStackTest.java
stress/Stack.java

# Server mode failures specific to Windows x86_64
stress/Mix.java

# HARMONY-3917
gc/PhantomReferenceTest.java
gc/WeakReferenceTest.java

                  
Running test : Hi
 PASSED : Hi
Running test : classloader.ClassTestGetDeclaringClass
 PASSED : classloader.ClassTestGetDeclaringClass
Running test : classloader.ExceptionInInitializerTest
 PASSED : classloader.ExceptionInInitializerTest
Running test : classloader.LogLoader
 PASSED : classloader.LogLoader
Running test : classloader.NotFound
 PASSED : classloader.NotFound
Running test : classloader.StressLoader
 PASSED : classloader.StressLoader
Running test : exception.ExceptionStackTest
 PASSED : exception.ExceptionStackTest
Running test : exception.NPE
 PASSED : exception.NPE
Running test : gc.FinAlloc
 PASSED : gc.FinAlloc
Running test : gc.Force
 PASSED : gc.Force
Running test : gc.Fragment
 PASSED : gc.Fragment
Running test : gc.Free
 PASSED : gc.Free
Running test : gc.List
 PASSED : gc.List
Running test : gc.Mark
 PASSED : gc.Mark
Running test : gc.NPE
 PASSED : gc.NPE
Running test : gc.PhantomReferenceQueueTest
 PASSED : gc.PhantomReferenceQueueTest
Running test : gc.RefRemove
 PASSED : gc.RefRemove
Running test : gc.StressRef
 PASSED : gc.StressRef
Running test : gc.SynchronizedFinalizersTest
 PASSED : gc.SynchronizedFinalizersTest
Running test : gc.ThreadSuspension
 PASSED : gc.ThreadSuspension
Running test : init.ErrorInInitializer
 PASSED : init.ErrorInInitializer
Running test : init.Other
 PASSED : init.Other
Running test : io.ArrayList
 PASSED : io.ArrayList
Running test : io.Integers
 PASSED : io.Integers
Running test : jni.LoadLibrary
 PASSED : jni.LoadLibrary
Running test : outofmemory.Double
 PASSED : outofmemory.Double
Running test : outofmemory.Int
 PASSED : outofmemory.Int
Running test : outofmemory.Plain
 PASSED : outofmemory.Plain
Running test : outofmemory.Ref
 PASSED : outofmemory.Ref
Running test : outofmemory.Throw
 PASSED : outofmemory.Throw
Running test : outofmemory.Vector
 PASSED : outofmemory.Vector
Running test : outofmemory.VectorDouble
 PASSED : outofmemory.VectorDouble
Running test : outofmemory.VectorInt
 PASSED : outofmemory.VectorInt
Running test : outofmemory.VectorRef
 PASSED : outofmemory.VectorRef
Running test : perf.CreateManyExceptions
 PASSED : perf.CreateManyExceptions
Running test : perf.CreateManyExceptions_depth
 PASSED : perf.CreateManyExceptions_depth
Running test : perf.SeveralThreads
 PASSED : perf.SeveralThreads
Running test : perf.StressCornerSize
 PASSED : perf.StressCornerSize
Running test : perf.StressCornerSize_a
 PASSED : perf.StressCornerSize_a
Running test : perf.ThrowMany
 PASSED : perf.ThrowMany
Running test : perf.ThrowManyExceptions
 PASSED : perf.ThrowManyExceptions
Running test : perf.ThrowManyExceptions_depth
 PASSED : perf.ThrowManyExceptions_depth
Running test : perf.ThrowMany_depth
 PASSED : perf.ThrowMany_depth
Running test : reflect.GetMethod
 PASSED : reflect.GetMethod
Running test : shutdown.TestDaemonOnWait
 PASSED : shutdown.TestDaemonOnWait
Running test : shutdown.TestFatalError
 PASSED : shutdown.TestFatalError
Running test : shutdown.TestInterrupt
 PASSED : shutdown.TestInterrupt
Running test : shutdown.TestLock
 PASSED : shutdown.TestLock
Running test : stress.BigStringBuffer
 PASSED : stress.BigStringBuffer
Running test : stress.Finalizer
 PASSED : stress.Finalizer
Running test : stress.Intern
 PASSED : stress.Intern
Running test : stress.Sync
 PASSED : stress.Sync
Running test : stress.Threads
 PASSED : stress.Threads
Running test : stress.Vector
 PASSED : stress.Vector
Running test : stress.WeakHashmapTest
 PASSED : stress.WeakHashmapTest
Running test : thread.ExitShutdownHook
 PASSED : thread.ExitShutdownHook
Running test : thread.InfiniteFinalizer
 PASSED : thread.InfiniteFinalizer
Running test : thread.InterruptWait
 PASSED : thread.InterruptWait
Running test : thread.ManyThreadsTest
 PASSED : thread.ManyThreadsTest
Running test : thread.Sleep
 PASSED : thread.Sleep
Running test : thread.ThreadInterrupt
 PASSED : thread.ThreadInterrupt
Running test : thread.ThreadOOM
 PASSED : thread.ThreadOOM
Running test : util.Date
 PASSED : util.Date
Running test : util.DoPriveleged
 PASSED : util.DoPriveleged
Running test : util.Prop
 PASSED : util.Prop
Running test : util.StringIntern
 PASSED : util.StringIntern
Please find test classes and results at C:\cruise\cc\projects\drlvm\trunk\build\win_em64t_msvc_debug\semis/vm/_smoke.tests/
The test report is in C:\cruise\cc\projects\drlvm\trunk\build\win_em64t_msvc_debug\semis\vm\_smoke.tests\reports\html\index.html
Note: Some input files use or override a deprecated API.
Note: Recompile with -Xlint:deprecation for details.
Note: C:\cruise\cc\projects\drlvm\trunk\vm\tests\kernel\java\lang\ClassAnnotationsTest.java uses unchecked or unsafe operations.
Note: Recompile with -Xlint:unchecked for details.

        ==================================
        Run kernel tests using Client mode JIT (default)
        ==================================
        

Using exclude file = C:\cruise\cc\projects\drlvm\trunk\build\make\excludes\exclude.drlvm_kernel.windows.x86_64.jit   
        
## These tests are too slow
java/lang/RuntimeAdditionalTest*.java

# HARMONY-2453
java/lang/SystemTest.java


                  
The GC did not provide gc_add_weak_root_set_entry()

        ==================================
        Run kernel tests using jitrino.JET
        ==================================
        

Using exclude file = C:\cruise\cc\projects\drlvm\trunk\build\make\excludes\exclude.drlvm_kernel.windows.x86_64.jet   
        
## These tests are too slow
java/lang/RuntimeAdditionalTest*.java

# HARMONY-2453
java/lang/SystemTest.java


                  
The GC did not provide gc_add_weak_root_set_entry()

        ==================================
        Run kernel tests using jitrino.OPT
        ==================================
        

Using exclude file = C:\cruise\cc\projects\drlvm\trunk\build\make\excludes\exclude.drlvm_kernel.windows.x86_64.opt   
        
## These tests are too slow
java/lang/RuntimeAdditionalTest*.java

# HARMONY-2453
java/lang/SystemTest.java


                  
The GC did not provide gc_add_weak_root_set_entry()

        ==================================
        Run kernel tests using interpreter
        ==================================
        

Using exclude file = C:\cruise\cc\projects\drlvm\trunk\build\make\excludes\exclude.drlvm_kernel.windows.x86_64.int   
        
## These tests are too slow
java/lang/RuntimeAdditionalTest*.java

# HARMONY-3214
java/lang/ClassGenericsTest.java
java/lang/ClassGenericsTest4.java

# HARMONY-2453
java/lang/SystemTest.java


                  
The GC did not provide gc_add_weak_root_set_entry()

        ==================================
        Run kernel tests using Server mode JIT
        ==================================
        

Using exclude file = C:\cruise\cc\projects\drlvm\trunk\build\make\excludes\exclude.drlvm_kernel.windows.x86_64.srv   
        
## These tests are too slow
java/lang/RuntimeAdditionalTest*.java

# HARMONY-2453
java/lang/SystemTest.java


                  
The GC did not provide gc_add_weak_root_set_entry()
  ***************************
  *** Kernel tests status ***
  ***************************
      Client mode JIT (default) PASSED
      jitrino.JET FAILED
      jitrino.OPT PASSED
      interpreter PASSED
      Server mode JIT PASSED
Please find detailed results under C:\cruise\cc\projects\drlvm\trunk\build\win_em64t_msvc_debug\semis\kernel.tests/reports directory.

***********************************************************
Unit Tests: (4279)
        
error: test_9 java.lang.ClassAnnotationsTest
error: test_10 java.lang.ClassAnnotationsTest
error: test_11 java.lang.ClassAnnotationsTest
error: testGetAnnotation java.lang.Package5Test
error: testGetAnnotation2 java.lang.Package5Test
error: testGetAnnotation_Negative java.lang.Package5Test
error: testGetDeclaredAnnotations java.lang.Package5Test
error: testGetDeclaredAnnotations2 java.lang.Package5Test
error: testGetDeclaredAnnotationsImmutable java.lang.Package5Test
error: testGetAnnotations java.lang.Package5Test
error: testGetAnnotations2 java.lang.Package5Test
error: testGetAnnotations5 java.lang.Package5Test
error: testGetAnnotationsImmutable java.lang.Package5Test
error: testIsAnnotationPresent java.lang.Package5Test
error: testIsAnnotationPresent_Negative java.lang.Package5Test
error: testGetParameterAnnotations2 java.lang.reflect.Ctor5Test
error: testGetParameterAnnotations3 java.lang.reflect.Ctor5Test
error: testGetParameterAnnotationsImmutable java.lang.reflect.Ctor5Test
error: testGetAnnotation java.lang.reflect.Ctor5Test
error: testGetAnnotation2 java.lang.reflect.Ctor5Test
error: testGetAnnotation_Negative java.lang.reflect.Ctor5Test
error: testGetDeclaredAnnotations java.lang.reflect.Ctor5Test
error: testGetDeclaredAnnotations2 java.lang.reflect.Ctor5Test
error: testGetDeclaredAnnotationsImmutable java.lang.reflect.Ctor5Test
error: testGetAnnotations java.lang.reflect.Ctor5Test
error: testGetAnnotations2 java.lang.reflect.Ctor5Test
error: testGetAnnotations5 java.lang.reflect.Ctor5Test
error: testGetAnnotationsImmutable java.lang.reflect.Ctor5Test
error: testIsAnnotationPresent java.lang.reflect.Ctor5Test
error: testIsAnnotationPresent_Negative java.lang.reflect.Ctor5Test
error: testGetAnnotation java.lang.reflect.Field5Test
error: testGetAnnotation2 java.lang.reflect.Field5Test
error: testGetAnnotation_Negative java.lang.reflect.Field5Test
error: testGetDeclaredAnnotations java.lang.reflect.Field5Test
error: testGetDeclaredAnnotations2 java.lang.reflect.Field5Test
error: testGetDeclaredAnnotationsImmutable java.lang.reflect.Field5Test
error: testGetAnnotations java.lang.reflect.Field5Test
error: testGetAnnotations2 java.lang.reflect.Field5Test
error: testGetAnnotations5 java.lang.reflect.Field5Test
error: testGetAnnotationsImmutable java.lang.reflect.Field5Test
error: testIsAnnotationPresent java.lang.reflect.Field5Test
error: testIsAnnotationPresent_Negative java.lang.reflect.Field5Test
error: testGetParameterAnnotations2 java.lang.reflect.Method5Test
error: testGetParameterAnnotations3 java.lang.reflect.Method5Test
error: testGetParameterAnnotationsImmutable java.lang.reflect.Method5Test
error: testGetAnnotation java.lang.reflect.Method5Test
error: testGetAnnotation2 java.lang.reflect.Method5Test
error: testGetAnnotation_Negative java.lang.reflect.Method5Test
error: testGetDeclaredAnnotations java.lang.reflect.Method5Test
error: testGetDeclaredAnnotations2 java.lang.reflect.Method5Test
error: testGetDeclaredAnnotationsImmutable java.lang.reflect.Method5Test
error: testGetAnnotations java.lang.reflect.Method5Test
error: testGetAnnotations2 java.lang.reflect.Method5Test
error: testGetAnnotations5 java.lang.reflect.Method5Test
error: testGetAnnotationsImmutable java.lang.reflect.Method5Test
error: testIsAnnotationPresent java.lang.reflect.Method5Test
error: testIsAnnotationPresent_Negative java.lang.reflect.Method5Test
error: testGetAnnotation_ByDefault org.apache.harmony.lang.annotation.AllTypesTest
error: testGetAnnotation_NoDefault org.apache.harmony.lang.annotation.AllTypesTest
error: testEquals org.apache.harmony.lang.annotation.AllTypesTest
error: testEquals_ForeignImpl org.apache.harmony.lang.annotation.AllTypesTest
error: testToString org.apache.harmony.lang.annotation.AllTypesTest
error: testAnnotationType org.apache.harmony.lang.annotation.AllTypesTest
error: testAnnotation_ElementError org.apache.harmony.lang.annotation.AllTypesTest
error: testSerialization org.apache.harmony.lang.annotation.AllTypesTest
Unit Test Error Details:	(65)
                
Test: test_9Class: java.lang.ClassAnnotationsTestjava.lang.NullPointerException
	at java.lang.reflect.Proxy.newProxyInstance(Proxy.java:200)
	at org.apache.harmony.lang.annotation.AnnotationFactory.createAnnotation(AnnotationFactory.java:102)
	at org.apache.harmony.vm.VMGenericsAndAnnotations.getDeclaredAnnotations(VMGenericsAndAnnotations.java)
	at java.lang.Class$GACache.getAllAnnotations(Class.java:1338)
	at java.lang.Class.getAnnotations(Class.java:874)
	at java.lang.ClassAnnotationsTest.test_9(ClassAnnotationsTest.java:1851)
	at java.lang.reflect.VMReflection.invokeMethod(VMReflection.java)
	at java.lang.reflect.Method.invoke(Method.java:317)
	at junit.framework.TestCase.runTest(TestCase.java:164)
	at junit.framework.TestCase.runBare(TestCase.java:130)
	at junit.framework.TestResult$1.protect(TestResult.java:106)
	at junit.framework.TestResult.runProtected(TestResult.java:124)
	at junit.framework.TestResult.run(TestResult.java:109)
	at junit.framework.TestCase.run(TestCase.java:120)
	at junit.framework.TestSuite.runTest(TestSuite.java:230)
	at junit.framework.TestSuite.run(TestSuite.java:225)
	at org.apache.tools.ant.taskdefs.optional.junit.JUnitTestRunner.run(JUnitTestRunner.java:297)
	at org.apache.tools.ant.taskdefs.optional.junit.JUnitTestRunner.launch(JUnitTestRunner.java:672)
	at org.apache.tools.ant.taskdefs.optional.junit.JUnitTestRunner.main(JUnitTestRunner.java:546)

Test: test_10Class: java.lang.ClassAnnotationsTestjava.lang.NullPointerException
	at java.lang.reflect.Proxy.newProxyInstance(Proxy.java:200)
	at org.apache.harmony.lang.annotation.AnnotationFactory.createAnnotation(AnnotationFactory.java:102)
	at org.apache.harmony.vm.VMGenericsAndAnnotations.getDeclaredAnnotations(VMGenericsAndAnnotations.java)
	at java.lang.reflect.Method$MethodData.getDeclaredAnnotations(Method.java:425)
	at java.lang.reflect.Method.getDeclaredAnnotations(Method.java:71)
	at java.lang.reflect.AccessibleObject.getAnnotations(AccessibleObject.java:48)
	at java.lang.ClassAnnotationsTest.test_10(ClassAnnotationsTest.java:2027)
	at java.lang.reflect.VMReflection.invokeMethod(VMReflection.java)
	at java.lang.reflect.Method.invoke(Method.java:317)
	at junit.framework.TestCase.runTest(TestCase.java:164)
	at junit.framework.TestCase.runBare(TestCase.java:130)
	at junit.framework.TestResult$1.protect(TestResult.java:106)
	at junit.framework.TestResult.runProtected(TestResult.java:124)
	at junit.framework.TestResult.run(TestResult.java:109)
	at junit.framework.TestCase.run(TestCase.java:120)
	at junit.framework.TestSuite.runTest(TestSuite.java:230)
	at junit.framework.TestSuite.run(TestSuite.java:225)
	at org.apache.tools.ant.taskdefs.optional.junit.JUnitTestRunner.run(JUnitTestRunner.java:297)
	at org.apache.tools.ant.taskdefs.optional.junit.JUnitTestRunner.launch(JUnitTestRunner.java:672)
	at org.apache.tools.ant.taskdefs.optional.junit.JUnitTestRunner.main(JUnitTestRunner.java:546)

Test: test_11Class: java.lang.ClassAnnotationsTestjava.lang.NullPointerException
	at java.lang.reflect.Proxy.newProxyInstance(Proxy.java:200)
	at org.apache.harmony.lang.annotation.AnnotationFactory.createAnnotation(AnnotationFactory.java:102)
	at org.apache.harmony.vm.VMGenericsAndAnnotations.getDeclaredAnnotations(VMGenericsAndAnnotations.java)
	at java.lang.reflect.Method$MethodData.getDeclaredAnnotations(Method.java:425)
	at java.lang.reflect.Method.getDeclaredAnnotations(Method.java:71)
	at java.lang.reflect.AccessibleObject.getAnnotations(AccessibleObject.java:48)
	at java.lang.ClassAnnotationsTest.test_11(ClassAnnotationsTest.java:2300)
	at java.lang.reflect.VMReflection.invokeMethod(VMReflection.java)
	at java.lang.reflect.Method.invoke(Method.java:317)
	at junit.framework.TestCase.runTest(TestCase.java:164)
	at junit.framework.TestCase.runBare(TestCase.java:130)
	at junit.framework.TestResult$1.protect(TestResult.java:106)
	at junit.framework.TestResult.runProtected(TestResult.java:124)
	at junit.framework.TestResult.run(TestResult.java:109)
	at junit.framework.TestCase.run(TestCase.java:120)
	at junit.framework.TestSuite.runTest(TestSuite.java:230)
	at junit.framework.TestSuite.run(TestSuite.java:225)
	at org.apache.tools.ant.taskdefs.optional.junit.JUnitTestRunner.run(JUnitTestRunner.java:297)
	at org.apache.tools.ant.taskdefs.optional.junit.JUnitTestRunner.launch(JUnitTestRunner.java:672)
	at org.apache.tools.ant.taskdefs.optional.junit.JUnitTestRunner.main(JUnitTestRunner.java:546)

Test: testGetAnnotationClass: java.lang.Package5Testjava.lang.NullPointerException
	at java.lang.reflect.Proxy.newProxyInstance(Proxy.java:200)
	at org.apache.harmony.lang.annotation.AnnotationFactory.createAnnotation(AnnotationFactory.java:102)
	at org.apache.harmony.vm.VMGenericsAndAnnotations.getDeclaredAnnotations(VMGenericsAndAnnotations.java)
	at java.lang.Package.getDeclaredAnnotations(Package.java:56)
	at java.lang.Package.getAnnotations(Package.java:65)
	at java.lang.Package.getAnnotation(Package.java:78)
	at org.apache.harmony.lang.AnnotatedElementTestFrame.testGetAnnotation(AnnotatedElementTestFrame.java:114)
	at java.lang.reflect.VMReflection.invokeMethod(VMReflection.java)
	at java.lang.reflect.Method.invoke(Method.java:317)
	at junit.framework.TestCase.runTest(TestCase.java:164)
	at junit.framework.TestCase.runBare(TestCase.java:130)
	at junit.framework.TestResult$1.protect(TestResult.java:106)
	at junit.framework.TestResult.runProtected(TestResult.java:124)
	at junit.framework.TestResult.run(TestResult.java:109)
	at junit.framework.TestCase.run(TestCase.java:120)
	at junit.framework.TestSuite.runTest(TestSuite.java:230)
	at junit.framework.TestSuite.run(TestSuite.java:225)
	at org.apache.tools.ant.taskdefs.optional.junit.JUnitTestRunner.run(JUnitTestRunner.java:297)
	at org.apache.tools.ant.taskdefs.optional.junit.JUnitTestRunner.launch(JUnitTestRunner.java:672)
	at org.apache.tools.ant.taskdefs.optional.junit.JUnitTestRunner.main(JUnitTestRunner.java:546)

Test: testGetAnnotation2Class: java.lang.Package5Testjava.lang.NullPointerException
	at java.lang.reflect.Proxy.newProxyInstance(Proxy.java:200)
	at org.apache.harmony.lang.annotation.AnnotationFactory.createAnnotation(AnnotationFactory.java:102)
	at org.apache.harmony.vm.VMGenericsAndAnnotations.getDeclaredAnnotations(VMGenericsAndAnnotations.java)
	at java.lang.Package.getDeclaredAnnotations(Package.java:56)
	at java.lang.Package.getAnnotations(Package.java:65)
	at java.lang.Package.getAnnotation(Package.java:78)
	at org.apache.harmony.lang.AnnotatedElementTestFrame.testGetAnnotation2(AnnotatedElementTestFrame.java:124)
	at java.lang.reflect.VMReflection.invokeMethod(VMReflection.java)
	at java.lang.reflect.Method.invoke(Method.java:317)
	at junit.framework.TestCase.runTest(TestCase.java:164)
	at junit.framework.TestCase.runBare(TestCase.java:130)
	at junit.framework.TestResult$1.protect(TestResult.java:106)
	at junit.framework.TestResult.runProtected(TestResult.java:124)
	at junit.framework.TestResult.run(TestResult.java:109)
	at junit.framework.TestCase.run(TestCase.java:120)
	at junit.framework.TestSuite.runTest(TestSuite.java:230)
	at junit.framework.TestSuite.run(TestSuite.java:225)
	at org.apache.tools.ant.taskdefs.optional.junit.JUnitTestRunner.run(JUnitTestRunner.java:297)
	at org.apache.tools.ant.taskdefs.optional.junit.JUnitTestRunner.launch(JUnitTestRunner.java:672)
	at org.apache.tools.ant.taskdefs.optional.junit.JUnitTestRunner.main(JUnitTestRunner.java:546)

Test: testGetAnnotation_NegativeClass: java.lang.Package5Testjava.lang.NullPointerException
	at java.lang.reflect.Proxy.newProxyInstance(Proxy.java:200)
	at org.apache.harmony.lang.annotation.AnnotationFactory.createAnnotation(AnnotationFactory.java:102)
	at org.apache.harmony.vm.VMGenericsAndAnnotations.getDeclaredAnnotations(VMGenericsAndAnnotations.java)
	at java.lang.Package.getDeclaredAnnotations(Package.java:56)
	at java.lang.Package.getAnnotations(Package.java:65)
	at java.lang.Package.getAnnotation(Package.java:78)
	at org.apache.harmony.lang.AnnotatedElementTestFrame.testGetAnnotation_Negative(AnnotatedElementTestFrame.java:134)
	at java.lang.reflect.VMReflection.invokeMethod(VMReflection.java)
	at java.lang.reflect.Method.invoke(Method.java:317)
	at junit.framework.TestCase.runTest(TestCase.java:164)
	at junit.framework.TestCase.runBare(TestCase.java:130)
	at junit.framework.TestResult$1.protect(TestResult.java:106)
	at junit.framework.TestResult.runProtected(TestResult.java:124)
	at junit.framework.TestResult.run(TestResult.java:109)
	at junit.framework.TestCase.run(TestCase.java:120)
	at junit.framework.TestSuite.runTest(TestSuite.java:230)
	at junit.framework.TestSuite.run(TestSuite.java:225)
	at org.apache.tools.ant.taskdefs.optional.junit.JUnitTestRunner.run(JUnitTestRunner.java:297)
	at org.apache.tools.ant.taskdefs.optional.junit.JUnitTestRunner.launch(JUnitTestRunner.java:672)
	at org.apache.tools.ant.taskdefs.optional.junit.JUnitTestRunner.main(JUnitTestRunner.java:546)

Test: testGetDeclaredAnnotationsClass: java.lang.Package5Testjava.lang.NullPointerException
	at java.lang.reflect.Proxy.newProxyInstance(Proxy.java:200)
	at org.apache.harmony.lang.annotation.AnnotationFactory.createAnnotation(AnnotationFactory.java:102)
	at org.apache.harmony.vm.VMGenericsAndAnnotations.getDeclaredAnnotations(VMGenericsAndAnnotations.java)
	at java.lang.Package.getDeclaredAnnotations(Package.java:56)
	at org.apache.harmony.lang.AnnotatedElementTestFrame.testGetDeclaredAnnotations(AnnotatedElementTestFrame.java:162)
	at java.lang.reflect.VMReflection.invokeMethod(VMReflection.java)
	at java.lang.reflect.Method.invoke(Method.java:317)
	at junit.framework.TestCase.runTest(TestCase.java:164)
	at junit.framework.TestCase.runBare(TestCase.java:130)
	at junit.framework.TestResult$1.protect(TestResult.java:106)
	at junit.framework.TestResult.runProtected(TestResult.java:124)
	at junit.framework.TestResult.run(TestResult.java:109)
	at junit.framework.TestCase.run(TestCase.java:120)
	at junit.framework.TestSuite.runTest(TestSuite.java:230)
	at junit.framework.TestSuite.run(TestSuite.java:225)
	at org.apache.tools.ant.taskdefs.optional.junit.JUnitTestRunner.run(JUnitTestRunner.java:297)
	at org.apache.tools.ant.taskdefs.optional.junit.JUnitTestRunner.launch(JUnitTestRunner.java:672)
	at org.apache.tools.ant.taskdefs.optional.junit.JUnitTestRunner.main(JUnitTestRunner.java:546)

Test: testGetDeclaredAnnotations2Class: java.lang.Package5Testjava.lang.NullPointerException
	at java.lang.reflect.Proxy.newProxyInstance(Proxy.java:200)
	at org.apache.harmony.lang.annotation.AnnotationFactory.createAnnotation(AnnotationFactory.java:102)
	at org.apache.harmony.vm.VMGenericsAndAnnotations.getDeclaredAnnotations(VMGenericsAndAnnotations.java)
	at java.lang.Package.getDeclaredAnnotations(Package.java:56)
	at org.apache.harmony.lang.AnnotatedElementTestFrame.testGetDeclaredAnnotations2(AnnotatedElementTestFrame.java:173)
	at java.lang.reflect.VMReflection.invokeMethod(VMReflection.java)
	at java.lang.reflect.Method.invoke(Method.java:317)
	at junit.framework.TestCase.runTest(TestCase.java:164)
	at junit.framework.TestCase.runBare(TestCase.java:130)
	at junit.framework.TestResult$1.protect(TestResult.java:106)
	at junit.framework.TestResult.runProtected(TestResult.java:124)
	at junit.framework.TestResult.run(TestResult.java:109)
	at junit.framework.TestCase.run(TestCase.java:120)
	at junit.framework.TestSuite.runTest(TestSuite.java:230)
	at junit.framework.TestSuite.run(TestSuite.java:225)
	at org.apache.tools.ant.taskdefs.optional.junit.JUnitTestRunner.run(JUnitTestRunner.java:297)
	at org.apache.tools.ant.taskdefs.optional.junit.JUnitTestRunner.launch(JUnitTestRunner.java:672)
	at org.apache.tools.ant.taskdefs.optional.junit.JUnitTestRunner.main(JUnitTestRunner.java:546)

Test: testGetDeclaredAnnotationsImmutableClass: java.lang.Package5Testjava.lang.NullPointerException
	at java.lang.reflect.Proxy.newProxyInstance(Proxy.java:200)
	at org.apache.harmony.lang.annotation.AnnotationFactory.createAnnotation(AnnotationFactory.java:102)
	at org.apache.harmony.vm.VMGenericsAndAnnotations.getDeclaredAnnotations(VMGenericsAndAnnotations.java)
	at java.lang.Package.getDeclaredAnnotations(Package.java:56)
	at org.apache.harmony.lang.AnnotatedElementTestFrame.testGetDeclaredAnnotationsImmutable(AnnotatedElementTestFrame.java:198)
	at java.lang.reflect.VMReflection.invokeMethod(VMReflection.java)
	at java.lang.reflect.Method.invoke(Method.java:317)
	at junit.framework.TestCase.runTest(TestCase.java:164)
	at junit.framework.TestCase.runBare(TestCase.java:130)
	at junit.framework.TestResult$1.protect(TestResult.java:106)
	at junit.framework.TestResult.runProtected(TestResult.java:124)
	at junit.framework.TestResult.run(TestResult.java:109)
	at junit.framework.TestCase.run(TestCase.java:120)
	at junit.framework.TestSuite.runTest(TestSuite.java:230)
	at junit.framework.TestSuite.run(TestSuite.java:225)
	at org.apache.tools.ant.taskdefs.optional.junit.JUnitTestRunner.run(JUnitTestRunner.java:297)
	at org.apache.tools.ant.taskdefs.optional.junit.JUnitTestRunner.launch(JUnitTestRunner.java:672)
	at org.apache.tools.ant.taskdefs.optional.junit.JUnitTestRunner.main(JUnitTestRunner.java:546)

Test: testGetAnnotationsClass: java.lang.Package5Testjava.lang.NullPointerException
	at java.lang.reflect.Proxy.newProxyInstance(Proxy.java:200)
	at org.apache.harmony.lang.annotation.AnnotationFactory.createAnnotation(AnnotationFactory.java:102)
	at org.apache.harmony.vm.VMGenericsAndAnnotations.getDeclaredAnnotations(VMGenericsAndAnnotations.java)
	at java.lang.Package.getDeclaredAnnotations(Package.java:56)
	at java.lang.Package.getAnnotations(Package.java:65)
	at org.apache.harmony.lang.AnnotatedElementTestFrame.testGetAnnotations(AnnotatedElementTestFrame.java:215)
	at java.lang.reflect.VMReflection.invokeMethod(VMReflection.java)
	at java.lang.reflect.Method.invoke(Method.java:317)
	at junit.framework.TestCase.runTest(TestCase.java:164)
	at junit.framework.TestCase.runBare(TestCase.java:130)
	at junit.framework.TestResult$1.protect(TestResult.java:106)
	at junit.framework.TestResult.runProtected(TestResult.java:124)
	at junit.framework.TestResult.run(TestResult.java:109)
	at junit.framework.TestCase.run(TestCase.java:120)
	at junit.framework.TestSuite.runTest(TestSuite.java:230)
	at junit.framework.TestSuite.run(TestSuite.java:225)
	at org.apache.tools.ant.taskdefs.optional.junit.JUnitTestRunner.run(JUnitTestRunner.java:297)
	at org.apache.tools.ant.taskdefs.optional.junit.JUnitTestRunner.launch(JUnitTestRunner.java:672)
	at org.apache.tools.ant.taskdefs.optional.junit.JUnitTestRunner.main(JUnitTestRunner.java:546)

Test: testGetAnnotations2Class: java.lang.Package5Testjava.lang.NullPointerException
	at java.lang.reflect.Proxy.newProxyInstance(Proxy.java:200)
	at org.apache.harmony.lang.annotation.AnnotationFactory.createAnnotation(AnnotationFactory.java:102)
	at org.apache.harmony.vm.VMGenericsAndAnnotations.getDeclaredAnnotations(VMGenericsAndAnnotations.java)
	at java.lang.Package.getDeclaredAnnotations(Package.java:56)
	at java.lang.Package.getAnnotations(Package.java:65)
	at org.apache.harmony.lang.AnnotatedElementTestFrame.testGetAnnotations2(AnnotatedElementTestFrame.java:226)
	at java.lang.reflect.VMReflection.invokeMethod(VMReflection.java)
	at java.lang.reflect.Method.invoke(Method.java:317)
	at junit.framework.TestCase.runTest(TestCase.java:164)
	at junit.framework.TestCase.runBare(TestCase.java:130)
	at junit.framework.TestResult$1.protect(TestResult.java:106)
	at junit.framework.TestResult.runProtected(TestResult.java:124)
	at junit.framework.TestResult.run(TestResult.java:109)
	at junit.framework.TestCase.run(TestCase.java:120)
	at junit.framework.TestSuite.runTest(TestSuite.java:230)
	at junit.framework.TestSuite.run(TestSuite.java:225)
	at org.apache.tools.ant.taskdefs.optional.junit.JUnitTestRunner.run(JUnitTestRunner.java:297)
	at org.apache.tools.ant.taskdefs.optional.junit.JUnitTestRunner.launch(JUnitTestRunner.java:672)
	at org.apache.tools.ant.taskdefs.optional.junit.JUnitTestRunner.main(JUnitTestRunner.java:546)

Test: testGetAnnotations5Class: java.lang.Package5Testjava.lang.NullPointerException
	at java.lang.reflect.Proxy.newProxyInstance(Proxy.java:200)
	at org.apache.harmony.lang.annotation.AnnotationFactory.createAnnotation(AnnotationFactory.java:102)
	at org.apache.harmony.vm.VMGenericsAndAnnotations.getDeclaredAnnotations(VMGenericsAndAnnotations.java)
	at java.lang.Package.getDeclaredAnnotations(Package.java:56)
	at java.lang.Package.getAnnotations(Package.java:65)
	at org.apache.harmony.lang.AnnotatedElementTestFrame.testGetAnnotations5(AnnotatedElementTestFrame.java:264)
	at java.lang.reflect.VMReflection.invokeMethod(VMReflection.java)
	at java.lang.reflect.Method.invoke(Method.java:317)
	at junit.framework.TestCase.runTest(TestCase.java:164)
	at junit.framework.TestCase.runBare(TestCase.java:130)
	at junit.framework.TestResult$1.protect(TestResult.java:106)
	at junit.framework.TestResult.runProtected(TestResult.java:124)
	at junit.framework.TestResult.run(TestResult.java:109)
	at junit.framework.TestCase.run(TestCase.java:120)
	at junit.framework.TestSuite.runTest(TestSuite.java:230)
	at junit.framework.TestSuite.run(TestSuite.java:225)
	at org.apache.tools.ant.taskdefs.optional.junit.JUnitTestRunner.run(JUnitTestRunner.java:297)
	at org.apache.tools.ant.taskdefs.optional.junit.JUnitTestRunner.launch(JUnitTestRunner.java:672)
	at org.apache.tools.ant.taskdefs.optional.junit.JUnitTestRunner.main(JUnitTestRunner.java:546)

Test: testGetAnnotationsImmutableClass: java.lang.Package5Testjava.lang.NullPointerException
	at java.lang.reflect.Proxy.newProxyInstance(Proxy.java:200)
	at org.apache.harmony.lang.annotation.AnnotationFactory.createAnnotation(AnnotationFactory.java:102)
	at org.apache.harmony.vm.VMGenericsAndAnnotations.getDeclaredAnnotations(VMGenericsAndAnnotations.java)
	at java.lang.Package.getDeclaredAnnotations(Package.java:56)
	at java.lang.Package.getAnnotations(Package.java:65)
	at org.apache.harmony.lang.AnnotatedElementTestFrame.testGetAnnotationsImmutable(AnnotatedElementTestFrame.java:293)
	at java.lang.reflect.VMReflection.invokeMethod(VMReflection.java)
	at java.lang.reflect.Method.invoke(Method.java:317)
	at junit.framework.TestCase.runTest(TestCase.java:164)
	at junit.framework.TestCase.runBare(TestCase.java:130)
	at junit.framework.TestResult$1.protect(TestResult.java:106)
	at junit.framework.TestResult.runProtected(TestResult.java:124)
	at junit.framework.TestResult.run(TestResult.java:109)
	at junit.framework.TestCase.run(TestCase.java:120)
	at junit.framework.TestSuite.runTest(TestSuite.java:230)
	at junit.framework.TestSuite.run(TestSuite.java:225)
	at org.apache.tools.ant.taskdefs.optional.junit.JUnitTestRunner.run(JUnitTestRunner.java:297)
	at org.apache.tools.ant.taskdefs.optional.junit.JUnitTestRunner.launch(JUnitTestRunner.java:672)
	at org.apache.tools.ant.taskdefs.optional.junit.JUnitTestRunner.main(JUnitTestRunner.java:546)

Test: testIsAnnotationPresentClass: java.lang.Package5Testjava.lang.NullPointerException
	at java.lang.reflect.Proxy.newProxyInstance(Proxy.java:200)
	at org.apache.harmony.lang.annotation.AnnotationFactory.createAnnotation(AnnotationFactory.java:102)
	at org.apache.harmony.vm.VMGenericsAndAnnotations.getDeclaredAnnotations(VMGenericsAndAnnotations.java)
	at java.lang.Package.getDeclaredAnnotations(Package.java:56)
	at java.lang.Package.getAnnotations(Package.java:65)
	at java.lang.Package.getAnnotation(Package.java:78)
	at java.lang.Package.isAnnotationPresent(Package.java:93)
	at org.apache.harmony.lang.AnnotatedElementTestFrame.testIsAnnotationPresent(AnnotatedElementTestFrame.java:310)
	at java.lang.reflect.VMReflection.invokeMethod(VMReflection.java)
	at java.lang.reflect.Method.invoke(Method.java:317)
	at junit.framework.TestCase.runTest(TestCase.java:164)
	at junit.framework.TestCase.runBare(TestCase.java:130)
	at junit.framework.TestResult$1.protect(TestResult.java:106)
	at junit.framework.TestResult.runProtected(TestResult.java:124)
	at junit.framework.TestResult.run(TestResult.java:109)
	at junit.framework.TestCase.run(TestCase.java:120)
	at junit.framework.TestSuite.runTest(TestSuite.java:230)
	at junit.framework.TestSuite.run(TestSuite.java:225)
	at org.apache.tools.ant.taskdefs.optional.junit.JUnitTestRunner.run(JUnitTestRunner.java:297)
	at org.apache.tools.ant.taskdefs.optional.junit.JUnitTestRunner.launch(JUnitTestRunner.java:672)
	at org.apache.tools.ant.taskdefs.optional.junit.JUnitTestRunner.main(JUnitTestRunner.java:546)

Test: testIsAnnotationPresent_NegativeClass: java.lang.Package5Testjava.lang.NullPointerException
	at java.lang.reflect.Proxy.newProxyInstance(Proxy.java:200)
	at org.apache.harmony.lang.annotation.AnnotationFactory.createAnnotation(AnnotationFactory.java:102)
	at org.apache.harmony.vm.VMGenericsAndAnnotations.getDeclaredAnnotations(VMGenericsAndAnnotations.java)
	at java.lang.Package.getDeclaredAnnotations(Package.java:56)
	at java.lang.Package.getAnnotations(Package.java:65)
	at java.lang.Package.getAnnotation(Package.java:78)
	at java.lang.Package.isAnnotationPresent(Package.java:93)
	at org.apache.harmony.lang.AnnotatedElementTestFrame.testIsAnnotationPresent_Negative(AnnotatedElementTestFrame.java:320)
	at java.lang.reflect.VMReflection.invokeMethod(VMReflection.java)
	at java.lang.reflect.Method.invoke(Method.java:317)
	at junit.framework.TestCase.runTest(TestCase.java:164)
	at junit.framework.TestCase.runBare(TestCase.java:130)
	at junit.framework.TestResult$1.protect(TestResult.java:106)
	at junit.framework.TestResult.runProtected(TestResult.java:124)
	at junit.framework.TestResult.run(TestResult.java:109)
	at junit.framework.TestCase.run(TestCase.java:120)
	at junit.framework.TestSuite.runTest(TestSuite.java:230)
	at junit.framework.TestSuite.run(TestSuite.java:225)
	at org.apache.tools.ant.taskdefs.optional.junit.JUnitTestRunner.run(JUnitTestRunner.java:297)
	at org.apache.tools.ant.taskdefs.optional.junit.JUnitTestRunner.launch(JUnitTestRunner.java:672)
	at org.apache.tools.ant.taskdefs.optional.junit.JUnitTestRunner.main(JUnitTestRunner.java:546)

Test: testGetParameterAnnotations2Class: java.lang.reflect.Ctor5Testjava.lang.reflect.InvocationTargetException
	at java.lang.reflect.VMReflection.invokeMethod(VMReflection.java)
	at java.lang.reflect.Method.invoke(Method.java:317)
	at java.lang.reflect.Method5Test.getParamAnnotations(Method5Test.java:81)
	at java.lang.reflect.Method5Test.testGetParameterAnnotations2(Method5Test.java:113)
	at java.lang.reflect.VMReflection.invokeMethod(VMReflection.java)
	at java.lang.reflect.Method.invoke(Method.java:317)
	at junit.framework.TestCase.runTest(TestCase.java:164)
	at junit.framework.TestCase.runBare(TestCase.java:130)
	at junit.framework.TestResult$1.protect(TestResult.java:106)
	at junit.framework.TestResult.runProtected(TestResult.java:124)
	at junit.framework.TestResult.run(TestResult.java:109)
	at junit.framework.TestCase.run(TestCase.java:120)
	at junit.framework.TestSuite.runTest(TestSuite.java:230)
	at junit.framework.TestSuite.run(TestSuite.java:225)
	at org.apache.tools.ant.taskdefs.optional.junit.JUnitTestRunner.run(JUnitTestRunner.java:297)
	at org.apache.tools.ant.taskdefs.optional.junit.JUnitTestRunner.launch(JUnitTestRunner.java:672)
	at org.apache.tools.ant.taskdefs.optional.junit.JUnitTestRunner.main(JUnitTestRunner.java:546)
Caused by: java.lang.NullPointerException
	at java.lang.reflect.Proxy.newProxyInstance(Proxy.java:200)
	at org.apache.harmony.lang.annotation.AnnotationFactory.createAnnotation(AnnotationFactory.java:102)
	at org.apache.harmony.vm.VMGenericsAndAnnotations.getParameterAnnotations(VMGenericsAndAnnotations.java)
	at java.lang.reflect.Constructor$ConstructorData.getParameterAnnotations(Constructor.java:394)
	at java.lang.reflect.Constructor.getParameterAnnotations(Constructor.java:50)
	at java.lang.reflect.VMReflection.invokeMethod(VMReflection.java)
	... 16 more

Test: testGetParameterAnnotations3Class: java.lang.reflect.Ctor5Testjava.lang.reflect.InvocationTargetException
	at java.lang.reflect.VMReflection.invokeMethod(VMReflection.java)
	at java.lang.reflect.Method.invoke(Method.java:317)
	at java.lang.reflect.Method5Test.getParamAnnotations(Method5Test.java:81)
	at java.lang.reflect.Method5Test.testGetParameterAnnotations3(Method5Test.java:140)
	at java.lang.reflect.VMReflection.invokeMethod(VMReflection.java)
	at java.lang.reflect.Method.invoke(Method.java:317)
	at junit.framework.TestCase.runTest(TestCase.java:164)
	at junit.framework.TestCase.runBare(TestCase.java:130)
	at junit.framework.TestResult$1.protect(TestResult.java:106)
	at junit.framework.TestResult.runProtected(TestResult.java:124)
	at junit.framework.TestResult.run(TestResult.java:109)
	at junit.framework.TestCase.run(TestCase.java:120)
	at junit.framework.TestSuite.runTest(TestSuite.java:230)
	at junit.framework.TestSuite.run(TestSuite.java:225)
	at org.apache.tools.ant.taskdefs.optional.junit.JUnitTestRunner.run(JUnitTestRunner.java:297)
	at org.apache.tools.ant.taskdefs.optional.junit.JUnitTestRunner.launch(JUnitTestRunner.java:672)
	at org.apache.tools.ant.taskdefs.optional.junit.JUnitTestRunner.main(JUnitTestRunner.java:546)
Caused by: java.lang.NullPointerException
	at java.lang.reflect.Proxy.newProxyInstance(Proxy.java:200)
	at org.apache.harmony.lang.annotation.AnnotationFactory.createAnnotation(AnnotationFactory.java:102)
	at org.apache.harmony.vm.VMGenericsAndAnnotations.getParameterAnnotations(VMGenericsAndAnnotations.java)
	at java.lang.reflect.Constructor$ConstructorData.getParameterAnnotations(Constructor.java:394)
	at java.lang.reflect.Constructor.getParameterAnnotations(Constructor.java:50)
	at java.lang.reflect.VMReflection.invokeMethod(VMReflection.java)
	... 16 more

Test: testGetParameterAnnotationsImmutableClass: java.lang.reflect.Ctor5Testjava.lang.reflect.InvocationTargetException
	at java.lang.reflect.VMReflection.invokeMethod(VMReflection.java)
	at java.lang.reflect.Method.invoke(Method.java:317)
	at java.lang.reflect.Method5Test.getParamAnnotations(Method5Test.java:81)
	at java.lang.reflect.Method5Test.testGetParameterAnnotationsImmutable(Method5Test.java:157)
	at java.lang.reflect.VMReflection.invokeMethod(VMReflection.java)
	at java.lang.reflect.Method.invoke(Method.java:317)
	at junit.framework.TestCase.runTest(TestCase.java:164)
	at junit.framework.TestCase.runBare(TestCase.java:130)
	at junit.framework.TestResult$1.protect(TestResult.java:106)
	at junit.framework.TestResult.runProtected(TestResult.java:124)
	at junit.framework.TestResult.run(TestResult.java:109)
	at junit.framework.TestCase.run(TestCase.java:120)
	at junit.framework.TestSuite.runTest(TestSuite.java:230)
	at junit.framework.TestSuite.run(TestSuite.java:225)
	at org.apache.tools.ant.taskdefs.optional.junit.JUnitTestRunner.run(JUnitTestRunner.java:297)
	at org.apache.tools.ant.taskdefs.optional.junit.JUnitTestRunner.launch(JUnitTestRunner.java:672)
	at org.apache.tools.ant.taskdefs.optional.junit.JUnitTestRunner.main(JUnitTestRunner.java:546)
Caused by: java.lang.NullPointerException
	at java.lang.reflect.Proxy.newProxyInstance(Proxy.java:200)
	at org.apache.harmony.lang.annotation.AnnotationFactory.createAnnotation(AnnotationFactory.java:102)
	at org.apache.harmony.vm.VMGenericsAndAnnotations.getParameterAnnotations(VMGenericsAndAnnotations.java)
	at java.lang.reflect.Constructor$ConstructorData.getParameterAnnotations(Constructor.java:394)
	at java.lang.reflect.Constructor.getParameterAnnotations(Constructor.java:50)
	at java.lang.reflect.VMReflection.invokeMethod(VMReflection.java)
	... 16 more

Test: testGetAnnotationClass: java.lang.reflect.Ctor5Testjava.lang.NullPointerException
	at java.lang.reflect.Proxy.newProxyInstance(Proxy.java:200)
	at org.apache.harmony.lang.annotation.AnnotationFactory.createAnnotation(AnnotationFactory.java:102)
	at org.apache.harmony.vm.VMGenericsAndAnnotations.getDeclaredAnnotations(VMGenericsAndAnnotations.java)
	at java.lang.reflect.Constructor$ConstructorData.getDeclaredAnnotations(Constructor.java:376)
	at java.lang.reflect.Constructor.getAnnotation(Constructor.java:77)
	at org.apache.harmony.lang.AnnotatedElementTestFrame.testGetAnnotation(AnnotatedElementTestFrame.java:114)
	at java.lang.reflect.VMReflection.invokeMethod(VMReflection.java)
	at java.lang.reflect.Method.invoke(Method.java:317)
	at junit.framework.TestCase.runTest(TestCase.java:164)
	at junit.framework.TestCase.runBare(TestCase.java:130)
	at junit.framework.TestResult$1.protect(TestResult.java:106)
	at junit.framework.TestResult.runProtected(TestResult.java:124)
	at junit.framework.TestResult.run(TestResult.java:109)
	at junit.framework.TestCase.run(TestCase.java:120)
	at junit.framework.TestSuite.runTest(TestSuite.java:230)
	at junit.framework.TestSuite.run(TestSuite.java:225)
	at org.apache.tools.ant.taskdefs.optional.junit.JUnitTestRunner.run(JUnitTestRunner.java:297)
	at org.apache.tools.ant.taskdefs.optional.junit.JUnitTestRunner.launch(JUnitTestRunner.java:672)
	at org.apache.tools.ant.taskdefs.optional.junit.JUnitTestRunner.main(JUnitTestRunner.java:546)

Test: testGetAnnotation2Class: java.lang.reflect.Ctor5Testjava.lang.NullPointerException
	at java.lang.reflect.Proxy.newProxyInstance(Proxy.java:200)
	at org.apache.harmony.lang.annotation.AnnotationFactory.createAnnotation(AnnotationFactory.java:102)
	at org.apache.harmony.vm.VMGenericsAndAnnotations.getDeclaredAnnotations(VMGenericsAndAnnotations.java)
	at java.lang.reflect.Constructor$ConstructorData.getDeclaredAnnotations(Constructor.java:376)
	at java.lang.reflect.Constructor.getAnnotation(Constructor.java:77)
	at org.apache.harmony.lang.AnnotatedElementTestFrame.testGetAnnotation2(AnnotatedElementTestFrame.java:124)
	at java.lang.reflect.VMReflection.invokeMethod(VMReflection.java)
	at java.lang.reflect.Method.invoke(Method.java:317)
	at junit.framework.TestCase.runTest(TestCase.java:164)
	at junit.framework.TestCase.runBare(TestCase.java:130)
	at junit.framework.TestResult$1.protect(TestResult.java:106)
	at junit.framework.TestResult.runProtected(TestResult.java:124)
	at junit.framework.TestResult.run(TestResult.java:109)
	at junit.framework.TestCase.run(TestCase.java:120)
	at junit.framework.TestSuite.runTest(TestSuite.java:230)
	at junit.framework.TestSuite.run(TestSuite.java:225)
	at org.apache.tools.ant.taskdefs.optional.junit.JUnitTestRunner.run(JUnitTestRunner.java:297)
	at org.apache.tools.ant.taskdefs.optional.junit.JUnitTestRunner.launch(JUnitTestRunner.java:672)
	at org.apache.tools.ant.taskdefs.optional.junit.JUnitTestRunner.main(JUnitTestRunner.java:546)

Test: testGetAnnotation_NegativeClass: java.lang.reflect.Ctor5Testjava.lang.NullPointerException
	at java.lang.reflect.Proxy.newProxyInstance(Proxy.java:200)
	at org.apache.harmony.lang.annotation.AnnotationFactory.createAnnotation(AnnotationFactory.java:102)
	at org.apache.harmony.vm.VMGenericsAndAnnotations.getDeclaredAnnotations(VMGenericsAndAnnotations.java)
	at java.lang.reflect.Constructor$ConstructorData.getDeclaredAnnotations(Constructor.java:376)
	at java.lang.reflect.Constructor.getAnnotation(Constructor.java:77)
	at org.apache.harmony.lang.AnnotatedElementTestFrame.testGetAnnotation_Negative(AnnotatedElementTestFrame.java:134)
	at java.lang.reflect.VMReflection.invokeMethod(VMReflection.java)
	at java.lang.reflect.Method.invoke(Method.java:317)
	at junit.framework.TestCase.runTest(TestCase.java:164)
	at junit.framework.TestCase.runBare(TestCase.java:130)
	at junit.framework.TestResult$1.protect(TestResult.java:106)
	at junit.framework.TestResult.runProtected(TestResult.java:124)
	at junit.framework.TestResult.run(TestResult.java:109)
	at junit.framework.TestCase.run(TestCase.java:120)
	at junit.framework.TestSuite.runTest(TestSuite.java:230)
	at junit.framework.TestSuite.run(TestSuite.java:225)
	at org.apache.tools.ant.taskdefs.optional.junit.JUnitTestRunner.run(JUnitTestRunner.java:297)
	at org.apache.tools.ant.taskdefs.optional.junit.JUnitTestRunner.launch(JUnitTestRunner.java:672)
	at org.apache.tools.ant.taskdefs.optional.junit.JUnitTestRunner.main(JUnitTestRunner.java:546)

Test: testGetDeclaredAnnotationsClass: java.lang.reflect.Ctor5Testjava.lang.NullPointerException
	at java.lang.reflect.Proxy.newProxyInstance(Proxy.java:200)
	at org.apache.harmony.lang.annotation.AnnotationFactory.createAnnotation(AnnotationFactory.java:102)
	at org.apache.harmony.vm.VMGenericsAndAnnotations.getDeclaredAnnotations(VMGenericsAndAnnotations.java)
	at java.lang.reflect.Constructor$ConstructorData.getDeclaredAnnotations(Constructor.java:376)
	at java.lang.reflect.Constructor.getDeclaredAnnotations(Constructor.java:63)
	at org.apache.harmony.lang.AnnotatedElementTestFrame.testGetDeclaredAnnotations(AnnotatedElementTestFrame.java:162)
	at java.lang.reflect.VMReflection.invokeMethod(VMReflection.java)
	at java.lang.reflect.Method.invoke(Method.java:317)
	at junit.framework.TestCase.runTest(TestCase.java:164)
	at junit.framework.TestCase.runBare(TestCase.java:130)
	at junit.framework.TestResult$1.protect(TestResult.java:106)
	at junit.framework.TestResult.runProtected(TestResult.java:124)
	at junit.framework.TestResult.run(TestResult.java:109)
	at junit.framework.TestCase.run(TestCase.java:120)
	at junit.framework.TestSuite.runTest(TestSuite.java:230)
	at junit.framework.TestSuite.run(TestSuite.java:225)
	at org.apache.tools.ant.taskdefs.optional.junit.JUnitTestRunner.run(JUnitTestRunner.java:297)
	at org.apache.tools.ant.taskdefs.optional.junit.JUnitTestRunner.launch(JUnitTestRunner.java:672)
	at org.apache.tools.ant.taskdefs.optional.junit.JUnitTestRunner.main(JUnitTestRunner.java:546)

Test: testGetDeclaredAnnotations2Class: java.lang.reflect.Ctor5Testjava.lang.NullPointerException
	at java.lang.reflect.Proxy.newProxyInstance(Proxy.java:200)
	at org.apache.harmony.lang.annotation.AnnotationFactory.createAnnotation(AnnotationFactory.java:102)
	at org.apache.harmony.vm.VMGenericsAndAnnotations.getDeclaredAnnotations(VMGenericsAndAnnotations.java)
	at java.lang.reflect.Constructor$ConstructorData.getDeclaredAnnotations(Constructor.java:376)
	at java.lang.reflect.Constructor.getDeclaredAnnotations(Constructor.java:63)
	at org.apache.harmony.lang.AnnotatedElementTestFrame.testGetDeclaredAnnotations2(AnnotatedElementTestFrame.java:173)
	at java.lang.reflect.VMReflection.invokeMethod(VMReflection.java)
	at java.lang.reflect.Method.invoke(Method.java:317)
	at junit.framework.TestCase.runTest(TestCase.java:164)
	at junit.framework.TestCase.runBare(TestCase.java:130)
	at junit.framework.TestResult$1.protect(TestResult.java:106)
	at junit.framework.TestResult.runProtected(TestResult.java:124)
	at junit.framework.TestResult.run(TestResult.java:109)
	at junit.framework.TestCase.run(TestCase.java:120)
	at junit.framework.TestSuite.runTest(TestSuite.java:230)
	at junit.framework.TestSuite.run(TestSuite.java:225)
	at org.apache.tools.ant.taskdefs.optional.junit.JUnitTestRunner.run(JUnitTestRunner.java:297)
	at org.apache.tools.ant.taskdefs.optional.junit.JUnitTestRunner.launch(JUnitTestRunner.java:672)
	at org.apache.tools.ant.taskdefs.optional.junit.JUnitTestRunner.main(JUnitTestRunner.java:546)

Test: testGetDeclaredAnnotationsImmutableClass: java.lang.reflect.Ctor5Testjava.lang.NullPointerException
	at java.lang.reflect.Proxy.newProxyInstance(Proxy.java:200)
	at org.apache.harmony.lang.annotation.AnnotationFactory.createAnnotation(AnnotationFactory.java:102)
	at org.apache.harmony.vm.VMGenericsAndAnnotations.getDeclaredAnnotations(VMGenericsAndAnnotations.java)
	at java.lang.reflect.Constructor$ConstructorData.getDeclaredAnnotations(Constructor.java:376)
	at java.lang.reflect.Constructor.getDeclaredAnnotations(Constructor.java:63)
	at org.apache.harmony.lang.AnnotatedElementTestFrame.testGetDeclaredAnnotationsImmutable(AnnotatedElementTestFrame.java:198)
	at java.lang.reflect.VMReflection.invokeMethod(VMReflection.java)
	at java.lang.reflect.Method.invoke(Method.java:317)
	at junit.framework.TestCase.runTest(TestCase.java:164)
	at junit.framework.TestCase.runBare(TestCase.java:130)
	at junit.framework.TestResult$1.protect(TestResult.java:106)
	at junit.framework.TestResult.runProtected(TestResult.java:124)
	at junit.framework.TestResult.run(TestResult.java:109)
	at junit.framework.TestCase.run(TestCase.java:120)
	at junit.framework.TestSuite.runTest(TestSuite.java:230)
	at junit.framework.TestSuite.run(TestSuite.java:225)
	at org.apache.tools.ant.taskdefs.optional.junit.JUnitTestRunner.run(JUnitTestRunner.java:297)
	at org.apache.tools.ant.taskdefs.optional.junit.JUnitTestRunner.launch(JUnitTestRunner.java:672)
	at org.apache.tools.ant.taskdefs.optional.junit.JUnitTestRunner.main(JUnitTestRunner.java:546)

Test: testGetAnnotationsClass: java.lang.reflect.Ctor5Testjava.lang.NullPointerException
	at java.lang.reflect.Proxy.newProxyInstance(Proxy.java:200)
	at org.apache.harmony.lang.annotation.AnnotationFactory.createAnnotation(AnnotationFactory.java:102)
	at org.apache.harmony.vm.VMGenericsAndAnnotations.getDeclaredAnnotations(VMGenericsAndAnnotations.java)
	at java.lang.reflect.Constructor$ConstructorData.getDeclaredAnnotations(Constructor.java:376)
	at java.lang.reflect.Constructor.getDeclaredAnnotations(Constructor.java:63)
	at java.lang.reflect.AccessibleObject.getAnnotations(AccessibleObject.java:48)
	at org.apache.harmony.lang.AnnotatedElementTestFrame.testGetAnnotations(AnnotatedElementTestFrame.java:215)
	at java.lang.reflect.VMReflection.invokeMethod(VMReflection.java)
	at java.lang.reflect.Method.invoke(Method.java:317)
	at junit.framework.TestCase.runTest(TestCase.java:164)
	at junit.framework.TestCase.runBare(TestCase.java:130)
	at junit.framework.TestResult$1.protect(TestResult.java:106)
	at junit.framework.TestResult.runProtected(TestResult.java:124)
	at junit.framework.TestResult.run(TestResult.java:109)
	at junit.framework.TestCase.run(TestCase.java:120)
	at junit.framework.TestSuite.runTest(TestSuite.java:230)
	at junit.framework.TestSuite.run(TestSuite.java:225)
	at org.apache.tools.ant.taskdefs.optional.junit.JUnitTestRunner.run(JUnitTestRunner.java:297)
	at org.apache.tools.ant.taskdefs.optional.junit.JUnitTestRunner.launch(JUnitTestRunner.java:672)
	at org.apache.tools.ant.taskdefs.optional.junit.JUnitTestRunner.main(JUnitTestRunner.java:546)

Test: testGetAnnotations2Class: java.lang.reflect.Ctor5Testjava.lang.NullPointerException
	at java.lang.reflect.Proxy.newProxyInstance(Proxy.java:200)
	at org.apache.harmony.lang.annotation.AnnotationFactory.createAnnotation(AnnotationFactory.java:102)
	at org.apache.harmony.vm.VMGenericsAndAnnotations.getDeclaredAnnotations(VMGenericsAndAnnotations.java)
	at java.lang.reflect.Constructor$ConstructorData.getDeclaredAnnotations(Constructor.java:376)
	at java.lang.reflect.Constructor.getDeclaredAnnotations(Constructor.java:63)
	at java.lang.reflect.AccessibleObject.getAnnotations(AccessibleObject.java:48)
	at org.apache.harmony.lang.AnnotatedElementTestFrame.testGetAnnotations2(AnnotatedElementTestFrame.java:226)
	at java.lang.reflect.VMReflection.invokeMethod(VMReflection.java)
	at java.lang.reflect.Method.invoke(Method.java:317)
	at junit.framework.TestCase.runTest(TestCase.java:164)
	at junit.framework.TestCase.runBare(TestCase.java:130)
	at junit.framework.TestResult$1.protect(TestResult.java:106)
	at junit.framework.TestResult.runProtected(TestResult.java:124)
	at junit.framework.TestResult.run(TestResult.java:109)
	at junit.framework.TestCase.run(TestCase.java:120)
	at junit.framework.TestSuite.runTest(TestSuite.java:230)
	at junit.framework.TestSuite.run(TestSuite.java:225)
	at org.apache.tools.ant.taskdefs.optional.junit.JUnitTestRunner.run(JUnitTestRunner.java:297)
	at org.apache.tools.ant.taskdefs.optional.junit.JUnitTestRunner.launch(JUnitTestRunner.java:672)
	at org.apache.tools.ant.taskdefs.optional.junit.JUnitTestRunner.main(JUnitTestRunner.java:546)

Test: testGetAnnotations5Class: java.lang.reflect.Ctor5Testjava.lang.NullPointerException
	at java.lang.reflect.Proxy.newProxyInstance(Proxy.java:200)
	at org.apache.harmony.lang.annotation.AnnotationFactory.createAnnotation(AnnotationFactory.java:102)
	at org.apache.harmony.vm.VMGenericsAndAnnotations.getDeclaredAnnotations(VMGenericsAndAnnotations.java)
	at java.lang.reflect.Constructor$ConstructorData.getDeclaredAnnotations(Constructor.java:376)
	at java.lang.reflect.Constructor.getDeclaredAnnotations(Constructor.java:63)
	at java.lang.reflect.AccessibleObject.getAnnotations(AccessibleObject.java:48)
	at org.apache.harmony.lang.AnnotatedElementTestFrame.testGetAnnotations5(AnnotatedElementTestFrame.java:264)
	at java.lang.reflect.VMReflection.invokeMethod(VMReflection.java)
	at java.lang.reflect.Method.invoke(Method.java:317)
	at junit.framework.TestCase.runTest(TestCase.java:164)
	at junit.framework.TestCase.runBare(TestCase.java:130)
	at junit.framework.TestResult$1.protect(TestResult.java:106)
	at junit.framework.TestResult.runProtected(TestResult.java:124)
	at junit.framework.TestResult.run(TestResult.java:109)
	at junit.framework.TestCase.run(TestCase.java:120)
	at junit.framework.TestSuite.runTest(TestSuite.java:230)
	at junit.framework.TestSuite.run(TestSuite.java:225)
	at org.apache.tools.ant.taskdefs.optional.junit.JUnitTestRunner.run(JUnitTestRunner.java:297)
	at org.apache.tools.ant.taskdefs.optional.junit.JUnitTestRunner.launch(JUnitTestRunner.java:672)
	at org.apache.tools.ant.taskdefs.optional.junit.JUnitTestRunner.main(JUnitTestRunner.java:546)

Test: testGetAnnotationsImmutableClass: java.lang.reflect.Ctor5Testjava.lang.NullPointerException
	at java.lang.reflect.Proxy.newProxyInstance(Proxy.java:200)
	at org.apache.harmony.lang.annotation.AnnotationFactory.createAnnotation(AnnotationFactory.java:102)
	at org.apache.harmony.vm.VMGenericsAndAnnotations.getDeclaredAnnotations(VMGenericsAndAnnotations.java)
	at java.lang.reflect.Constructor$ConstructorData.getDeclaredAnnotations(Constructor.java:376)
	at java.lang.reflect.Constructor.getDeclaredAnnotations(Constructor.java:63)
	at java.lang.reflect.AccessibleObject.getAnnotations(AccessibleObject.java:48)
	at org.apache.harmony.lang.AnnotatedElementTestFrame.testGetAnnotationsImmutable(AnnotatedElementTestFrame.java:293)
	at java.lang.reflect.VMReflection.invokeMethod(VMReflection.java)
	at java.lang.reflect.Method.invoke(Method.java:317)
	at junit.framework.TestCase.runTest(TestCase.java:164)
	at junit.framework.TestCase.runBare(TestCase.java:130)
	at junit.framework.TestResult$1.protect(TestResult.java:106)
	at junit.framework.TestResult.runProtected(TestResult.java:124)
	at junit.framework.TestResult.run(TestResult.java:109)
	at junit.framework.TestCase.run(TestCase.java:120)
	at junit.framework.TestSuite.runTest(TestSuite.java:230)
	at junit.framework.TestSuite.run(TestSuite.java:225)
	at org.apache.tools.ant.taskdefs.optional.junit.JUnitTestRunner.run(JUnitTestRunner.java:297)
	at org.apache.tools.ant.taskdefs.optional.junit.JUnitTestRunner.launch(JUnitTestRunner.java:672)
	at org.apache.tools.ant.taskdefs.optional.junit.JUnitTestRunner.main(JUnitTestRunner.java:546)

Test: testIsAnnotationPresentClass: java.lang.reflect.Ctor5Testjava.lang.NullPointerException
	at java.lang.reflect.Proxy.newProxyInstance(Proxy.java:200)
	at org.apache.harmony.lang.annotation.AnnotationFactory.createAnnotation(AnnotationFactory.java:102)
	at org.apache.harmony.vm.VMGenericsAndAnnotations.getDeclaredAnnotations(VMGenericsAndAnnotations.java)
	at java.lang.reflect.Constructor$ConstructorData.getDeclaredAnnotations(Constructor.java:376)
	at java.lang.reflect.Constructor.getAnnotation(Constructor.java:77)
	at java.lang.reflect.AccessibleObject.isAnnotationPresent(AccessibleObject.java:39)
	at org.apache.harmony.lang.AnnotatedElementTestFrame.testIsAnnotationPresent(AnnotatedElementTestFrame.java:310)
	at java.lang.reflect.VMReflection.invokeMethod(VMReflection.java)
	at java.lang.reflect.Method.invoke(Method.java:317)
	at junit.framework.TestCase.runTest(TestCase.java:164)
	at junit.framework.TestCase.runBare(TestCase.java:130)
	at junit.framework.TestResult$1.protect(TestResult.java:106)
	at junit.framework.TestResult.runProtected(TestResult.java:124)
	at junit.framework.TestResult.run(TestResult.java:109)
	at junit.framework.TestCase.run(TestCase.java:120)
	at junit.framework.TestSuite.runTest(TestSuite.java:230)
	at junit.framework.TestSuite.run(TestSuite.java:225)
	at org.apache.tools.ant.taskdefs.optional.junit.JUnitTestRunner.run(JUnitTestRunner.java:297)
	at org.apache.tools.ant.taskdefs.optional.junit.JUnitTestRunner.launch(JUnitTestRunner.java:672)
	at org.apache.tools.ant.taskdefs.optional.junit.JUnitTestRunner.main(JUnitTestRunner.java:546)

Test: testIsAnnotationPresent_NegativeClass: java.lang.reflect.Ctor5Testjava.lang.NullPointerException
	at java.lang.reflect.Proxy.newProxyInstance(Proxy.java:200)
	at org.apache.harmony.lang.annotation.AnnotationFactory.createAnnotation(AnnotationFactory.java:102)
	at org.apache.harmony.vm.VMGenericsAndAnnotations.getDeclaredAnnotations(VMGenericsAndAnnotations.java)
	at java.lang.reflect.Constructor$ConstructorData.getDeclaredAnnotations(Constructor.java:376)
	at java.lang.reflect.Constructor.getAnnotation(Constructor.java:77)
	at java.lang.reflect.AccessibleObject.isAnnotationPresent(AccessibleObject.java:39)
	at org.apache.harmony.lang.AnnotatedElementTestFrame.testIsAnnotationPresent_Negative(AnnotatedElementTestFrame.java:320)
	at java.lang.reflect.VMReflection.invokeMethod(VMReflection.java)
	at java.lang.reflect.Method.invoke(Method.java:317)
	at junit.framework.TestCase.runTest(TestCase.java:164)
	at junit.framework.TestCase.runBare(TestCase.java:130)
	at junit.framework.TestResult$1.protect(TestResult.java:106)
	at junit.framework.TestResult.runProtected(TestResult.java:124)
	at junit.framework.TestResult.run(TestResult.java:109)
	at junit.framework.TestCase.run(TestCase.java:120)
	at junit.framework.TestSuite.runTest(TestSuite.java:230)
	at junit.framework.TestSuite.run(TestSuite.java:225)
	at org.apache.tools.ant.taskdefs.optional.junit.JUnitTestRunner.run(JUnitTestRunner.java:297)
	at org.apache.tools.ant.taskdefs.optional.junit.JUnitTestRunner.launch(JUnitTestRunner.java:672)
	at org.apache.tools.ant.taskdefs.optional.junit.JUnitTestRunner.main(JUnitTestRunner.java:546)

Test: testGetAnnotationClass: java.lang.reflect.Field5Testjava.lang.NullPointerException
	at java.lang.reflect.Proxy.newProxyInstance(Proxy.java:200)
	at org.apache.harmony.lang.annotation.AnnotationFactory.createAnnotation(AnnotationFactory.java:102)
	at org.apache.harmony.vm.VMGenericsAndAnnotations.getDeclaredAnnotations(VMGenericsAndAnnotations.java)
	at java.lang.reflect.Field$FieldData.getAnnotations(Field.java:457)
	at java.lang.reflect.Field.getAnnotation(Field.java:56)
	at org.apache.harmony.lang.AnnotatedElementTestFrame.testGetAnnotation(AnnotatedElementTestFrame.java:114)
	at java.lang.reflect.VMReflection.invokeMethod(VMReflection.java)
	at java.lang.reflect.Method.invoke(Method.java:317)
	at junit.framework.TestCase.runTest(TestCase.java:164)
	at junit.framework.TestCase.runBare(TestCase.java:130)
	at junit.framework.TestResult$1.protect(TestResult.java:106)
	at junit.framework.TestResult.runProtected(TestResult.java:124)
	at junit.framework.TestResult.run(TestResult.java:109)
	at junit.framework.TestCase.run(TestCase.java:120)
	at junit.framework.TestSuite.runTest(TestSuite.java:230)
	at junit.framework.TestSuite.run(TestSuite.java:225)
	at org.apache.tools.ant.taskdefs.optional.junit.JUnitTestRunner.run(JUnitTestRunner.java:297)
	at org.apache.tools.ant.taskdefs.optional.junit.JUnitTestRunner.launch(JUnitTestRunner.java:672)
	at org.apache.tools.ant.taskdefs.optional.junit.JUnitTestRunner.main(JUnitTestRunner.java:546)

Test: testGetAnnotation2Class: java.lang.reflect.Field5Testjava.lang.NullPointerException
	at java.lang.reflect.Proxy.newProxyInstance(Proxy.java:200)
	at org.apache.harmony.lang.annotation.AnnotationFactory.createAnnotation(AnnotationFactory.java:102)
	at org.apache.harmony.vm.VMGenericsAndAnnotations.getDeclaredAnnotations(VMGenericsAndAnnotations.java)
	at java.lang.reflect.Field$FieldData.getAnnotations(Field.java:457)
	at java.lang.reflect.Field.getAnnotation(Field.java:56)
	at org.apache.harmony.lang.AnnotatedElementTestFrame.testGetAnnotation2(AnnotatedElementTestFrame.java:124)
	at java.lang.reflect.VMReflection.invokeMethod(VMReflection.java)
	at java.lang.reflect.Method.invoke(Method.java:317)
	at junit.framework.TestCase.runTest(TestCase.java:164)
	at junit.framework.TestCase.runBare(TestCase.java:130)
	at junit.framework.TestResult$1.protect(TestResult.java:106)
	at junit.framework.TestResult.runProtected(TestResult.java:124)
	at junit.framework.TestResult.run(TestResult.java:109)
	at junit.framework.TestCase.run(TestCase.java:120)
	at junit.framework.TestSuite.runTest(TestSuite.java:230)
	at junit.framework.TestSuite.run(TestSuite.java:225)
	at org.apache.tools.ant.taskdefs.optional.junit.JUnitTestRunner.run(JUnitTestRunner.java:297)
	at org.apache.tools.ant.taskdefs.optional.junit.JUnitTestRunner.launch(JUnitTestRunner.java:672)
	at org.apache.tools.ant.taskdefs.optional.junit.JUnitTestRunner.main(JUnitTestRunner.java:546)

Test: testGetAnnotation_NegativeClass: java.lang.reflect.Field5Testjava.lang.NullPointerException
	at java.lang.reflect.Proxy.newProxyInstance(Proxy.java:200)
	at org.apache.harmony.lang.annotation.AnnotationFactory.createAnnotation(AnnotationFactory.java:102)
	at org.apache.harmony.vm.VMGenericsAndAnnotations.getDeclaredAnnotations(VMGenericsAndAnnotations.java)
	at java.lang.reflect.Field$FieldData.getAnnotations(Field.java:457)
	at java.lang.reflect.Field.getAnnotation(Field.java:56)
	at org.apache.harmony.lang.AnnotatedElementTestFrame.testGetAnnotation_Negative(AnnotatedElementTestFrame.java:134)
	at java.lang.reflect.VMReflection.invokeMethod(VMReflection.java)
	at java.lang.reflect.Method.invoke(Method.java:317)
	at junit.framework.TestCase.runTest(TestCase.java:164)
	at junit.framework.TestCase.runBare(TestCase.java:130)
	at junit.framework.TestResult$1.protect(TestResult.java:106)
	at junit.framework.TestResult.runProtected(TestResult.java:124)
	at junit.framework.TestResult.run(TestResult.java:109)
	at junit.framework.TestCase.run(TestCase.java:120)
	at junit.framework.TestSuite.runTest(TestSuite.java:230)
	at junit.framework.TestSuite.run(TestSuite.java:225)
	at org.apache.tools.ant.taskdefs.optional.junit.JUnitTestRunner.run(JUnitTestRunner.java:297)
	at org.apache.tools.ant.taskdefs.optional.junit.JUnitTestRunner.launch(JUnitTestRunner.java:672)
	at org.apache.tools.ant.taskdefs.optional.junit.JUnitTestRunner.main(JUnitTestRunner.java:546)

Test: testGetDeclaredAnnotationsClass: java.lang.reflect.Field5Testjava.lang.NullPointerException
	at java.lang.reflect.Proxy.newProxyInstance(Proxy.java:200)
	at org.apache.harmony.lang.annotation.AnnotationFactory.createAnnotation(AnnotationFactory.java:102)
	at org.apache.harmony.vm.VMGenericsAndAnnotations.getDeclaredAnnotations(VMGenericsAndAnnotations.java)
	at java.lang.reflect.Field$FieldData.getAnnotations(Field.java:457)
	at java.lang.reflect.Field.getDeclaredAnnotations(Field.java:42)
	at org.apache.harmony.lang.AnnotatedElementTestFrame.testGetDeclaredAnnotations(AnnotatedElementTestFrame.java:162)
	at java.lang.reflect.VMReflection.invokeMethod(VMReflection.java)
	at java.lang.reflect.Method.invoke(Method.java:317)
	at junit.framework.TestCase.runTest(TestCase.java:164)
	at junit.framework.TestCase.runBare(TestCase.java:130)
	at junit.framework.TestResult$1.protect(TestResult.java:106)
	at junit.framework.TestResult.runProtected(TestResult.java:124)
	at junit.framework.TestResult.run(TestResult.java:109)
	at junit.framework.TestCase.run(TestCase.java:120)
	at junit.framework.TestSuite.runTest(TestSuite.java:230)
	at junit.framework.TestSuite.run(TestSuite.java:225)
	at org.apache.tools.ant.taskdefs.optional.junit.JUnitTestRunner.run(JUnitTestRunner.java:297)
	at org.apache.tools.ant.taskdefs.optional.junit.JUnitTestRunner.launch(JUnitTestRunner.java:672)
	at org.apache.tools.ant.taskdefs.optional.junit.JUnitTestRunner.main(JUnitTestRunner.java:546)

Test: testGetDeclaredAnnotations2Class: java.lang.reflect.Field5Testjava.lang.NullPointerException
	at java.lang.reflect.Proxy.newProxyInstance(Proxy.java:200)
	at org.apache.harmony.lang.annotation.AnnotationFactory.createAnnotation(AnnotationFactory.java:102)
	at org.apache.harmony.vm.VMGenericsAndAnnotations.getDeclaredAnnotations(VMGenericsAndAnnotations.java)
	at java.lang.reflect.Field$FieldData.getAnnotations(Field.java:457)
	at java.lang.reflect.Field.getDeclaredAnnotations(Field.java:42)
	at org.apache.harmony.lang.AnnotatedElementTestFrame.testGetDeclaredAnnotations2(AnnotatedElementTestFrame.java:173)
	at java.lang.reflect.VMReflection.invokeMethod(VMReflection.java)
	at java.lang.reflect.Method.invoke(Method.java:317)
	at junit.framework.TestCase.runTest(TestCase.java:164)
	at junit.framework.TestCase.runBare(TestCase.java:130)
	at junit.framework.TestResult$1.protect(TestResult.java:106)
	at junit.framework.TestResult.runProtected(TestResult.java:124)
	at junit.framework.TestResult.run(TestResult.java:109)
	at junit.framework.TestCase.run(TestCase.java:120)
	at junit.framework.TestSuite.runTest(TestSuite.java:230)
	at junit.framework.TestSuite.run(TestSuite.java:225)
	at org.apache.tools.ant.taskdefs.optional.junit.JUnitTestRunner.run(JUnitTestRunner.java:297)
	at org.apache.tools.ant.taskdefs.optional.junit.JUnitTestRunner.launch(JUnitTestRunner.java:672)
	at org.apache.tools.ant.taskdefs.optional.junit.JUnitTestRunner.main(JUnitTestRunner.java:546)

Test: testGetDeclaredAnnotationsImmutableClass: java.lang.reflect.Field5Testjava.lang.NullPointerException
	at java.lang.reflect.Proxy.newProxyInstance(Proxy.java:200)
	at org.apache.harmony.lang.annotation.AnnotationFactory.createAnnotation(AnnotationFactory.java:102)
	at org.apache.harmony.vm.VMGenericsAndAnnotations.getDeclaredAnnotations(VMGenericsAndAnnotations.java)
	at java.lang.reflect.Field$FieldData.getAnnotations(Field.java:457)
	at java.lang.reflect.Field.getDeclaredAnnotations(Field.java:42)
	at org.apache.harmony.lang.AnnotatedElementTestFrame.testGetDeclaredAnnotationsImmutable(AnnotatedElementTestFrame.java:198)
	at java.lang.reflect.VMReflection.invokeMethod(VMReflection.java)
	at java.lang.reflect.Method.invoke(Method.java:317)
	at junit.framework.TestCase.runTest(TestCase.java:164)
	at junit.framework.TestCase.runBare(TestCase.java:130)
	at junit.framework.TestResult$1.protect(TestResult.java:106)
	at junit.framework.TestResult.runProtected(TestResult.java:124)
	at junit.framework.TestResult.run(TestResult.java:109)
	at junit.framework.TestCase.run(TestCase.java:120)
	at junit.framework.TestSuite.runTest(TestSuite.java:230)
	at junit.framework.TestSuite.run(TestSuite.java:225)
	at org.apache.tools.ant.taskdefs.optional.junit.JUnitTestRunner.run(JUnitTestRunner.java:297)
	at org.apache.tools.ant.taskdefs.optional.junit.JUnitTestRunner.launch(JUnitTestRunner.java:672)
	at org.apache.tools.ant.taskdefs.optional.junit.JUnitTestRunner.main(JUnitTestRunner.java:546)

Test: testGetAnnotationsClass: java.lang.reflect.Field5Testjava.lang.NullPointerException
	at java.lang.reflect.Proxy.newProxyInstance(Proxy.java:200)
	at org.apache.harmony.lang.annotation.AnnotationFactory.createAnnotation(AnnotationFactory.java:102)
	at org.apache.harmony.vm.VMGenericsAndAnnotations.getDeclaredAnnotations(VMGenericsAndAnnotations.java)
	at java.lang.reflect.Field$FieldData.getAnnotations(Field.java:457)
	at java.lang.reflect.Field.getDeclaredAnnotations(Field.java:42)
	at java.lang.reflect.AccessibleObject.getAnnotations(AccessibleObject.java:48)
	at org.apache.harmony.lang.AnnotatedElementTestFrame.testGetAnnotations(AnnotatedElementTestFrame.java:215)
	at java.lang.reflect.VMReflection.invokeMethod(VMReflection.java)
	at java.lang.reflect.Method.invoke(Method.java:317)
	at junit.framework.TestCase.runTest(TestCase.java:164)
	at junit.framework.TestCase.runBare(TestCase.java:130)
	at junit.framework.TestResult$1.protect(TestResult.java:106)
	at junit.framework.TestResult.runProtected(TestResult.java:124)
	at junit.framework.TestResult.run(TestResult.java:109)
	at junit.framework.TestCase.run(TestCase.java:120)
	at junit.framework.TestSuite.runTest(TestSuite.java:230)
	at junit.framework.TestSuite.run(TestSuite.java:225)
	at org.apache.tools.ant.taskdefs.optional.junit.JUnitTestRunner.run(JUnitTestRunner.java:297)
	at org.apache.tools.ant.taskdefs.optional.junit.JUnitTestRunner.launch(JUnitTestRunner.java:672)
	at org.apache.tools.ant.taskdefs.optional.junit.JUnitTestRunner.main(JUnitTestRunner.java:546)

Test: testGetAnnotations2Class: java.lang.reflect.Field5Testjava.lang.NullPointerException
	at java.lang.reflect.Proxy.newProxyInstance(Proxy.java:200)
	at org.apache.harmony.lang.annotation.AnnotationFactory.createAnnotation(AnnotationFactory.java:102)
	at org.apache.harmony.vm.VMGenericsAndAnnotations.getDeclaredAnnotations(VMGenericsAndAnnotations.java)
	at java.lang.reflect.Field$FieldData.getAnnotations(Field.java:457)
	at java.lang.reflect.Field.getDeclaredAnnotations(Field.java:42)
	at java.lang.reflect.AccessibleObject.getAnnotations(AccessibleObject.java:48)
	at org.apache.harmony.lang.AnnotatedElementTestFrame.testGetAnnotations2(AnnotatedElementTestFrame.java:226)
	at java.lang.reflect.VMReflection.invokeMethod(VMReflection.java)
	at java.lang.reflect.Method.invoke(Method.java:317)
	at junit.framework.TestCase.runTest(TestCase.java:164)
	at junit.framework.TestCase.runBare(TestCase.java:130)
	at junit.framework.TestResult$1.protect(TestResult.java:106)
	at junit.framework.TestResult.runProtected(TestResult.java:124)
	at junit.framework.TestResult.run(TestResult.java:109)
	at junit.framework.TestCase.run(TestCase.java:120)
	at junit.framework.TestSuite.runTest(TestSuite.java:230)
	at junit.framework.TestSuite.run(TestSuite.java:225)
	at org.apache.tools.ant.taskdefs.optional.junit.JUnitTestRunner.run(JUnitTestRunner.java:297)
	at org.apache.tools.ant.taskdefs.optional.junit.JUnitTestRunner.launch(JUnitTestRunner.java:672)
	at org.apache.tools.ant.taskdefs.optional.junit.JUnitTestRunner.main(JUnitTestRunner.java:546)

Test: testGetAnnotations5Class: java.lang.reflect.Field5Testjava.lang.NullPointerException
	at java.lang.reflect.Proxy.newProxyInstance(Proxy.java:200)
	at org.apache.harmony.lang.annotation.AnnotationFactory.createAnnotation(AnnotationFactory.java:102)
	at org.apache.harmony.vm.VMGenericsAndAnnotations.getDeclaredAnnotations(VMGenericsAndAnnotations.java)
	at java.lang.reflect.Field$FieldData.getAnnotations(Field.java:457)
	at java.lang.reflect.Field.getDeclaredAnnotations(Field.java:42)
	at java.lang.reflect.AccessibleObject.getAnnotations(AccessibleObject.java:48)
	at org.apache.harmony.lang.AnnotatedElementTestFrame.testGetAnnotations5(AnnotatedElementTestFrame.java:264)
	at java.lang.reflect.VMReflection.invokeMethod(VMReflection.java)
	at java.lang.reflect.Method.invoke(Method.java:317)
	at junit.framework.TestCase.runTest(TestCase.java:164)
	at junit.framework.TestCase.runBare(TestCase.java:130)
	at junit.framework.TestResult$1.protect(TestResult.java:106)
	at junit.framework.TestResult.runProtected(TestResult.java:124)
	at junit.framework.TestResult.run(TestResult.java:109)
	at junit.framework.TestCase.run(TestCase.java:120)
	at junit.framework.TestSuite.runTest(TestSuite.java:230)
	at junit.framework.TestSuite.run(TestSuite.java:225)
	at org.apache.tools.ant.taskdefs.optional.junit.JUnitTestRunner.run(JUnitTestRunner.java:297)
	at org.apache.tools.ant.taskdefs.optional.junit.JUnitTestRunner.launch(JUnitTestRunner.java:672)
	at org.apache.tools.ant.taskdefs.optional.junit.JUnitTestRunner.main(JUnitTestRunner.java:546)

Test: testGetAnnotationsImmutableClass: java.lang.reflect.Field5Testjava.lang.NullPointerException
	at java.lang.reflect.Proxy.newProxyInstance(Proxy.java:200)
	at org.apache.harmony.lang.annotation.AnnotationFactory.createAnnotation(AnnotationFactory.java:102)
	at org.apache.harmony.vm.VMGenericsAndAnnotations.getDeclaredAnnotations(VMGenericsAndAnnotations.java)
	at java.lang.reflect.Field$FieldData.getAnnotations(Field.java:457)
	at java.lang.reflect.Field.getDeclaredAnnotations(Field.java:42)
	at java.lang.reflect.AccessibleObject.getAnnotations(AccessibleObject.java:48)
	at org.apache.harmony.lang.AnnotatedElementTestFrame.testGetAnnotationsImmutable(AnnotatedElementTestFrame.java:293)
	at java.lang.reflect.VMReflection.invokeMethod(VMReflection.java)
	at java.lang.reflect.Method.invoke(Method.java:317)
	at junit.framework.TestCase.runTest(TestCase.java:164)
	at junit.framework.TestCase.runBare(TestCase.java:130)
	at junit.framework.TestResult$1.protect(TestResult.java:106)
	at junit.framework.TestResult.runProtected(TestResult.java:124)
	at junit.framework.TestResult.run(TestResult.java:109)
	at junit.framework.TestCase.run(TestCase.java:120)
	at junit.framework.TestSuite.runTest(TestSuite.java:230)
	at junit.framework.TestSuite.run(TestSuite.java:225)
	at org.apache.tools.ant.taskdefs.optional.junit.JUnitTestRunner.run(JUnitTestRunner.java:297)
	at org.apache.tools.ant.taskdefs.optional.junit.JUnitTestRunner.launch(JUnitTestRunner.java:672)
	at org.apache.tools.ant.taskdefs.optional.junit.JUnitTestRunner.main(JUnitTestRunner.java:546)

Test: testIsAnnotationPresentClass: java.lang.reflect.Field5Testjava.lang.NullPointerException
	at java.lang.reflect.Proxy.newProxyInstance(Proxy.java:200)
	at org.apache.harmony.lang.annotation.AnnotationFactory.createAnnotation(AnnotationFactory.java:102)
	at org.apache.harmony.vm.VMGenericsAndAnnotations.getDeclaredAnnotations(VMGenericsAndAnnotations.java)
	at java.lang.reflect.Field$FieldData.getAnnotations(Field.java:457)
	at java.lang.reflect.Field.getAnnotation(Field.java:56)
	at java.lang.reflect.AccessibleObject.isAnnotationPresent(AccessibleObject.java:39)
	at org.apache.harmony.lang.AnnotatedElementTestFrame.testIsAnnotationPresent(AnnotatedElementTestFrame.java:310)
	at java.lang.reflect.VMReflection.invokeMethod(VMReflection.java)
	at java.lang.reflect.Method.invoke(Method.java:317)
	at junit.framework.TestCase.runTest(TestCase.java:164)
	at junit.framework.TestCase.runBare(TestCase.java:130)
	at junit.framework.TestResult$1.protect(TestResult.java:106)
	at junit.framework.TestResult.runProtected(TestResult.java:124)
	at junit.framework.TestResult.run(TestResult.java:109)
	at junit.framework.TestCase.run(TestCase.java:120)
	at junit.framework.TestSuite.runTest(TestSuite.java:230)
	at junit.framework.TestSuite.run(TestSuite.java:225)
	at org.apache.tools.ant.taskdefs.optional.junit.JUnitTestRunner.run(JUnitTestRunner.java:297)
	at org.apache.tools.ant.taskdefs.optional.junit.JUnitTestRunner.launch(JUnitTestRunner.java:672)
	at org.apache.tools.ant.taskdefs.optional.junit.JUnitTestRunner.main(JUnitTestRunner.java:546)

Test: testIsAnnotationPresent_NegativeClass: java.lang.reflect.Field5Testjava.lang.NullPointerException
	at java.lang.reflect.Proxy.newProxyInstance(Proxy.java:200)
	at org.apache.harmony.lang.annotation.AnnotationFactory.createAnnotation(AnnotationFactory.java:102)
	at org.apache.harmony.vm.VMGenericsAndAnnotations.getDeclaredAnnotations(VMGenericsAndAnnotations.java)
	at java.lang.reflect.Field$FieldData.getAnnotations(Field.java:457)
	at java.lang.reflect.Field.getAnnotation(Field.java:56)
	at java.lang.reflect.AccessibleObject.isAnnotationPresent(AccessibleObject.java:39)
	at org.apache.harmony.lang.AnnotatedElementTestFrame.testIsAnnotationPresent_Negative(AnnotatedElementTestFrame.java:320)
	at java.lang.reflect.VMReflection.invokeMethod(VMReflection.java)
	at java.lang.reflect.Method.invoke(Method.java:317)
	at junit.framework.TestCase.runTest(TestCase.java:164)
	at junit.framework.TestCase.runBare(TestCase.java:130)
	at junit.framework.TestResult$1.protect(TestResult.java:106)
	at junit.framework.TestResult.runProtected(TestResult.java:124)
	at junit.framework.TestResult.run(TestResult.java:109)
	at junit.framework.TestCase.run(TestCase.java:120)
	at junit.framework.TestSuite.runTest(TestSuite.java:230)
	at junit.framework.TestSuite.run(TestSuite.java:225)
	at org.apache.tools.ant.taskdefs.optional.junit.JUnitTestRunner.run(JUnitTestRunner.java:297)
	at org.apache.tools.ant.taskdefs.optional.junit.JUnitTestRunner.launch(JUnitTestRunner.java:672)
	at org.apache.tools.ant.taskdefs.optional.junit.JUnitTestRunner.main(JUnitTestRunner.java:546)

Test: testGetParameterAnnotations2Class: java.lang.reflect.Method5Testjava.lang.reflect.InvocationTargetException
	at java.lang.reflect.VMReflection.invokeMethod(VMReflection.java)
	at java.lang.reflect.Method.invoke(Method.java:317)
	at java.lang.reflect.Method5Test.getParamAnnotations(Method5Test.java:81)
	at java.lang.reflect.Method5Test.testGetParameterAnnotations2(Method5Test.java:113)
	at java.lang.reflect.VMReflection.invokeMethod(VMReflection.java)
	at java.lang.reflect.Method.invoke(Method.java:317)
	at junit.framework.TestCase.runTest(TestCase.java:164)
	at junit.framework.TestCase.runBare(TestCase.java:130)
	at junit.framework.TestResult$1.protect(TestResult.java:106)
	at junit.framework.TestResult.runProtected(TestResult.java:124)
	at junit.framework.TestResult.run(TestResult.java:109)
	at junit.framework.TestCase.run(TestCase.java:120)
	at junit.framework.TestSuite.runTest(TestSuite.java:230)
	at junit.framework.TestSuite.run(TestSuite.java:225)
	at org.apache.tools.ant.taskdefs.optional.junit.JUnitTestRunner.run(JUnitTestRunner.java:297)
	at org.apache.tools.ant.taskdefs.optional.junit.JUnitTestRunner.launch(JUnitTestRunner.java:672)
	at org.apache.tools.ant.taskdefs.optional.junit.JUnitTestRunner.main(JUnitTestRunner.java:546)
Caused by: java.lang.NullPointerException
	at java.lang.reflect.Proxy.newProxyInstance(Proxy.java:200)
	at org.apache.harmony.lang.annotation.AnnotationFactory.createAnnotation(AnnotationFactory.java:102)
	at org.apache.harmony.vm.VMGenericsAndAnnotations.getParameterAnnotations(VMGenericsAndAnnotations.java)
	at java.lang.reflect.Method$MethodData.getParameterAnnotations(Method.java:443)
	at java.lang.reflect.Method.getParameterAnnotations(Method.java:58)
	at java.lang.reflect.VMReflection.invokeMethod(VMReflection.java)
	... 16 more

Test: testGetParameterAnnotations3Class: java.lang.reflect.Method5Testjava.lang.reflect.InvocationTargetException
	at java.lang.reflect.VMReflection.invokeMethod(VMReflection.java)
	at java.lang.reflect.Method.invoke(Method.java:317)
	at java.lang.reflect.Method5Test.getParamAnnotations(Method5Test.java:81)
	at java.lang.reflect.Method5Test.testGetParameterAnnotations3(Method5Test.java:140)
	at java.lang.reflect.VMReflection.invokeMethod(VMReflection.java)
	at java.lang.reflect.Method.invoke(Method.java:317)
	at junit.framework.TestCase.runTest(TestCase.java:164)
	at junit.framework.TestCase.runBare(TestCase.java:130)
	at junit.framework.TestResult$1.protect(TestResult.java:106)
	at junit.framework.TestResult.runProtected(TestResult.java:124)
	at junit.framework.TestResult.run(TestResult.java:109)
	at junit.framework.TestCase.run(TestCase.java:120)
	at junit.framework.TestSuite.runTest(TestSuite.java:230)
	at junit.framework.TestSuite.run(TestSuite.java:225)
	at org.apache.tools.ant.taskdefs.optional.junit.JUnitTestRunner.run(JUnitTestRunner.java:297)
	at org.apache.tools.ant.taskdefs.optional.junit.JUnitTestRunner.launch(JUnitTestRunner.java:672)
	at org.apache.tools.ant.taskdefs.optional.junit.JUnitTestRunner.main(JUnitTestRunner.java:546)
Caused by: java.lang.NullPointerException
	at java.lang.reflect.Proxy.newProxyInstance(Proxy.java:200)
	at org.apache.harmony.lang.annotation.AnnotationFactory.createAnnotation(AnnotationFactory.java:102)
	at org.apache.harmony.vm.VMGenericsAndAnnotations.getParameterAnnotations(VMGenericsAndAnnotations.java)
	at java.lang.reflect.Method$MethodData.getParameterAnnotations(Method.java:443)
	at java.lang.reflect.Method.getParameterAnnotations(Method.java:58)
	at java.lang.reflect.VMReflection.invokeMethod(VMReflection.java)
	... 16 more

Test: testGetParameterAnnotationsImmutableClass: java.lang.reflect.Method5Testjava.lang.reflect.InvocationTargetException
	at java.lang.reflect.VMReflection.invokeMethod(VMReflection.java)
	at java.lang.reflect.Method.invoke(Method.java:317)
	at java.lang.reflect.Method5Test.getParamAnnotations(Method5Test.java:81)
	at java.lang.reflect.Method5Test.testGetParameterAnnotationsImmutable(Method5Test.java:157)
	at java.lang.reflect.VMReflection.invokeMethod(VMReflection.java)
	at java.lang.reflect.Method.invoke(Method.java:317)
	at junit.framework.TestCase.runTest(TestCase.java:164)
	at junit.framework.TestCase.runBare(TestCase.java:130)
	at junit.framework.TestResult$1.protect(TestResult.java:106)
	at junit.framework.TestResult.runProtected(TestResult.java:124)
	at junit.framework.TestResult.run(TestResult.java:109)
	at junit.framework.TestCase.run(TestCase.java:120)
	at junit.framework.TestSuite.runTest(TestSuite.java:230)
	at junit.framework.TestSuite.run(TestSuite.java:225)
	at org.apache.tools.ant.taskdefs.optional.junit.JUnitTestRunner.run(JUnitTestRunner.java:297)
	at org.apache.tools.ant.taskdefs.optional.junit.JUnitTestRunner.launch(JUnitTestRunner.java:672)
	at org.apache.tools.ant.taskdefs.optional.junit.JUnitTestRunner.main(JUnitTestRunner.java:546)
Caused by: java.lang.NullPointerException
	at java.lang.reflect.Proxy.newProxyInstance(Proxy.java:200)
	at org.apache.harmony.lang.annotation.AnnotationFactory.createAnnotation(AnnotationFactory.java:102)
	at org.apache.harmony.vm.VMGenericsAndAnnotations.getParameterAnnotations(VMGenericsAndAnnotations.java)
	at java.lang.reflect.Method$MethodData.getParameterAnnotations(Method.java:443)
	at java.lang.reflect.Method.getParameterAnnotations(Method.java:58)
	at java.lang.reflect.VMReflection.invokeMethod(VMReflection.java)
	... 16 more

Test: testGetAnnotationClass: java.lang.reflect.Method5Testjava.lang.NullPointerException
	at java.lang.reflect.Proxy.newProxyInstance(Proxy.java:200)
	at org.apache.harmony.lang.annotation.AnnotationFactory.createAnnotation(AnnotationFactory.java:102)
	at org.apache.harmony.vm.VMGenericsAndAnnotations.getDeclaredAnnotations(VMGenericsAndAnnotations.java)
	at java.lang.reflect.Method$MethodData.getDeclaredAnnotations(Method.java:425)
	at java.lang.reflect.Method.getAnnotation(Method.java:85)
	at org.apache.harmony.lang.AnnotatedElementTestFrame.testGetAnnotation(AnnotatedElementTestFrame.java:114)
	at java.lang.reflect.VMReflection.invokeMethod(VMReflection.java)
	at java.lang.reflect.Method.invoke(Method.java:317)
	at junit.framework.TestCase.runTest(TestCase.java:164)
	at junit.framework.TestCase.runBare(TestCase.java:130)
	at junit.framework.TestResult$1.protect(TestResult.java:106)
	at junit.framework.TestResult.runProtected(TestResult.java:124)
	at junit.framework.TestResult.run(TestResult.java:109)
	at junit.framework.TestCase.run(TestCase.java:120)
	at junit.framework.TestSuite.runTest(TestSuite.java:230)
	at junit.framework.TestSuite.run(TestSuite.java:225)
	at org.apache.tools.ant.taskdefs.optional.junit.JUnitTestRunner.run(JUnitTestRunner.java:297)
	at org.apache.tools.ant.taskdefs.optional.junit.JUnitTestRunner.launch(JUnitTestRunner.java:672)
	at org.apache.tools.ant.taskdefs.optional.junit.JUnitTestRunner.main(JUnitTestRunner.java:546)

Test: testGetAnnotation2Class: java.lang.reflect.Method5Testjava.lang.NullPointerException
	at java.lang.reflect.Proxy.newProxyInstance(Proxy.java:200)
	at org.apache.harmony.lang.annotation.AnnotationFactory.createAnnotation(AnnotationFactory.java:102)
	at org.apache.harmony.vm.VMGenericsAndAnnotations.getDeclaredAnnotations(VMGenericsAndAnnotations.java)
	at java.lang.reflect.Method$MethodData.getDeclaredAnnotations(Method.java:425)
	at java.lang.reflect.Method.getAnnotation(Method.java:85)
	at org.apache.harmony.lang.AnnotatedElementTestFrame.testGetAnnotation2(AnnotatedElementTestFrame.java:124)
	at java.lang.reflect.VMReflection.invokeMethod(VMReflection.java)
	at java.lang.reflect.Method.invoke(Method.java:317)
	at junit.framework.TestCase.runTest(TestCase.java:164)
	at junit.framework.TestCase.runBare(TestCase.java:130)
	at junit.framework.TestResult$1.protect(TestResult.java:106)
	at junit.framework.TestResult.runProtected(TestResult.java:124)
	at junit.framework.TestResult.run(TestResult.java:109)
	at junit.framework.TestCase.run(TestCase.java:120)
	at junit.framework.TestSuite.runTest(TestSuite.java:230)
	at junit.framework.TestSuite.run(TestSuite.java:225)
	at org.apache.tools.ant.taskdefs.optional.junit.JUnitTestRunner.run(JUnitTestRunner.java:297)
	at org.apache.tools.ant.taskdefs.optional.junit.JUnitTestRunner.launch(JUnitTestRunner.java:672)
	at org.apache.tools.ant.taskdefs.optional.junit.JUnitTestRunner.main(JUnitTestRunner.java:546)

Test: testGetAnnotation_NegativeClass: java.lang.reflect.Method5Testjava.lang.NullPointerException
	at java.lang.reflect.Proxy.newProxyInstance(Proxy.java:200)
	at org.apache.harmony.lang.annotation.AnnotationFactory.createAnnotation(AnnotationFactory.java:102)
	at org.apache.harmony.vm.VMGenericsAndAnnotations.getDeclaredAnnotations(VMGenericsAndAnnotations.java)
	at java.lang.reflect.Method$MethodData.getDeclaredAnnotations(Method.java:425)
	at java.lang.reflect.Method.getAnnotation(Method.java:85)
	at org.apache.harmony.lang.AnnotatedElementTestFrame.testGetAnnotation_Negative(AnnotatedElementTestFrame.java:134)
	at java.lang.reflect.VMReflection.invokeMethod(VMReflection.java)
	at java.lang.reflect.Method.invoke(Method.java:317)
	at junit.framework.TestCase.runTest(TestCase.java:164)
	at junit.framework.TestCase.runBare(TestCase.java:130)
	at junit.framework.TestResult$1.protect(TestResult.java:106)
	at junit.framework.TestResult.runProtected(TestResult.java:124)
	at junit.framework.TestResult.run(TestResult.java:109)
	at junit.framework.TestCase.run(TestCase.java:120)
	at junit.framework.TestSuite.runTest(TestSuite.java:230)
	at junit.framework.TestSuite.run(TestSuite.java:225)
	at org.apache.tools.ant.taskdefs.optional.junit.JUnitTestRunner.run(JUnitTestRunner.java:297)
	at org.apache.tools.ant.taskdefs.optional.junit.JUnitTestRunner.launch(JUnitTestRunner.java:672)
	at org.apache.tools.ant.taskdefs.optional.junit.JUnitTestRunner.main(JUnitTestRunner.java:546)

Test: testGetDeclaredAnnotationsClass: java.lang.reflect.Method5Testjava.lang.NullPointerException
	at java.lang.reflect.Proxy.newProxyInstance(Proxy.java:200)
	at org.apache.harmony.lang.annotation.AnnotationFactory.createAnnotation(AnnotationFactory.java:102)
	at org.apache.harmony.vm.VMGenericsAndAnnotations.getDeclaredAnnotations(VMGenericsAndAnnotations.java)
	at java.lang.reflect.Method$MethodData.getDeclaredAnnotations(Method.java:425)
	at java.lang.reflect.Method.getDeclaredAnnotations(Method.java:71)
	at org.apache.harmony.lang.AnnotatedElementTestFrame.testGetDeclaredAnnotations(AnnotatedElementTestFrame.java:162)
	at java.lang.reflect.VMReflection.invokeMethod(VMReflection.java)
	at java.lang.reflect.Method.invoke(Method.java:317)
	at junit.framework.TestCase.runTest(TestCase.java:164)
	at junit.framework.TestCase.runBare(TestCase.java:130)
	at junit.framework.TestResult$1.protect(TestResult.java:106)
	at junit.framework.TestResult.runProtected(TestResult.java:124)
	at junit.framework.TestResult.run(TestResult.java:109)
	at junit.framework.TestCase.run(TestCase.java:120)
	at junit.framework.TestSuite.runTest(TestSuite.java:230)
	at junit.framework.TestSuite.run(TestSuite.java:225)
	at org.apache.tools.ant.taskdefs.optional.junit.JUnitTestRunner.run(JUnitTestRunner.java:297)
	at org.apache.tools.ant.taskdefs.optional.junit.JUnitTestRunner.launch(JUnitTestRunner.java:672)
	at org.apache.tools.ant.taskdefs.optional.junit.JUnitTestRunner.main(JUnitTestRunner.java:546)

Test: testGetDeclaredAnnotations2Class: java.lang.reflect.Method5Testjava.lang.NullPointerException
	at java.lang.reflect.Proxy.newProxyInstance(Proxy.java:200)
	at org.apache.harmony.lang.annotation.AnnotationFactory.createAnnotation(AnnotationFactory.java:102)
	at org.apache.harmony.vm.VMGenericsAndAnnotations.getDeclaredAnnotations(VMGenericsAndAnnotations.java)
	at java.lang.reflect.Method$MethodData.getDeclaredAnnotations(Method.java:425)
	at java.lang.reflect.Method.getDeclaredAnnotations(Method.java:71)
	at org.apache.harmony.lang.AnnotatedElementTestFrame.testGetDeclaredAnnotations2(AnnotatedElementTestFrame.java:173)
	at java.lang.reflect.VMReflection.invokeMethod(VMReflection.java)
	at java.lang.reflect.Method.invoke(Method.java:317)
	at junit.framework.TestCase.runTest(TestCase.java:164)
	at junit.framework.TestCase.runBare(TestCase.java:130)
	at junit.framework.TestResult$1.protect(TestResult.java:106)
	at junit.framework.TestResult.runProtected(TestResult.java:124)
	at junit.framework.TestResult.run(TestResult.java:109)
	at junit.framework.TestCase.run(TestCase.java:120)
	at junit.framework.TestSuite.runTest(TestSuite.java:230)
	at junit.framework.TestSuite.run(TestSuite.java:225)
	at org.apache.tools.ant.taskdefs.optional.junit.JUnitTestRunner.run(JUnitTestRunner.java:297)
	at org.apache.tools.ant.taskdefs.optional.junit.JUnitTestRunner.launch(JUnitTestRunner.java:672)
	at org.apache.tools.ant.taskdefs.optional.junit.JUnitTestRunner.main(JUnitTestRunner.java:546)

Test: testGetDeclaredAnnotationsImmutableClass: java.lang.reflect.Method5Testjava.lang.NullPointerException
	at java.lang.reflect.Proxy.newProxyInstance(Proxy.java:200)
	at org.apache.harmony.lang.annotation.AnnotationFactory.createAnnotation(AnnotationFactory.java:102)
	at org.apache.harmony.vm.VMGenericsAndAnnotations.getDeclaredAnnotations(VMGenericsAndAnnotations.java)
	at java.lang.reflect.Method$MethodData.getDeclaredAnnotations(Method.java:425)
	at java.lang.reflect.Method.getDeclaredAnnotations(Method.java:71)
	at org.apache.harmony.lang.AnnotatedElementTestFrame.testGetDeclaredAnnotationsImmutable(AnnotatedElementTestFrame.java:198)
	at java.lang.reflect.VMReflection.invokeMethod(VMReflection.java)
	at java.lang.reflect.Method.invoke(Method.java:317)
	at junit.framework.TestCase.runTest(TestCase.java:164)
	at junit.framework.TestCase.runBare(TestCase.java:130)
	at junit.framework.TestResult$1.protect(TestResult.java:106)
	at junit.framework.TestResult.runProtected(TestResult.java:124)
	at junit.framework.TestResult.run(TestResult.java:109)
	at junit.framework.TestCase.run(TestCase.java:120)
	at junit.framework.TestSuite.runTest(TestSuite.java:230)
	at junit.framework.TestSuite.run(TestSuite.java:225)
	at org.apache.tools.ant.taskdefs.optional.junit.JUnitTestRunner.run(JUnitTestRunner.java:297)
	at org.apache.tools.ant.taskdefs.optional.junit.JUnitTestRunner.launch(JUnitTestRunner.java:672)
	at org.apache.tools.ant.taskdefs.optional.junit.JUnitTestRunner.main(JUnitTestRunner.java:546)

Test: testGetAnnotationsClass: java.lang.reflect.Method5Testjava.lang.NullPointerException
	at java.lang.reflect.Proxy.newProxyInstance(Proxy.java:200)
	at org.apache.harmony.lang.annotation.AnnotationFactory.createAnnotation(AnnotationFactory.java:102)
	at org.apache.harmony.vm.VMGenericsAndAnnotations.getDeclaredAnnotations(VMGenericsAndAnnotations.java)
	at java.lang.reflect.Method$MethodData.getDeclaredAnnotations(Method.java:425)
	at java.lang.reflect.Method.getDeclaredAnnotations(Method.java:71)
	at java.lang.reflect.AccessibleObject.getAnnotations(AccessibleObject.java:48)
	at org.apache.harmony.lang.AnnotatedElementTestFrame.testGetAnnotations(AnnotatedElementTestFrame.java:215)
	at java.lang.reflect.VMReflection.invokeMethod(VMReflection.java)
	at java.lang.reflect.Method.invoke(Method.java:317)
	at junit.framework.TestCase.runTest(TestCase.java:164)
	at junit.framework.TestCase.runBare(TestCase.java:130)
	at junit.framework.TestResult$1.protect(TestResult.java:106)
	at junit.framework.TestResult.runProtected(TestResult.java:124)
	at junit.framework.TestResult.run(TestResult.java:109)
	at junit.framework.TestCase.run(TestCase.java:120)
	at junit.framework.TestSuite.runTest(TestSuite.java:230)
	at junit.framework.TestSuite.run(TestSuite.java:225)
	at org.apache.tools.ant.taskdefs.optional.junit.JUnitTestRunner.run(JUnitTestRunner.java:297)
	at org.apache.tools.ant.taskdefs.optional.junit.JUnitTestRunner.launch(JUnitTestRunner.java:672)
	at org.apache.tools.ant.taskdefs.optional.junit.JUnitTestRunner.main(JUnitTestRunner.java:546)

Test: testGetAnnotations2Class: java.lang.reflect.Method5Testjava.lang.NullPointerException
	at java.lang.reflect.Proxy.newProxyInstance(Proxy.java:200)
	at org.apache.harmony.lang.annotation.AnnotationFactory.createAnnotation(AnnotationFactory.java:102)
	at org.apache.harmony.vm.VMGenericsAndAnnotations.getDeclaredAnnotations(VMGenericsAndAnnotations.java)
	at java.lang.reflect.Method$MethodData.getDeclaredAnnotations(Method.java:425)
	at java.lang.reflect.Method.getDeclaredAnnotations(Method.java:71)
	at java.lang.reflect.AccessibleObject.getAnnotations(AccessibleObject.java:48)
	at org.apache.harmony.lang.AnnotatedElementTestFrame.testGetAnnotations2(AnnotatedElementTestFrame.java:226)
	at java.lang.reflect.VMReflection.invokeMethod(VMReflection.java)
	at java.lang.reflect.Method.invoke(Method.java:317)
	at junit.framework.TestCase.runTest(TestCase.java:164)
	at junit.framework.TestCase.runBare(TestCase.java:130)
	at junit.framework.TestResult$1.protect(TestResult.java:106)
	at junit.framework.TestResult.runProtected(TestResult.java:124)
	at junit.framework.TestResult.run(TestResult.java:109)
	at junit.framework.TestCase.run(TestCase.java:120)
	at junit.framework.TestSuite.runTest(TestSuite.java:230)
	at junit.framework.TestSuite.run(TestSuite.java:225)
	at org.apache.tools.ant.taskdefs.optional.junit.JUnitTestRunner.run(JUnitTestRunner.java:297)
	at org.apache.tools.ant.taskdefs.optional.junit.JUnitTestRunner.launch(JUnitTestRunner.java:672)
	at org.apache.tools.ant.taskdefs.optional.junit.JUnitTestRunner.main(JUnitTestRunner.java:546)

Test: testGetAnnotations5Class: java.lang.reflect.Method5Testjava.lang.NullPointerException
	at java.lang.reflect.Proxy.newProxyInstance(Proxy.java:200)
	at org.apache.harmony.lang.annotation.AnnotationFactory.createAnnotation(AnnotationFactory.java:102)
	at org.apache.harmony.vm.VMGenericsAndAnnotations.getDeclaredAnnotations(VMGenericsAndAnnotations.java)
	at java.lang.reflect.Method$MethodData.getDeclaredAnnotations(Method.java:425)
	at java.lang.reflect.Method.getDeclaredAnnotations(Method.java:71)
	at java.lang.reflect.AccessibleObject.getAnnotations(AccessibleObject.java:48)
	at org.apache.harmony.lang.AnnotatedElementTestFrame.testGetAnnotations5(AnnotatedElementTestFrame.java:264)
	at java.lang.reflect.VMReflection.invokeMethod(VMReflection.java)
	at java.lang.reflect.Method.invoke(Method.java:317)
	at junit.framework.TestCase.runTest(TestCase.java:164)
	at junit.framework.TestCase.runBare(TestCase.java:130)
	at junit.framework.TestResult$1.protect(TestResult.java:106)
	at junit.framework.TestResult.runProtected(TestResult.java:124)
	at junit.framework.TestResult.run(TestResult.java:109)
	at junit.framework.TestCase.run(TestCase.java:120)
	at junit.framework.TestSuite.runTest(TestSuite.java:230)
	at junit.framework.TestSuite.run(TestSuite.java:225)
	at org.apache.tools.ant.taskdefs.optional.junit.JUnitTestRunner.run(JUnitTestRunner.java:297)
	at org.apache.tools.ant.taskdefs.optional.junit.JUnitTestRunner.launch(JUnitTestRunner.java:672)
	at org.apache.tools.ant.taskdefs.optional.junit.JUnitTestRunner.main(JUnitTestRunner.java:546)

Test: testGetAnnotationsImmutableClass: java.lang.reflect.Method5Testjava.lang.NullPointerException
	at java.lang.reflect.Proxy.newProxyInstance(Proxy.java:200)
	at org.apache.harmony.lang.annotation.AnnotationFactory.createAnnotation(AnnotationFactory.java:102)
	at org.apache.harmony.vm.VMGenericsAndAnnotations.getDeclaredAnnotations(VMGenericsAndAnnotations.java)
	at java.lang.reflect.Method$MethodData.getDeclaredAnnotations(Method.java:425)
	at java.lang.reflect.Method.getDeclaredAnnotations(Method.java:71)
	at java.lang.reflect.AccessibleObject.getAnnotations(AccessibleObject.java:48)
	at org.apache.harmony.lang.AnnotatedElementTestFrame.testGetAnnotationsImmutable(AnnotatedElementTestFrame.java:293)
	at java.lang.reflect.VMReflection.invokeMethod(VMReflection.java)
	at java.lang.reflect.Method.invoke(Method.java:317)
	at junit.framework.TestCase.runTest(TestCase.java:164)
	at junit.framework.TestCase.runBare(TestCase.java:130)
	at junit.framework.TestResult$1.protect(TestResult.java:106)
	at junit.framework.TestResult.runProtected(TestResult.java:124)
	at junit.framework.TestResult.run(TestResult.java:109)
	at junit.framework.TestCase.run(TestCase.java:120)
	at junit.framework.TestSuite.runTest(TestSuite.java:230)
	at junit.framework.TestSuite.run(TestSuite.java:225)
	at org.apache.tools.ant.taskdefs.optional.junit.JUnitTestRunner.run(JUnitTestRunner.java:297)
	at org.apache.tools.ant.taskdefs.optional.junit.JUnitTestRunner.launch(JUnitTestRunner.java:672)
	at org.apache.tools.ant.taskdefs.optional.junit.JUnitTestRunner.main(JUnitTestRunner.java:546)

Test: testIsAnnotationPresentClass: java.lang.reflect.Method5Testjava.lang.NullPointerException
	at java.lang.reflect.Proxy.newProxyInstance(Proxy.java:200)
	at org.apache.harmony.lang.annotation.AnnotationFactory.createAnnotation(AnnotationFactory.java:102)
	at org.apache.harmony.vm.VMGenericsAndAnnotations.getDeclaredAnnotations(VMGenericsAndAnnotations.java)
	at java.lang.reflect.Method$MethodData.getDeclaredAnnotations(Method.java:425)
	at java.lang.reflect.Method.getAnnotation(Method.java:85)
	at java.lang.reflect.AccessibleObject.isAnnotationPresent(AccessibleObject.java:39)
	at org.apache.harmony.lang.AnnotatedElementTestFrame.testIsAnnotationPresent(AnnotatedElementTestFrame.java:310)
	at java.lang.reflect.VMReflection.invokeMethod(VMReflection.java)
	at java.lang.reflect.Method.invoke(Method.java:317)
	at junit.framework.TestCase.runTest(TestCase.java:164)
	at junit.framework.TestCase.runBare(TestCase.java:130)
	at junit.framework.TestResult$1.protect(TestResult.java:106)
	at junit.framework.TestResult.runProtected(TestResult.java:124)
	at junit.framework.TestResult.run(TestResult.java:109)
	at junit.framework.TestCase.run(TestCase.java:120)
	at junit.framework.TestSuite.runTest(TestSuite.java:230)
	at junit.framework.TestSuite.run(TestSuite.java:225)
	at org.apache.tools.ant.taskdefs.optional.junit.JUnitTestRunner.run(JUnitTestRunner.java:297)
	at org.apache.tools.ant.taskdefs.optional.junit.JUnitTestRunner.launch(JUnitTestRunner.java:672)
	at org.apache.tools.ant.taskdefs.optional.junit.JUnitTestRunner.main(JUnitTestRunner.java:546)

Test: testIsAnnotationPresent_NegativeClass: java.lang.reflect.Method5Testjava.lang.NullPointerException
	at java.lang.reflect.Proxy.newProxyInstance(Proxy.java:200)
	at org.apache.harmony.lang.annotation.AnnotationFactory.createAnnotation(AnnotationFactory.java:102)
	at org.apache.harmony.vm.VMGenericsAndAnnotations.getDeclaredAnnotations(VMGenericsAndAnnotations.java)
	at java.lang.reflect.Method$MethodData.getDeclaredAnnotations(Method.java:425)
	at java.lang.reflect.Method.getAnnotation(Method.java:85)
	at java.lang.reflect.AccessibleObject.isAnnotationPresent(AccessibleObject.java:39)
	at org.apache.harmony.lang.AnnotatedElementTestFrame.testIsAnnotationPresent_Negative(AnnotatedElementTestFrame.java:320)
	at java.lang.reflect.VMReflection.invokeMethod(VMReflection.java)
	at java.lang.reflect.Method.invoke(Method.java:317)
	at junit.framework.TestCase.runTest(TestCase.java:164)
	at junit.framework.TestCase.runBare(TestCase.java:130)
	at junit.framework.TestResult$1.protect(TestResult.java:106)
	at junit.framework.TestResult.runProtected(TestResult.java:124)
	at junit.framework.TestResult.run(TestResult.java:109)
	at junit.framework.TestCase.run(TestCase.java:120)
	at junit.framework.TestSuite.runTest(TestSuite.java:230)
	at junit.framework.TestSuite.run(TestSuite.java:225)
	at org.apache.tools.ant.taskdefs.optional.junit.JUnitTestRunner.run(JUnitTestRunner.java:297)
	at org.apache.tools.ant.taskdefs.optional.junit.JUnitTestRunner.launch(JUnitTestRunner.java:672)
	at org.apache.tools.ant.taskdefs.optional.junit.JUnitTestRunner.main(JUnitTestRunner.java:546)

Test: testGetAnnotation_ByDefaultClass: org.apache.harmony.lang.annotation.AllTypesTestjava.lang.NullPointerException
	at java.lang.reflect.Proxy.newProxyInstance(Proxy.java:200)
	at org.apache.harmony.lang.annotation.AnnotationFactory.createAnnotation(AnnotationFactory.java:102)
	at org.apache.harmony.vm.VMGenericsAndAnnotations.getDeclaredAnnotations(VMGenericsAndAnnotations.java)
	at java.lang.Class$GACache.getAllAnnotations(Class.java:1338)
	at java.lang.Class.getAnnotation(Class.java:890)
	at org.apache.harmony.lang.annotation.AllTypesTest.testGetAnnotation_ByDefault(AllTypesTest.java:51)
	at java.lang.reflect.VMReflection.invokeMethod(VMReflection.java)
	at java.lang.reflect.Method.invoke(Method.java:317)
	at junit.framework.TestCase.runTest(TestCase.java:164)
	at junit.framework.TestCase.runBare(TestCase.java:130)
	at junit.framework.TestResult$1.protect(TestResult.java:106)
	at junit.framework.TestResult.runProtected(TestResult.java:124)
	at junit.framework.TestResult.run(TestResult.java:109)
	at junit.framework.TestCase.run(TestCase.java:120)
	at junit.framework.TestSuite.runTest(TestSuite.java:230)
	at junit.framework.TestSuite.run(TestSuite.java:225)
	at org.apache.tools.ant.taskdefs.optional.junit.JUnitTestRunner.run(JUnitTestRunner.java:297)
	at org.apache.tools.ant.taskdefs.optional.junit.JUnitTestRunner.launch(JUnitTestRunner.java:672)
	at org.apache.tools.ant.taskdefs.optional.junit.JUnitTestRunner.main(JUnitTestRunner.java:546)

Test: testGetAnnotation_NoDefaultClass: org.apache.harmony.lang.annotation.AllTypesTestjava.lang.NullPointerException
	at java.lang.reflect.Proxy.newProxyInstance(Proxy.java:200)
	at org.apache.harmony.lang.annotation.AnnotationFactory.createAnnotation(AnnotationFactory.java:102)
	at org.apache.harmony.vm.VMGenericsAndAnnotations.getDeclaredAnnotations(VMGenericsAndAnnotations.java)
	at java.lang.Class$GACache.getAllAnnotations(Class.java:1338)
	at java.lang.Class.getAnnotation(Class.java:890)
	at org.apache.harmony.lang.annotation.AllTypesTest.testGetAnnotation_NoDefault(AllTypesTest.java:87)
	at java.lang.reflect.VMReflection.invokeMethod(VMReflection.java)
	at java.lang.reflect.Method.invoke(Method.java:317)
	at junit.framework.TestCase.runTest(TestCase.java:164)
	at junit.framework.TestCase.runBare(TestCase.java:130)
	at junit.framework.TestResult$1.protect(TestResult.java:106)
	at junit.framework.TestResult.runProtected(TestResult.java:124)
	at junit.framework.TestResult.run(TestResult.java:109)
	at junit.framework.TestCase.run(TestCase.java:120)
	at junit.framework.TestSuite.runTest(TestSuite.java:230)
	at junit.framework.TestSuite.run(TestSuite.java:225)
	at org.apache.tools.ant.taskdefs.optional.junit.JUnitTestRunner.run(JUnitTestRunner.java:297)
	at org.apache.tools.ant.taskdefs.optional.junit.JUnitTestRunner.launch(JUnitTestRunner.java:672)
	at org.apache.tools.ant.taskdefs.optional.junit.JUnitTestRunner.main(JUnitTestRunner.java:546)

Test: testEqualsClass: org.apache.harmony.lang.annotation.AllTypesTestjava.lang.NullPointerException
	at java.lang.reflect.Proxy.newProxyInstance(Proxy.java:200)
	at org.apache.harmony.lang.annotation.AnnotationFactory.createAnnotation(AnnotationFactory.java:102)
	at org.apache.harmony.vm.VMGenericsAndAnnotations.getDeclaredAnnotations(VMGenericsAndAnnotations.java)
	at java.lang.Class$GACache.getAllAnnotations(Class.java:1338)
	at java.lang.Class.getAnnotation(Class.java:890)
	at org.apache.harmony.lang.annotation.AllTypesTest.testEquals(AllTypesTest.java:114)
	at java.lang.reflect.VMReflection.invokeMethod(VMReflection.java)
	at java.lang.reflect.Method.invoke(Method.java:317)
	at junit.framework.TestCase.runTest(TestCase.java:164)
	at junit.framework.TestCase.runBare(TestCase.java:130)
	at junit.framework.TestResult$1.protect(TestResult.java:106)
	at junit.framework.TestResult.runProtected(TestResult.java:124)
	at junit.framework.TestResult.run(TestResult.java:109)
	at junit.framework.TestCase.run(TestCase.java:120)
	at junit.framework.TestSuite.runTest(TestSuite.java:230)
	at junit.framework.TestSuite.run(TestSuite.java:225)
	at org.apache.tools.ant.taskdefs.optional.junit.JUnitTestRunner.run(JUnitTestRunner.java:297)
	at org.apache.tools.ant.taskdefs.optional.junit.JUnitTestRunner.launch(JUnitTestRunner.java:672)
	at org.apache.tools.ant.taskdefs.optional.junit.JUnitTestRunner.main(JUnitTestRunner.java:546)

Test: testEquals_ForeignImplClass: org.apache.harmony.lang.annotation.AllTypesTestjava.lang.NullPointerException
	at java.lang.reflect.Proxy.newProxyInstance(Proxy.java:200)
	at org.apache.harmony.lang.annotation.AnnotationFactory.createAnnotation(AnnotationFactory.java:102)
	at org.apache.harmony.vm.VMGenericsAndAnnotations.getDeclaredAnnotations(VMGenericsAndAnnotations.java)
	at java.lang.Class$GACache.getAllAnnotations(Class.java:1338)
	at java.lang.Class.getAnnotation(Class.java:890)
	at org.apache.harmony.lang.annotation.AllTypesTest.testEquals_ForeignImpl(AllTypesTest.java:131)
	at java.lang.reflect.VMReflection.invokeMethod(VMReflection.java)
	at java.lang.reflect.Method.invoke(Method.java:317)
	at junit.framework.TestCase.runTest(TestCase.java:164)
	at junit.framework.TestCase.runBare(TestCase.java:130)
	at junit.framework.TestResult$1.protect(TestResult.java:106)
	at junit.framework.TestResult.runProtected(TestResult.java:124)
	at junit.framework.TestResult.run(TestResult.java:109)
	at junit.framework.TestCase.run(TestCase.java:120)
	at junit.framework.TestSuite.runTest(TestSuite.java:230)
	at junit.framework.TestSuite.run(TestSuite.java:225)
	at org.apache.tools.ant.taskdefs.optional.junit.JUnitTestRunner.run(JUnitTestRunner.java:297)
	at org.apache.tools.ant.taskdefs.optional.junit.JUnitTestRunner.launch(JUnitTestRunner.java:672)
	at org.apache.tools.ant.taskdefs.optional.junit.JUnitTestRunner.main(JUnitTestRunner.java:546)

Test: testToStringClass: org.apache.harmony.lang.annotation.AllTypesTestjava.lang.NullPointerException
	at java.lang.reflect.Proxy.newProxyInstance(Proxy.java:200)
	at org.apache.harmony.lang.annotation.AnnotationFactory.createAnnotation(AnnotationFactory.java:102)
	at org.apache.harmony.vm.VMGenericsAndAnnotations.getDeclaredAnnotations(VMGenericsAndAnnotations.java)
	at java.lang.Class$GACache.getAllAnnotations(Class.java:1338)
	at java.lang.Class.getAnnotation(Class.java:890)
	at org.apache.harmony.lang.annotation.AllTypesTest.testToString(AllTypesTest.java:140)
	at java.lang.reflect.VMReflection.invokeMethod(VMReflection.java)
	at java.lang.reflect.Method.invoke(Method.java:317)
	at junit.framework.TestCase.runTest(TestCase.java:164)
	at junit.framework.TestCase.runBare(TestCase.java:130)
	at junit.framework.TestResult$1.protect(TestResult.java:106)
	at junit.framework.TestResult.runProtected(TestResult.java:124)
	at junit.framework.TestResult.run(TestResult.java:109)
	at junit.framework.TestCase.run(TestCase.java:120)
	at junit.framework.TestSuite.runTest(TestSuite.java:230)
	at junit.framework.TestSuite.run(TestSuite.java:225)
	at org.apache.tools.ant.taskdefs.optional.junit.JUnitTestRunner.run(JUnitTestRunner.java:297)
	at org.apache.tools.ant.taskdefs.optional.junit.JUnitTestRunner.launch(JUnitTestRunner.java:672)
	at org.apache.tools.ant.taskdefs.optional.junit.JUnitTestRunner.main(JUnitTestRunner.java:546)

Test: testAnnotationTypeClass: org.apache.harmony.lang.annotation.AllTypesTestjava.lang.NullPointerException
	at java.lang.reflect.Proxy.newProxyInstance(Proxy.java:200)
	at org.apache.harmony.lang.annotation.AnnotationFactory.createAnnotation(AnnotationFactory.java:102)
	at org.apache.harmony.vm.VMGenericsAndAnnotations.getDeclaredAnnotations(VMGenericsAndAnnotations.java)
	at java.lang.Class$GACache.getAllAnnotations(Class.java:1338)
	at java.lang.Class.getAnnotation(Class.java:890)
	at org.apache.harmony.lang.annotation.AllTypesTest.testAnnotationType(AllTypesTest.java:151)
	at java.lang.reflect.VMReflection.invokeMethod(VMReflection.java)
	at java.lang.reflect.Method.invoke(Method.java:317)
	at junit.framework.TestCase.runTest(TestCase.java:164)
	at junit.framework.TestCase.runBare(TestCase.java:130)
	at junit.framework.TestResult$1.protect(TestResult.java:106)
	at junit.framework.TestResult.runProtected(TestResult.java:124)
	at junit.framework.TestResult.run(TestResult.java:109)
	at junit.framework.TestCase.run(TestCase.java:120)
	at junit.framework.TestSuite.runTest(TestSuite.java:230)
	at junit.framework.TestSuite.run(TestSuite.java:225)
	at org.apache.tools.ant.taskdefs.optional.junit.JUnitTestRunner.run(JUnitTestRunner.java:297)
	at org.apache.tools.ant.taskdefs.optional.junit.JUnitTestRunner.launch(JUnitTestRunner.java:672)
	at org.apache.tools.ant.taskdefs.optional.junit.JUnitTestRunner.main(JUnitTestRunner.java:546)

Test: testAnnotation_ElementErrorClass: org.apache.harmony.lang.annotation.AllTypesTestjava.lang.NullPointerException
	at java.lang.reflect.Proxy.newProxyInstance(Proxy.java:200)
	at org.apache.harmony.lang.annotation.AnnotationFactory.createAnnotation(AnnotationFactory.java:102)
	at org.apache.harmony.vm.VMGenericsAndAnnotations.getDeclaredAnnotations(VMGenericsAndAnnotations.java)
	at java.lang.reflect.Method$MethodData.getDeclaredAnnotations(Method.java:425)
	at java.lang.reflect.Method.getAnnotation(Method.java:85)
	at org.apache.harmony.lang.annotation.AllTypesTest.testAnnotation_ElementError(AllTypesTest.java:161)
	at java.lang.reflect.VMReflection.invokeMethod(VMReflection.java)
	at java.lang.reflect.Method.invoke(Method.java:317)
	at junit.framework.TestCase.runTest(TestCase.java:164)
	at junit.framework.TestCase.runBare(TestCase.java:130)
	at junit.framework.TestResult$1.protect(TestResult.java:106)
	at junit.framework.TestResult.runProtected(TestResult.java:124)
	at junit.framework.TestResult.run(TestResult.java:109)
	at junit.framework.TestCase.run(TestCase.java:120)
	at junit.framework.TestSuite.runTest(TestSuite.java:230)
	at junit.framework.TestSuite.run(TestSuite.java:225)
	at org.apache.tools.ant.taskdefs.optional.junit.JUnitTestRunner.run(JUnitTestRunner.java:297)
	at org.apache.tools.ant.taskdefs.optional.junit.JUnitTestRunner.launch(JUnitTestRunner.java:672)
	at org.apache.tools.ant.taskdefs.optional.junit.JUnitTestRunner.main(JUnitTestRunner.java:546)

Test: testSerializationClass: org.apache.harmony.lang.annotation.AllTypesTestjava.lang.NullPointerException
	at java.lang.reflect.Proxy.newProxyInstance(Proxy.java:200)
	at org.apache.harmony.lang.annotation.AnnotationFactory.createAnnotation(AnnotationFactory.java:102)
	at org.apache.harmony.vm.VMGenericsAndAnnotations.getDeclaredAnnotations(VMGenericsAndAnnotations.java)
	at java.lang.Class$GACache.getAllAnnotations(Class.java:1338)
	at java.lang.Class.getAnnotation(Class.java:890)
	at org.apache.harmony.lang.annotation.AllTypesTest.testSerialization(AllTypesTest.java:188)
	at java.lang.reflect.VMReflection.invokeMethod(VMReflection.java)
	at java.lang.reflect.Method.invoke(Method.java:317)
	at junit.framework.TestCase.runTest(TestCase.java:164)
	at junit.framework.TestCase.runBare(TestCase.java:130)
	at junit.framework.TestResult$1.protect(TestResult.java:106)
	at junit.framework.TestResult.runProtected(TestResult.java:124)
	at junit.framework.TestResult.run(TestResult.java:109)
	at junit.framework.TestCase.run(TestCase.java:120)
	at junit.framework.TestSuite.runTest(TestSuite.java:230)
	at junit.framework.TestSuite.run(TestSuite.java:225)
	at org.apache.tools.ant.taskdefs.optional.junit.JUnitTestRunner.run(JUnitTestRunner.java:297)
	at org.apache.tools.ant.taskdefs.optional.junit.JUnitTestRunner.launch(JUnitTestRunner.java:672)
	at org.apache.tools.ant.taskdefs.optional.junit.JUnitTestRunner.main(JUnitTestRunner.java:546)


***********************************************************
Modifications since last successful build:	(0)
            

Mime
View raw message