harmony-alerts mailing list archives

Site index · List index
Message view « Date » · « Thread »
Top « Date » · « Thread »
From nbe...@kc.rr.com
Subject [build-test alert] BUILD FAILED Windows XP x86: classlib-test
Date Mon, 18 Jun 2007 09:10:01 GMT
BUILD FAILED:
	Ant Error Message:
C:\harmony\buildtest2\scripts\cc-exec-adaptor.xml:101: The following error occurred while
executing this line: C:\harmony\buildtest2\adaptors\classlib-test\adaptor.xml:78: There were
CLASSLIB Unit Test failures.

Date of build:	06/18/2007 03:14:58
Time to build:	53 minutes 28 seconds
Last changed:	06/18/2007 03:02:02
Last log entry:	classlib

***********************************************************
Errors/Warnings:	(7)
            
[junit] Tests FAILED
BUILD FAILED
C:\harmony\buildtest2\build\checkouts\classlib\build.xml:169: The following error occurred
while executing this line:
C:\harmony\buildtest2\build\checkouts\classlib\make\build-test.xml:148: There were test failures.
Total time: 49 minutes 46 seconds
The execution FAILED with the following exception:
The following error occurred while executing this line:
C:\harmony\buildtest2\adaptors\classlib-test\adaptor.xml:78: There were CLASSLIB Unit Test
failures.

***********************************************************
Unit Tests: (22675)
        
failure: testCreateSubmitComponent javax.swing.text.html.FormView_FormInputElementTest
Unit Test Error Details:	(1)
                
Test: testCreateSubmitComponentClass: javax.swing.text.html.FormView_FormInputElementTestjunit.framework.AssertionFailedError:
Test interrupted due timeout
	at javax.swing.BasicSwingTestCase.runBare(BasicSwingTestCase.java:147)

***********************************************************
Modifications since last successful build:	(36)
            
add cc-classlib log20070618030202Lbuild.3 06/18/2007 03:02:02classlib
modified tonywu  /harmony/enhanced/classlib/trunk/modules/jndi/src/main/java/org/apache/harmony/jndi/provider/dns/Resolver.java
06/18/2007 02:38:47 Apply patch HARMONY-4201 ([classlib][jndi] Performance improvement for
JNDI module)
modified tonywu  /harmony/enhanced/classlib/trunk/modules/jndi/src/main/java/org/apache/harmony/jndi/provider/dns/ResolverCache.java
06/18/2007 02:38:47 Apply patch HARMONY-4201 ([classlib][jndi] Performance improvement for
JNDI module)
modified tonywu  /harmony/enhanced/classlib/trunk/modules/jndi/src/main/java/javax/naming/spi/NamingManager.java
06/18/2007 02:38:47 Apply patch HARMONY-4201 ([classlib][jndi] Performance improvement for
JNDI module)
modified tonywu  /harmony/enhanced/classlib/trunk/modules/jndi/src/main/java/org/apache/harmony/jndi/provider/dns/SList.java
06/18/2007 02:38:47 Apply patch HARMONY-4201 ([classlib][jndi] Performance improvement for
JNDI module)
modified tonywu  /harmony/enhanced/classlib/trunk/modules/jndi/src/main/java/org/apache/harmony/jndi/provider/dns/Resolver.java
06/18/2007 02:38:47 Apply patch HARMONY-4201 ([classlib][jndi] Performance improvement for
JNDI module)
modified tonywu  /harmony/enhanced/classlib/trunk/modules/jndi/src/main/java/org/apache/harmony/jndi/provider/dns/ResolverCache.java
06/18/2007 02:38:47 Apply patch HARMONY-4201 ([classlib][jndi] Performance improvement for
JNDI module)
modified tonywu  /harmony/enhanced/classlib/trunk/modules/jndi/src/main/java/javax/naming/spi/NamingManager.java
06/18/2007 02:38:47 Apply patch HARMONY-4201 ([classlib][jndi] Performance improvement for
JNDI module)
modified tonywu  /harmony/enhanced/classlib/trunk/modules/jndi/src/main/java/org/apache/harmony/jndi/provider/dns/SList.java
06/18/2007 02:38:47 Apply patch HARMONY-4201 ([classlib][jndi] Performance improvement for
JNDI module)
modified tonywu  /harmony/enhanced/classlib/trunk/modules/jndi/src/main/java/org/apache/harmony/jndi/provider/dns/Resolver.java
06/18/2007 02:38:47 Apply patch HARMONY-4201 ([classlib][jndi] Performance improvement for
JNDI module)
modified tonywu  /harmony/enhanced/classlib/trunk/modules/jndi/src/main/java/org/apache/harmony/jndi/provider/dns/ResolverCache.java
06/18/2007 02:38:47 Apply patch HARMONY-4201 ([classlib][jndi] Performance improvement for
JNDI module)
modified tonywu  /harmony/enhanced/classlib/trunk/modules/jndi/src/main/java/javax/naming/spi/NamingManager.java
06/18/2007 02:38:47 Apply patch HARMONY-4201 ([classlib][jndi] Performance improvement for
JNDI module)
modified tonywu  /harmony/enhanced/classlib/trunk/modules/jndi/src/main/java/org/apache/harmony/jndi/provider/dns/SList.java
06/18/2007 02:38:47 Apply patch HARMONY-4201 ([classlib][jndi] Performance improvement for
JNDI module)
add cc-classlib log20070618023645Lbuild.2 06/18/2007 02:36:45classlib
modified pyang  /harmony/enhanced/classlib/trunk/modules/luni/src/main/java/java/util/TreeMap.java
06/18/2007 02:31:14 Apply patch for HARMONY-4035([luni]TreeMap.remove should set removed entry
links to null to facilitate GC)
modified pyang  /harmony/enhanced/classlib/trunk/modules/luni/src/main/java/java/util/TreeMap.java
06/18/2007 02:31:14 Apply patch for HARMONY-4035([luni]TreeMap.remove should set removed entry
links to null to facilitate GC)
modified pyang  /harmony/enhanced/classlib/trunk/modules/luni/src/main/java/java/util/TreeMap.java
06/18/2007 02:31:14 Apply patch for HARMONY-4035([luni]TreeMap.remove should set removed entry
links to null to facilitate GC)
add cc-drlvm log20070615232436Lbuild.1 06/15/2007 23:24:36drlvm
add cc-classlib log20070615230706Lbuild.1 06/15/2007 23:07:06classlib
modified tellison  /harmony/enhanced/classlib/trunk/modules/luni/src/test/java/org/apache/harmony/luni/tests/java/lang/String2Test.java
06/15/2007 16:13:19 Apply regression test patch for HARMONY-4135 ([classlib][luni] InputStream
handles UTF-16 incorrectly)
modified tellison  /harmony/enhanced/classlib/trunk/modules/luni/src/test/java/org/apache/harmony/luni/tests/java/lang/String2Test.java
06/15/2007 16:13:19 Apply regression test patch for HARMONY-4135 ([classlib][luni] InputStream
handles UTF-16 incorrectly)
modified tellison  /harmony/enhanced/classlib/trunk/modules/luni/src/test/java/org/apache/harmony/luni/tests/java/lang/String2Test.java
06/15/2007 16:13:19 Apply regression test patch for HARMONY-4135 ([classlib][luni] InputStream
handles UTF-16 incorrectly)
modified tellison  /harmony/enhanced/classlib/trunk/modules/luni/src/main/native/luni/shared/nethelp.c
06/15/2007 15:45:51 Apply patch HARMONY-4068 ([classlib][luni] Jetty scenario fails on DRLVM
with access violation exception)
modified tellison  /harmony/enhanced/classlib/trunk/modules/luni/src/main/native/luni/shared/nethelp.c
06/15/2007 15:45:51 Apply patch HARMONY-4068 ([classlib][luni] Jetty scenario fails on DRLVM
with access violation exception)
modified tellison  /harmony/enhanced/classlib/trunk/modules/luni/src/main/native/luni/shared/nethelp.c
06/15/2007 15:45:51 Apply patch HARMONY-4068 ([classlib][luni] Jetty scenario fails on DRLVM
with access violation exception)
modified odeakin  /harmony/enhanced/classlib/trunk/modules/archive/src/main/java/java/util/jar/Attributes.java
06/15/2007 08:22:24 Apply patch HARMONY-4188 ([classlib][util] java.util.jar.Attributes.Name.hashCode()
returns the same value for any object)
modified odeakin  /harmony/enhanced/classlib/trunk/modules/archive/src/main/java/java/util/jar/Attributes.java
06/15/2007 08:22:24 Apply patch HARMONY-4188 ([classlib][util] java.util.jar.Attributes.Name.hashCode()
returns the same value for any object)
modified odeakin  /harmony/enhanced/classlib/trunk/modules/archive/src/main/java/java/util/jar/Attributes.java
06/15/2007 08:22:24 Apply patch HARMONY-4188 ([classlib][util] java.util.jar.Attributes.Name.hashCode()
returns the same value for any object)
modified gshimansky  /harmony/enhanced/drlvm/trunk/build/make/excludes/exclude.drlvm_smoke.windows.x86_64.jet
06/15/2007 05:48:28 Excluded gc.Mark because of bug HARMONY-4185
modified gshimansky  /harmony/enhanced/drlvm/trunk/build/make/excludes/exclude.drlvm_smoke.windows.x86_64.jit
06/15/2007 05:48:28 Excluded gc.Mark because of bug HARMONY-4185
modified tellison  /harmony/enhanced/classlib/trunk/modules/luni/src/test/java/tests/api/java/util/BitSetTest.java
06/15/2007 04:36:19 Tidy up test case.
modified tellison  /harmony/enhanced/classlib/trunk/modules/luni/src/test/java/tests/api/java/util/BitSetTest.java
06/15/2007 04:36:19 Tidy up test case.
modified tellison  /harmony/enhanced/classlib/trunk/modules/luni/src/test/java/tests/api/java/util/BitSetTest.java
06/15/2007 04:36:19 Tidy up test case.
modified tellison  /harmony/enhanced/classlib/trunk/modules/luni/src/test/java/tests/api/java/util/BitSetTest.java
06/15/2007 04:29:53 Allow for out of memory allocating large bitset for test.
modified tellison  /harmony/enhanced/classlib/trunk/modules/luni/src/test/java/tests/api/java/util/BitSetTest.java
06/15/2007 04:29:53 Allow for out of memory allocating large bitset for test.
modified tellison  /harmony/enhanced/classlib/trunk/modules/luni/src/test/java/tests/api/java/util/BitSetTest.java
06/15/2007 04:29:53 Allow for out of memory allocating large bitset for test.



Mime
View raw message