harmony-alerts mailing list archives

Site index · List index
Message view « Date » · « Thread »
Top « Date » · « Thread »
From nbe...@kc.rr.com
Subject [build-test alert] BUILD FAILED Windows XP x86: drlvm-test
Date Sat, 16 Jun 2007 09:40:18 GMT
BUILD FAILED:
	Ant Error Message:
C:\harmony\buildtest2\scripts\cc-exec-adaptor.xml:101: The following error occurred while
executing this line: C:\harmony\buildtest2\adaptors\drlvm-test\adaptor.xml:75: There were
drlvm-test failures

Date of build:	06/16/2007 00:33:57
Time to build:	245 minutes 26 seconds
Last changed:	06/15/2007 23:24:36
Last log entry:	drlvm

***********************************************************
Errors/Warnings:	(23)
            
[java] Java Result: 1
[java] Java Result: 1
[java] Java Result: 130
[java] Java Result: 1
[java] Java Result: 1
[java] Java Result: 130
[java] Java Result: 1
[java] Java Result: 1
[java] Java Result: 130
[java] Java Result: 1
[java] Java Result: 1
[java] Java Result: 130
[java] Java Result: 1
[java] Java Result: 1
[java] Java Result: 130
[junit] Tests FAILED
BUILD FAILED
C:\harmony\buildtest2\build\checkouts\drlvm\build\make\build.xml:400: The following error
occurred while executing this line:
C:\harmony\buildtest2\build\checkouts\drlvm\build\make\build_component.xml:73: The following
error occurred while executing this line:
C:\harmony\buildtest2\build\checkouts\drlvm\build\win_ia32_msvc_debug\semis\build\targets\test.xml:6:
Some tests failed
Total time: 244 minutes 9 seconds
The execution FAILED with the following exception:
The following error occurred while executing this line:
C:\harmony\buildtest2\adaptors\drlvm-test\adaptor.xml:75: There were drlvm-test failures

***********************************************************
Unit Tests: (4331)
        
failure: test_exec_Str java.lang.RuntimeTest2
Unit Test Error Details:	(1)
                
Test: test_exec_StrClass: java.lang.RuntimeTest2junit.framework.AssertionFailedError: check001:
the date's reply has not been received
	at junit.framework.Assert.fail(Assert.java:47)
	at java.lang.RuntimeTest2.exec_StrForWindows(RuntimeTest2.java:295)
	at java.lang.RuntimeTest2.test_exec_Str(RuntimeTest2.java:362)
	at java.lang.reflect.VMReflection.invokeMethod(VMReflection.java)
	at java.lang.reflect.Method.invoke(Method.java:317)
	at junit.framework.TestCase.runTest(TestCase.java:164)
	at junit.framework.TestCase.runBare(TestCase.java)
	at junit.framework.TestResult$1.protect(TestResult.java)
	at junit.framework.TestResult.runProtected(TestResult.java)
	at junit.framework.TestResult.run(TestResult.java)
	at junit.framework.TestCase.run(TestCase.java)
	at junit.framework.TestSuite.runTest(TestSuite.java)
	at junit.framework.TestSuite.run(TestSuite.java)
	at org.apache.tools.ant.taskdefs.optional.junit.JUnitTestRunner.run(JUnitTestRunner.java)
	at org.apache.tools.ant.taskdefs.optional.junit.JUnitTestRunner.launch(JUnitTestRunner.java:672)
	at org.apache.tools.ant.taskdefs.optional.junit.JUnitTestRunner.main(JUnitTestRunner.java:546)

***********************************************************
Modifications since last successful build:	(36)
            
add cc-drlvm log20070615232436Lbuild.1 06/15/2007 23:24:36drlvm
add cc-classlib log20070615230706Lbuild.1 06/15/2007 23:07:06classlib
modified tellison  /harmony/enhanced/classlib/trunk/modules/luni/src/test/java/org/apache/harmony/luni/tests/java/lang/String2Test.java
06/15/2007 16:13:19 Apply regression test patch for HARMONY-4135 ([classlib][luni] InputStream
handles UTF-16 incorrectly)
modified tellison  /harmony/enhanced/classlib/trunk/modules/luni/src/test/java/org/apache/harmony/luni/tests/java/lang/String2Test.java
06/15/2007 16:13:19 Apply regression test patch for HARMONY-4135 ([classlib][luni] InputStream
handles UTF-16 incorrectly)
modified tellison  /harmony/enhanced/classlib/trunk/modules/luni/src/test/java/org/apache/harmony/luni/tests/java/lang/String2Test.java
06/15/2007 16:13:19 Apply regression test patch for HARMONY-4135 ([classlib][luni] InputStream
handles UTF-16 incorrectly)
modified tellison  /harmony/enhanced/classlib/trunk/modules/luni/src/test/java/org/apache/harmony/luni/tests/java/lang/String2Test.java
06/15/2007 16:13:19 Apply regression test patch for HARMONY-4135 ([classlib][luni] InputStream
handles UTF-16 incorrectly)
modified tellison  /harmony/enhanced/classlib/trunk/modules/luni/src/test/java/org/apache/harmony/luni/tests/java/lang/String2Test.java
06/15/2007 16:13:19 Apply regression test patch for HARMONY-4135 ([classlib][luni] InputStream
handles UTF-16 incorrectly)
modified tellison  /harmony/enhanced/classlib/trunk/modules/luni/src/test/java/org/apache/harmony/luni/tests/java/lang/String2Test.java
06/15/2007 16:13:19 Apply regression test patch for HARMONY-4135 ([classlib][luni] InputStream
handles UTF-16 incorrectly)
modified tellison  /harmony/enhanced/classlib/trunk/modules/luni/src/main/native/luni/shared/nethelp.c
06/15/2007 15:45:51 Apply patch HARMONY-4068 ([classlib][luni] Jetty scenario fails on DRLVM
with access violation exception)
modified tellison  /harmony/enhanced/classlib/trunk/modules/luni/src/main/native/luni/shared/nethelp.c
06/15/2007 15:45:51 Apply patch HARMONY-4068 ([classlib][luni] Jetty scenario fails on DRLVM
with access violation exception)
modified tellison  /harmony/enhanced/classlib/trunk/modules/luni/src/main/native/luni/shared/nethelp.c
06/15/2007 15:45:51 Apply patch HARMONY-4068 ([classlib][luni] Jetty scenario fails on DRLVM
with access violation exception)
modified tellison  /harmony/enhanced/classlib/trunk/modules/luni/src/main/native/luni/shared/nethelp.c
06/15/2007 15:45:51 Apply patch HARMONY-4068 ([classlib][luni] Jetty scenario fails on DRLVM
with access violation exception)
modified tellison  /harmony/enhanced/classlib/trunk/modules/luni/src/main/native/luni/shared/nethelp.c
06/15/2007 15:45:51 Apply patch HARMONY-4068 ([classlib][luni] Jetty scenario fails on DRLVM
with access violation exception)
modified tellison  /harmony/enhanced/classlib/trunk/modules/luni/src/main/native/luni/shared/nethelp.c
06/15/2007 15:45:51 Apply patch HARMONY-4068 ([classlib][luni] Jetty scenario fails on DRLVM
with access violation exception)
modified odeakin  /harmony/enhanced/classlib/trunk/modules/archive/src/main/java/java/util/jar/Attributes.java
06/15/2007 08:22:24 Apply patch HARMONY-4188 ([classlib][util] java.util.jar.Attributes.Name.hashCode()
returns the same value for any object)
modified odeakin  /harmony/enhanced/classlib/trunk/modules/archive/src/main/java/java/util/jar/Attributes.java
06/15/2007 08:22:24 Apply patch HARMONY-4188 ([classlib][util] java.util.jar.Attributes.Name.hashCode()
returns the same value for any object)
modified odeakin  /harmony/enhanced/classlib/trunk/modules/archive/src/main/java/java/util/jar/Attributes.java
06/15/2007 08:22:24 Apply patch HARMONY-4188 ([classlib][util] java.util.jar.Attributes.Name.hashCode()
returns the same value for any object)
modified odeakin  /harmony/enhanced/classlib/trunk/modules/archive/src/main/java/java/util/jar/Attributes.java
06/15/2007 08:22:24 Apply patch HARMONY-4188 ([classlib][util] java.util.jar.Attributes.Name.hashCode()
returns the same value for any object)
modified odeakin  /harmony/enhanced/classlib/trunk/modules/archive/src/main/java/java/util/jar/Attributes.java
06/15/2007 08:22:24 Apply patch HARMONY-4188 ([classlib][util] java.util.jar.Attributes.Name.hashCode()
returns the same value for any object)
modified odeakin  /harmony/enhanced/classlib/trunk/modules/archive/src/main/java/java/util/jar/Attributes.java
06/15/2007 08:22:24 Apply patch HARMONY-4188 ([classlib][util] java.util.jar.Attributes.Name.hashCode()
returns the same value for any object)
modified gshimansky  /harmony/enhanced/drlvm/trunk/build/make/excludes/exclude.drlvm_smoke.windows.x86_64.jet
06/15/2007 05:48:28 Excluded gc.Mark because of bug HARMONY-4185
modified gshimansky  /harmony/enhanced/drlvm/trunk/build/make/excludes/exclude.drlvm_smoke.windows.x86_64.jit
06/15/2007 05:48:28 Excluded gc.Mark because of bug HARMONY-4185
modified gshimansky  /harmony/enhanced/drlvm/trunk/build/make/excludes/exclude.drlvm_smoke.windows.x86_64.jet
06/15/2007 05:48:28 Excluded gc.Mark because of bug HARMONY-4185
modified gshimansky  /harmony/enhanced/drlvm/trunk/build/make/excludes/exclude.drlvm_smoke.windows.x86_64.jit
06/15/2007 05:48:28 Excluded gc.Mark because of bug HARMONY-4185
modified tellison  /harmony/enhanced/classlib/trunk/modules/luni/src/test/java/tests/api/java/util/BitSetTest.java
06/15/2007 04:36:19 Tidy up test case.
modified tellison  /harmony/enhanced/classlib/trunk/modules/luni/src/test/java/tests/api/java/util/BitSetTest.java
06/15/2007 04:36:19 Tidy up test case.
modified tellison  /harmony/enhanced/classlib/trunk/modules/luni/src/test/java/tests/api/java/util/BitSetTest.java
06/15/2007 04:36:19 Tidy up test case.
modified tellison  /harmony/enhanced/classlib/trunk/modules/luni/src/test/java/tests/api/java/util/BitSetTest.java
06/15/2007 04:36:19 Tidy up test case.
modified tellison  /harmony/enhanced/classlib/trunk/modules/luni/src/test/java/tests/api/java/util/BitSetTest.java
06/15/2007 04:36:19 Tidy up test case.
modified tellison  /harmony/enhanced/classlib/trunk/modules/luni/src/test/java/tests/api/java/util/BitSetTest.java
06/15/2007 04:36:19 Tidy up test case.
modified tellison  /harmony/enhanced/classlib/trunk/modules/luni/src/test/java/tests/api/java/util/BitSetTest.java
06/15/2007 04:29:53 Allow for out of memory allocating large bitset for test.
modified tellison  /harmony/enhanced/classlib/trunk/modules/luni/src/test/java/tests/api/java/util/BitSetTest.java
06/15/2007 04:29:53 Allow for out of memory allocating large bitset for test.
modified tellison  /harmony/enhanced/classlib/trunk/modules/luni/src/test/java/tests/api/java/util/BitSetTest.java
06/15/2007 04:29:53 Allow for out of memory allocating large bitset for test.
modified tellison  /harmony/enhanced/classlib/trunk/modules/luni/src/test/java/tests/api/java/util/BitSetTest.java
06/15/2007 04:29:53 Allow for out of memory allocating large bitset for test.
modified tellison  /harmony/enhanced/classlib/trunk/modules/luni/src/test/java/tests/api/java/util/BitSetTest.java
06/15/2007 04:29:53 Allow for out of memory allocating large bitset for test.
modified tellison  /harmony/enhanced/classlib/trunk/modules/luni/src/test/java/tests/api/java/util/BitSetTest.java
06/15/2007 04:29:53 Allow for out of memory allocating large bitset for test.



Mime
View raw message