harmony-alerts mailing list archives

Site index · List index
Message view « Date » · « Thread »
Top « Date » · « Thread »
From nbe...@kc.rr.com
Subject [build-test alert] BUILD FAILED Windows XP x86: classlib-test
Date Sat, 16 Jun 2007 05:33:55 GMT
BUILD FAILED:
	Ant Error Message:
C:\harmony\buildtest2\scripts\cc-exec-adaptor.xml:101: The following error occurred while
executing this line: C:\harmony\buildtest2\adaptors\classlib-test\adaptor.xml:78: There were
CLASSLIB Unit Test failures.

Date of build:	06/15/2007 23:41:49
Time to build:	50 minutes 54 seconds
Last changed:	06/15/2007 23:24:36
Last log entry:	drlvm

***********************************************************
Errors/Warnings:	(7)
            
[junit] Tests FAILED
BUILD FAILED
C:\harmony\buildtest2\build\checkouts\classlib\build.xml:169: The following error occurred
while executing this line:
C:\harmony\buildtest2\build\checkouts\classlib\make\build-test.xml:148: There were test failures.
Total time: 47 minutes 13 seconds
The execution FAILED with the following exception:
The following error occurred while executing this line:
C:\harmony\buildtest2\adaptors\classlib-test\adaptor.xml:78: There were CLASSLIB Unit Test
failures.

***********************************************************
Unit Tests: (22675)
        
failure: testCreateSubmitComponent javax.swing.text.html.FormView_FormInputElementTest
Unit Test Error Details:	(1)
                
Test: testCreateSubmitComponentClass: javax.swing.text.html.FormView_FormInputElementTestjunit.framework.AssertionFailedError:
Test interrupted due timeout
	at javax.swing.BasicSwingTestCase.runBare(BasicSwingTestCase.java:147)

***********************************************************
Modifications since last successful build:	(19)
            
add cc-drlvm log20070615232436Lbuild.1 06/15/2007 23:24:36drlvm
add cc-classlib log20070615230706Lbuild.1 06/15/2007 23:07:06classlib
modified tellison  /harmony/enhanced/classlib/trunk/modules/luni/src/test/java/org/apache/harmony/luni/tests/java/lang/String2Test.java
06/15/2007 16:13:19 Apply regression test patch for HARMONY-4135 ([classlib][luni] InputStream
handles UTF-16 incorrectly)
modified tellison  /harmony/enhanced/classlib/trunk/modules/luni/src/test/java/org/apache/harmony/luni/tests/java/lang/String2Test.java
06/15/2007 16:13:19 Apply regression test patch for HARMONY-4135 ([classlib][luni] InputStream
handles UTF-16 incorrectly)
modified tellison  /harmony/enhanced/classlib/trunk/modules/luni/src/test/java/org/apache/harmony/luni/tests/java/lang/String2Test.java
06/15/2007 16:13:19 Apply regression test patch for HARMONY-4135 ([classlib][luni] InputStream
handles UTF-16 incorrectly)
modified tellison  /harmony/enhanced/classlib/trunk/modules/luni/src/main/native/luni/shared/nethelp.c
06/15/2007 15:45:51 Apply patch HARMONY-4068 ([classlib][luni] Jetty scenario fails on DRLVM
with access violation exception)
modified tellison  /harmony/enhanced/classlib/trunk/modules/luni/src/main/native/luni/shared/nethelp.c
06/15/2007 15:45:51 Apply patch HARMONY-4068 ([classlib][luni] Jetty scenario fails on DRLVM
with access violation exception)
modified tellison  /harmony/enhanced/classlib/trunk/modules/luni/src/main/native/luni/shared/nethelp.c
06/15/2007 15:45:51 Apply patch HARMONY-4068 ([classlib][luni] Jetty scenario fails on DRLVM
with access violation exception)
modified odeakin  /harmony/enhanced/classlib/trunk/modules/archive/src/main/java/java/util/jar/Attributes.java
06/15/2007 08:22:24 Apply patch HARMONY-4188 ([classlib][util] java.util.jar.Attributes.Name.hashCode()
returns the same value for any object)
modified odeakin  /harmony/enhanced/classlib/trunk/modules/archive/src/main/java/java/util/jar/Attributes.java
06/15/2007 08:22:24 Apply patch HARMONY-4188 ([classlib][util] java.util.jar.Attributes.Name.hashCode()
returns the same value for any object)
modified odeakin  /harmony/enhanced/classlib/trunk/modules/archive/src/main/java/java/util/jar/Attributes.java
06/15/2007 08:22:24 Apply patch HARMONY-4188 ([classlib][util] java.util.jar.Attributes.Name.hashCode()
returns the same value for any object)
modified gshimansky  /harmony/enhanced/drlvm/trunk/build/make/excludes/exclude.drlvm_smoke.windows.x86_64.jet
06/15/2007 05:48:28 Excluded gc.Mark because of bug HARMONY-4185
modified gshimansky  /harmony/enhanced/drlvm/trunk/build/make/excludes/exclude.drlvm_smoke.windows.x86_64.jit
06/15/2007 05:48:28 Excluded gc.Mark because of bug HARMONY-4185
modified tellison  /harmony/enhanced/classlib/trunk/modules/luni/src/test/java/tests/api/java/util/BitSetTest.java
06/15/2007 04:36:19 Tidy up test case.
modified tellison  /harmony/enhanced/classlib/trunk/modules/luni/src/test/java/tests/api/java/util/BitSetTest.java
06/15/2007 04:36:19 Tidy up test case.
modified tellison  /harmony/enhanced/classlib/trunk/modules/luni/src/test/java/tests/api/java/util/BitSetTest.java
06/15/2007 04:36:19 Tidy up test case.
modified tellison  /harmony/enhanced/classlib/trunk/modules/luni/src/test/java/tests/api/java/util/BitSetTest.java
06/15/2007 04:29:53 Allow for out of memory allocating large bitset for test.
modified tellison  /harmony/enhanced/classlib/trunk/modules/luni/src/test/java/tests/api/java/util/BitSetTest.java
06/15/2007 04:29:53 Allow for out of memory allocating large bitset for test.
modified tellison  /harmony/enhanced/classlib/trunk/modules/luni/src/test/java/tests/api/java/util/BitSetTest.java
06/15/2007 04:29:53 Allow for out of memory allocating large bitset for test.



Mime
View raw message