harmony-alerts mailing list archives

Site index · List index
Message view « Date » · « Thread »
Top « Date » · « Thread »
From nom...@intel.com
Subject [build-test alert] BUILD FAILED LINUX SUSE 9 x86: jdktools_test
Date Fri, 15 Jun 2007 22:27:34 GMT
BUILD FAILED:
	Ant Error Message:
/export/cruise_hdk/cc/projects/trunk/working_jdktools/build.xml:242: The following error occurred
while executing this line: /export/cruise_hdk/cc/projects/trunk/working_jdktools/make/build-test.xml:97:
There were test errors.

Date of build:	06/16/2007 04:43:30
Time to build:	43 minutes 47 seconds
Last changed:	06/16/2007 04:13:19
Last log entry:	Apply regression test patch for HARMONY-4135 ([classlib][luni] InputStream
handles UTF-16 incorrectly)


***********************************************************
Execution log (errors/warnings messages):	
Result: 1

========================================
Testing jdktools binaries...
========================================
Compiling JPDA tests
Since fork is false, ignoring memoryMaximumSize setting
----------
1. WARNING in /export/cruise_hdk/cc/projects/trunk/working_jdktools/modules/jpda/test/common/unit/org/apache/harmony/jpda/tests/framework/DebuggeeRegister.java
 (at line 57)
	registered.add(debuggee); 
	^^^^^^^^^^^^^^^^^^^^^^^^
Type safety: The method add(Object) belongs to the raw type LinkedList. References to generic
type LinkedList<E> should be parameterized
----------
----------
2. WARNING in /export/cruise_hdk/cc/projects/trunk/working_jdktools/modules/jpda/test/common/unit/org/apache/harmony/jpda/tests/framework/TestOptions.java
 (at line 28)
	import java.io.File;
	       ^^^^^^^^^^^^
The import java.io.File is never used
----------
----------
3. WARNING in /export/cruise_hdk/cc/projects/trunk/working_jdktools/modules/jpda/test/common/unit/org/apache/harmony/jpda/tests/framework/jdwp/PacketDispatcher.java
 (at line 113)
	eventQueue.add(eventPacket);
	^^^^^^^^^^^^^^^^^^^^^^^^^^^
Type safety: The method add(Object) belongs to the raw type List. References to generic type
List<E> should be parameterized
----------
4. WARNING in /export/cruise_hdk/cc/projects/trunk/working_jdktools/modules/jpda/test/common/unit/org/apache/harmony/jpda/tests/framework/jdwp/PacketDispatcher.java
 (at line 248)
	replies.put(new Integer(replyPacket.getId()),
                                replyPacket);
	^^^^^^^^^^^^^^^^^^^^^^^^^^^^^^^^^^^^^^^^^^^^^^^^^^^^^^^^^^^^^^^^^^^^^^^^^^^^^^^^^^^^^^^^^^
Type safety: The method put(Object, Object) belongs to the raw type Hashtable. References
to generic type Hashtable<K,V> should be parameterized
----------
5. WARNING in /export/cruise_hdk/cc/projects/trunk/working_jdktools/modules/jpda/test/common/unit/org/apache/harmony/jpda/tests/framework/jdwp/PacketDispatcher.java
 (at line 283)
	commands.put(Id, command);
	^^^^^^^^^^^^^^^^^^^^^^^^^
Type safety: The method put(Object, Object) belongs to the raw type Hashtable. References
to generic type Hashtable<K,V> should be parameterized
----------
6. WARNING in /export/cruise_hdk/cc/projects/trunk/working_jdktools/modules/jpda/test/common/unit/org/apache/harmony/jpda/tests/framework/jdwp/PacketDispatcher.java
 (at line 354)
	commands.put(Id, command);
	^^^^^^^^^^^^^^^^^^^^^^^^^
Type safety: The method put(Object, Object) belongs to the raw type Hashtable. References
to generic type Hashtable<K,V> should be parameterized
----------
----------
7. WARNING in /export/cruise_hdk/cc/projects/trunk/working_jdktools/modules/jpda/test/common/unit/org/apache/harmony/jpda/tests/framework/jdwp/VmMirror.java
 (at line 1829)
	frames.add(frame);
	^^^^^^^^^^^^^^^^^
Type safety: The method add(Object) belongs to the raw type ArrayList. References to generic
type ArrayList<E> should be parameterized
----------
8. WARNING in /export/cruise_hdk/cc/projects/trunk/working_jdktools/modules/jpda/test/common/unit/org/apache/harmony/jpda/tests/framework/jdwp/VmMirror.java
 (at line 1897)
	vars.add(var);
	^^^^^^^^^^^^^
Type safety: The method add(Object) belongs to the raw type ArrayList. References to generic
type ArrayList<E> should be parameterized
----------
9. WARNING in /export/cruise_hdk/cc/projects/trunk/working_jdktools/modules/jpda/test/common/unit/org/apache/harmony/jpda/tests/framework/jdwp/VmMirror.java
 (at line 2117)
	fields.add(superClassFields.toArray()[i]);
	^^^^^^^^^^^^^^^^^^^^^^^^^^^^^^^^^^^^^^^^^
Type safety: The method add(Object) belongs to the raw type ArrayList. References to generic
type ArrayList<E> should be parameterized
----------
10. WARNING in /export/cruise_hdk/cc/projects/trunk/working_jdktools/modules/jpda/test/common/unit/org/apache/harmony/jpda/tests/framework/jdwp/VmMirror.java
 (at line 2127)
	fields.add(field);
	^^^^^^^^^^^^^^^^^
Type safety: The method add(Object) belongs to the raw type ArrayList. References to generic
type ArrayList<E> should be parameterized
----------
----------
11. WARNING in /export/cruise_hdk/cc/projects/trunk/working_jdktools/modules/jpda/test/common/unit/org/apache/harmony/jpda/tests/jdwp/Events/ExceptionTest.java
 (at line 187)
	long frameID = reply.getNextValueAsFrameID();
	     ^^^^^^^
The local variable frameID is never read
----------
----------
12. WARNING in /export/cruise_hdk/cc/projects/trunk/working_jdktools/modules/jpda/test/common/unit/org/apache/harmony/jpda/tests/jdwp/ThreadReference/FramesTest.java
 (at line 449)
	frames.add(new FrameStruct(frameID, loc));
	^^^^^^^^^^^^^^^^^^^^^^^^^^^^^^^^^^^^^^^^^
Type safety: The method add(Object) belongs to the raw type Vector. References to generic
type Vector<E> should be parameterized
----------
12 problems (12 warnings)
JPDA exclude list: /export/cruise_hdk/cc/projects/trunk/working_classlib/deploy/build/jdktools.jpda.exclude
Running JPDA tests
  Debugger JVM=/export/cruise_hdk/cc/projects/trunk/target/hdk/jdk/jre/bin/java
  Debuggee JVM=/export/cruise_hdk/cc/projects/trunk/target/hdk/jdk/jre/bin/java
The GC did not provide gc_add_weak_root_set_entry()
SAMSA exclude list: /export/cruise_hdk/cc/projects/trunk/working_classlib/deploy/build/jdktools.samsa.exclude
Running SAMSA tests
test.jre.home=/export/cruise_hdk/cc/projects/trunk/target/hdk/jdk/jre
Run jdk/bin/java -version in /export/cruise_hdk/cc/projects/trunk/working_jdktools/build/test_report
java version "1.5.0" 
pre-alpha : not complete or compatible
svn = r547780, (Jun 16 2007), Linux/ia32/gcc 3.3.3, release build
http://harmony.apache.org
Run jdk/bin/javac -version in /export/cruise_hdk/cc/projects/trunk/working_jdktools/build/test_report
Run jdk/bin/javah in /export/cruise_hdk/cc/projects/trunk/working_jdktools/build/test_report
Run jdk/bin/jarsigner in /export/cruise_hdk/cc/projects/trunk/working_jdktools/build/test_report
Run jdk/bin/keytool -help in /export/cruise_hdk/cc/projects/trunk/working_jdktools/build/test_report
Compiling TOOLS tests
Since fork is false, ignoring memoryMaximumSize setting
----------
1. WARNING in /export/cruise_hdk/cc/projects/trunk/working_jdktools/modules/tools/src/test/java/org/apache/harmony/tests/tools/javah/Test/Test01.java
 (at line 23)
	private static final long xxx2 = 1;
	                          ^^^^
The field Test01.xxx2 is never read locally
----------
1 problem (1 warning)
TOOLS exclude list: /export/cruise_hdk/cc/projects/trunk/working_classlib/deploy/build/jdktools.tools.exclude
Running TOOLS tests
test.jre.home=/export/cruise_hdk/cc/projects/trunk/target/hdk/jdk/jre
The GC did not provide gc_add_weak_root_set_entry()
The test report is in /export/cruise_hdk/cc/projects/trunk/working_jdktools/build/test_report/html/index.html

***********************************************************
Unit Tests: (136)
        
error: testStatus002 org.apache.harmony.jpda.tests.jdwp.ThreadReference.StatusTest
Unit Test Error Details:	(1)
                
Test: testStatus002Class: org.apache.harmony.jpda.tests.jdwp.ThreadReference.StatusTestorg.apache.harmony.jpda.tests.framework.TestErrorException:
Debuggee process did not finish during timeout
	at org.apache.harmony.jpda.tests.jdwp.share.JDWPUnitDebuggeeWrapper.WaitForProcessExit(JDWPUnitDebuggeeWrapper.java:212)
	at org.apache.harmony.jpda.tests.jdwp.share.JDWPUnitDebuggeeWrapper.stop(JDWPUnitDebuggeeWrapper.java:131)
	at org.apache.harmony.jpda.tests.jdwp.share.JDWPTestCase.internalTearDown(JDWPTestCase.java:84)
	at org.apache.harmony.jpda.tests.jdwp.share.JDWPSyncTestCase.internalTearDown(JDWPSyncTestCase.java:75)
	at org.apache.harmony.jpda.tests.jdwp.share.JDWPRawTestCase.tearDown(JDWPRawTestCase.java:110)
Caused by: java.lang.IllegalThreadStateException: process has not exited
	at java.lang.Runtime$SubProcess.exitValue(Runtime.java:357)
	at org.apache.harmony.jpda.tests.jdwp.share.JDWPUnitDebuggeeWrapper.WaitForProcessExit(JDWPUnitDebuggeeWrapper.java:207)
	at org.apache.harmony.jpda.tests.jdwp.share.JDWPUnitDebuggeeWrapper.stop(JDWPUnitDebuggeeWrapper.java:131)
	... 13 more


***********************************************************
Modifications since last successful build:	(2)
            
modified tellison  /harmony/enhanced/classlib/trunk/modules/luni/src/test/java/org/apache/harmony/luni/tests/java/lang/String2Test.java
06/16/2007 04:13:19 Apply regression test patch for HARMONY-4135 ([classlib][luni] InputStream
handles UTF-16 incorrectly)
modified tellison  /harmony/enhanced/classlib/trunk/modules/luni/src/main/native/luni/shared/nethelp.c
06/16/2007 03:45:51 Apply patch HARMONY-4068 ([classlib][luni] Jetty scenario fails on DRLVM
with access violation exception)

Mime
View raw message