harmony-alerts mailing list archives

Site index · List index
Message view « Date » · « Thread »
Top « Date » · « Thread »
From nbe...@kc.rr.com
Subject [build-test alert] BUILD FAILED Windows XP x86: jdktools-test
Date Fri, 15 Jun 2007 04:11:34 GMT
BUILD FAILED:
	Ant Error Message:
C:\harmony\buildtest2\scripts\cc-exec-adaptor.xml:101: The following error occurred while
executing this line: C:\harmony\buildtest2\adaptors\jdktools-test\adaptor.xml:23: The following
error occurred while executing this line: C:\harmony\buildtest2\scripts\framework.xml:1067:
C:\harmony\buildtest2\build\checkouts\hdk\working_jdktools is not a valid directory

Date of build:	06/14/2007 23:11:20
Time to build:	1 second

***********************************************************
Errors/Warnings:	(1)
            
The execution FAILED with the following exception:
The following error occurred while executing this line:
C:\harmony\buildtest2\adaptors\jdktools-test\adaptor.xml:23: The following error occurred
while executing this line:
C:\harmony\buildtest2\scripts\framework.xml:1067: C:\harmony\buildtest2\build\checkouts\hdk\working_jdktools
is not a valid directory

***********************************************************
Unit Tests: (0)
        
No Tests Run: This project doesn't have any tests

***********************************************************
Modifications since last successful build:	(0)
            



Mime
View raw message