harmony-alerts mailing list archives

Site index · List index
Message view « Date » · « Thread »
Top « Date » · « Thread »
From nom...@hursley.ibm.com
Subject [continuum] BUILD FAILURE: Classlib/linux.ia32 Build/Test
Date Wed, 13 Jun 2007 16:49:24 GMT
Online report : http://people.apache.org/~hindessm/continuum/classlib/linux.ia32/2007/06/13/20070613-164924.failure.log.gz
Build statistics:
  State: Failed
  Previous State: Ok
  Started at: Wed, 13 Jun 2007 17:45:52 +0100
  Finished at: Wed, 13 Jun 2007 17:49:22 +0100
  Total time: 3m 30s
  Build Trigger: Schedule
  Exit code: 1
  Building machine hostname: hy2
  Operating system : Linux(unknown)
  Java version : 1.5.0_06(Sun Microsystems Inc.)

Changes
                            classlib/modules/awt/src/test/api/java/common/java/awt/geom/AreaTest.java
            classlib/modules/awt/src/main/java/common/java/awt/geom/Area.java
        
****************************************************************************
Output:
****************************************************************************
Buildfile: build.xml

svn-prop:

build:
   [delete] Deleting directory /home/hybld/continuum-working-directory/6/classlib/deploy
     [echo] Classlib revision is 546951
     [echo] Post process: true
     [echo] JAPI: true
     [echo] Building with reference jdk/javac
     [exec] Buildfile: build.xml

     [exec] -init-hdk-for-clean:
     [exec]     [mkdir] Created dir: /home/hybld/continuum-working-directory/6/classlib/deploy/build/ant
     [exec]      [copy] Copying 1 file to /home/hybld/continuum-working-directory/6/classlib/deploy/build/ant

     [exec] clean-java:

     [exec] -modules-clean-bin:

     [exec] clean:
     [exec]    [delete] Deleting 30 files from /home/hybld/continuum-working-directory/6/classlib/build/classes
     [exec]    [delete] Deleting 12 files from /home/hybld/continuum-working-directory/6/classlib/modules/accessibility/bin/test

     [exec] clean:
     [exec]    [delete] Deleting 13 files from /home/hybld/continuum-working-directory/6/classlib/build/classes
     [exec]    [delete] Deleting 5 files from /home/hybld/continuum-working-directory/6/classlib/modules/annotation/bin/test

     [exec] clean:
     [exec]    [delete] Deleting 35 files from /home/hybld/continuum-working-directory/6/classlib/build/classes
     [exec]    [delete] Deleting 1 files from /home/hybld/continuum-working-directory/6/classlib/modules/applet/bin/test

     [exec] clean:
     [exec]    [delete] Deleting 42 files from /home/hybld/continuum-working-directory/6/classlib/build/classes
     [exec]    [delete] Deleting 36 files from /home/hybld/continuum-working-directory/6/classlib/modules/archive/bin/test

     [exec] clean-native-includes:
     [exec]    [delete] /home/hybld/continuum-working-directory/6/classlib/deploy/include
not found.

     [exec] clean:
     [exec]    [delete] Deleting 112 files from /home/hybld/continuum-working-directory/6/classlib/build/classes
     [exec]    [delete] Deleting 226 files from /home/hybld/continuum-working-directory/6/classlib/modules/auth/bin/test

     [exec] clean:
     [exec]    [delete] Deleting 917 files from /home/hybld/continuum-working-directory/6/classlib/build/classes
     [exec]    [delete] Deleting 540 files from /home/hybld/continuum-working-directory/6/classlib/modules/awt/bin/test

     [exec] clean:
     [exec]    [delete] Deleting 107 files from /home/hybld/continuum-working-directory/6/classlib/build/classes
     [exec]    [delete] Deleting 256 files from /home/hybld/continuum-working-directory/6/classlib/modules/beans/bin/test

     [exec] clean:
     [exec]    [delete] Deleting 125 files from /home/hybld/continuum-working-directory/6/classlib/build/classes
     [exec]    [delete] /home/hybld/continuum-working-directory/6/classlib/modules/concurrent/bin/test
not found.

     [exec] clean:
     [exec]    [delete] Deleting 48 files from /home/hybld/continuum-working-directory/6/classlib/build/classes
     [exec]    [delete] Deleting 90 files from /home/hybld/continuum-working-directory/6/classlib/modules/crypto/bin/test

     [exec] clean:
     [exec]    [delete] Deleting 93 files from /home/hybld/continuum-working-directory/6/classlib/build/classes
     [exec]    [delete] Deleting 3 files from /home/hybld/continuum-working-directory/6/classlib/modules/imageio/bin/test

     [exec] clean:
     [exec]    [delete] Deleting 9 files from /home/hybld/continuum-working-directory/6/classlib/build/classes
     [exec]    [delete] Deleting 20 files from /home/hybld/continuum-working-directory/6/classlib/modules/instrument/bin/test

     [exec] clean:
     [exec]    [delete] Deleting 177 files from /home/hybld/continuum-working-directory/6/classlib/build/classes
     [exec]    [delete] Deleting 195 files from /home/hybld/continuum-working-directory/6/classlib/modules/jndi/bin/test

     [exec] clean:
     [exec]    [delete] Deleting 43 files from /home/hybld/continuum-working-directory/6/classlib/build/classes
     [exec]    [delete] Deleting 18 files from /home/hybld/continuum-working-directory/6/classlib/modules/lang-management/bin/api
     [exec]    [delete] Deleting 16 files from /home/hybld/continuum-working-directory/6/classlib/modules/lang-management/bin/impl

     [exec] clean:
     [exec]    [delete] Deleting 34 files from /home/hybld/continuum-working-directory/6/classlib/build/classes
     [exec]    [delete] Deleting 100 files from /home/hybld/continuum-working-directory/6/classlib/modules/logging/bin/test

     [exec] clean:
     [exec]    [delete] Deleting 971 files from /home/hybld/continuum-working-directory/6/classlib/build/classes
     [exec]    [delete] Deleting 956 files from /home/hybld/continuum-working-directory/6/classlib/modules/luni/bin/test

     [exec] clean-native-includes:
     [exec]    [delete] /home/hybld/continuum-working-directory/6/classlib/deploy/include
not found.
     [exec]    [delete] /home/hybld/continuum-working-directory/6/classlib/deploy/jdk/include
not found.

     [exec] clean:
     [exec]    [delete] Deleting 29 files from /home/hybld/continuum-working-directory/6/classlib/build/classes

     [exec] clean:
     [exec]    [delete] Deleting 14 files from /home/hybld/continuum-working-directory/6/classlib/build/classes
     [exec]    [delete] Deleting 25 files from /home/hybld/continuum-working-directory/6/classlib/modules/math/bin/test

     [exec] clean:
     [exec]    [delete] Deleting 14 files from /home/hybld/continuum-working-directory/6/classlib/build/classes
     [exec]    [delete] Deleting 1 files from /home/hybld/continuum-working-directory/6/classlib/modules/misc/bin/test

     [exec] clean:
     [exec]    [delete] Deleting 142 files from /home/hybld/continuum-working-directory/6/classlib/build/classes
     [exec]    [delete] Deleted 5 directories from /home/hybld/continuum-working-directory/6/classlib/build/classes
     [exec]    [delete] Deleting 157 files from /home/hybld/continuum-working-directory/6/classlib/modules/nio/bin/test
     [exec]    [delete] Deleted 19 directories from /home/hybld/continuum-working-directory/6/classlib/modules/nio/bin/test

     [exec] clean:
     [exec]    [delete] Deleting 303 files from /home/hybld/continuum-working-directory/6/classlib/build/classes
     [exec]    [delete] Deleting 79 files from /home/hybld/continuum-working-directory/6/classlib/modules/nio_char/bin/test

     [exec] clean:
     [exec]    [delete] Deleting 44 files from /home/hybld/continuum-working-directory/6/classlib/build/classes
     [exec]    [delete] Deleting 19 files from /home/hybld/continuum-working-directory/6/classlib/modules/pack200/bin/test

     [exec] clean-native-includes:
     [exec]    [delete] /home/hybld/continuum-working-directory/6/classlib/deploy/include
not found.

     [exec] clean:

     [exec] clean:
     [exec]    [delete] Deleting 32 files from /home/hybld/continuum-working-directory/6/classlib/build/classes
     [exec]    [delete] Deleting 34 files from /home/hybld/continuum-working-directory/6/classlib/modules/prefs/bin/test

     [exec] clean:
     [exec]    [delete] Deleting 205 files from /home/hybld/continuum-working-directory/6/classlib/build/classes
     [exec]    [delete] Deleting 60 files from /home/hybld/continuum-working-directory/6/classlib/modules/print/bin/test

     [exec] clean:
     [exec]    [delete] Deleting 177 files from /home/hybld/continuum-working-directory/6/classlib/build/classes
     [exec]    [delete] Deleting 14 files from /home/hybld/continuum-working-directory/6/classlib/modules/regex/bin/test

     [exec] clean:
     [exec]    [delete] Deleting 230 files from /home/hybld/continuum-working-directory/6/classlib/build/classes
     [exec]    [delete] Deleting 53 files from /home/hybld/continuum-working-directory/6/classlib/modules/rmi/bin/test

     [exec] clean:
     [exec]    [delete] Deleting 429 files from /home/hybld/continuum-working-directory/6/classlib/build/classes
     [exec]    [delete] Deleting 622 files from /home/hybld/continuum-working-directory/6/classlib/modules/security/bin/test

     [exec] clean:
     [exec]    [delete] Deleting 2 files from /home/hybld/continuum-working-directory/6/classlib/build/classes

     [exec] clean:
     [exec]    [delete] Deleting 74 files from /home/hybld/continuum-working-directory/6/classlib/build/classes
     [exec]    [delete] Deleting 54 files from /home/hybld/continuum-working-directory/6/classlib/modules/sound/bin/test

     [exec] clean:
     [exec]    [delete] Deleting 84 files from /home/hybld/continuum-working-directory/6/classlib/build/classes
     [exec]    [delete] Deleting 75 files from /home/hybld/continuum-working-directory/6/classlib/modules/sql/bin/test

     [exec] clean:
     [exec]    [delete] Deleting 6 files from /home/hybld/continuum-working-directory/6/classlib/build/classes

     [exec] clean:
     [exec]    [delete] Deleting 1666 files from /home/hybld/continuum-working-directory/6/classlib/build/classes
     [exec]    [delete] Deleting 4 files from /home/hybld/continuum-working-directory/6/classlib/build/classes
     [exec]    [delete] Deleting 1880 files from /home/hybld/continuum-working-directory/6/classlib/modules/swing/bin/test

     [exec] clean:
     [exec]    [delete] Deleting 40 files from /home/hybld/continuum-working-directory/6/classlib/build/classes
     [exec]    [delete] Deleting 32 files from /home/hybld/continuum-working-directory/6/classlib/modules/text/bin/test

     [exec] clean:
     [exec]    [delete] Deleting 123 files from /home/hybld/continuum-working-directory/6/classlib/build/classes

...

     [exec] -compile:
     [exec]     [mkdir] Created dir: /home/hybld/continuum-working-directory/6/classlib/build/classes
     [exec]     [javac] Compiling 3741 source files to /home/hybld/continuum-working-directory/6/classlib/build/classes
     [exec]     [javac] ----------
     [exec]     [javac] 1. ERROR in /home/hybld/continuum-working-directory/6/classlib/modules/awt/src/main/java/common/java/awt/geom/Area.java
     [exec]     [javac]  (at line 24)
     [exec]     [javac] 	import org.apache.harmony.awt.internal.CrossingHelper;
     [exec]     [javac] 	       ^^^^^^^^^^^^^^^^^^^^^^^^^^^^^^^^^^^^^^^^^^^^^^
     [exec]     [javac] The import org.apache.harmony.awt.internal.CrossingHelper cannot be
resolved
     [exec]     [javac] ----------

...

     [exec]     [javac] 2. ERROR in /home/hybld/continuum-working-directory/6/classlib/modules/awt/src/main/java/common/java/awt/geom/Area.java
     [exec]     [javac]  (at line 25)
     [exec]     [javac] 	import org.apache.harmony.awt.internal.CurveCrossingHelper;
     [exec]     [javac] 	       ^^^^^^^^^^^^^^^^^^^^^^^^^^^^^^^^^^^^^^^^^^^^^^^^^^^
     [exec]     [javac] The import org.apache.harmony.awt.internal.CurveCrossingHelper cannot
be resolved
     [exec]     [javac] ----------

...

     [exec]     [javac] 3. ERROR in /home/hybld/continuum-working-directory/6/classlib/modules/awt/src/main/java/common/java/awt/geom/Area.java
     [exec]     [javac]  (at line 26)
     [exec]     [javac] 	import org.apache.harmony.awt.internal.GeometryUtil;
     [exec]     [javac] 	       ^^^^^^^^^^^^^^^^^^^^^^^^^^^^^^^^^^^^^^^^^^^^
     [exec]     [javac] The import org.apache.harmony.awt.internal.GeometryUtil cannot be
resolved
     [exec]     [javac] ----------

...

     [exec]     [javac] 4. ERROR in /home/hybld/continuum-working-directory/6/classlib/modules/awt/src/main/java/common/java/awt/geom/Area.java
     [exec]     [javac]  (at line 27)
     [exec]     [javac] 	import org.apache.harmony.awt.internal.IntersectPoint;
     [exec]     [javac] 	       ^^^^^^^^^^^^^^^^^^^^^^^^^^^^^^^^^^^^^^^^^^^^^^
     [exec]     [javac] The import org.apache.harmony.awt.internal.IntersectPoint cannot be
resolved
     [exec]     [javac] ----------

...

     [exec]     [javac] 5. ERROR in /home/hybld/continuum-working-directory/6/classlib/modules/awt/src/main/java/common/java/awt/geom/Area.java
     [exec]     [javac]  (at line 275)
     [exec]     [javac] 	CurveCrossingHelper crossHelper = new CurveCrossingHelper(
     [exec]     [javac] 	^^^^^^^^^^^^^^^^^^^
     [exec]     [javac] CurveCrossingHelper cannot be resolved to a type
     [exec]     [javac] ----------
     [exec]     [javac] 6. ERROR in /home/hybld/continuum-working-directory/6/classlib/modules/awt/src/main/java/common/java/awt/geom/Area.java
     [exec]     [javac]  (at line 275)
     [exec]     [javac] 	CurveCrossingHelper crossHelper = new CurveCrossingHelper(
     [exec]     [javac] 	                                      ^^^^^^^^^^^^^^^^^^^
     [exec]     [javac] CurveCrossingHelper cannot be resolved to a type
     [exec]     [javac] ----------

...

     [exec]     [javac] 7. ERROR in /home/hybld/continuum-working-directory/6/classlib/modules/awt/src/main/java/common/java/awt/geom/Area.java
     [exec]     [javac]  (at line 281)
     [exec]     [javac] 	IntersectPoint[] intersectPoints = crossHelper.findCrossing();
     [exec]     [javac] 	^^^^^^^^^^^^^^
     [exec]     [javac] IntersectPoint cannot be resolved to a type
     [exec]     [javac] ----------
     [exec]     [javac] 8. ERROR in /home/hybld/continuum-working-directory/6/classlib/modules/awt/src/main/java/common/java/awt/geom/Area.java
     [exec]     [javac]  (at line 313)
     [exec]     [javac] 	IntersectPoint point = intersectPoints[0];
     [exec]     [javac] 	^^^^^^^^^^^^^^
     [exec]     [javac] IntersectPoint cannot be resolved to a type
     [exec]     [javac] ----------
     [exec]     [javac] 9. ERROR in /home/hybld/continuum-working-directory/6/classlib/modules/awt/src/main/java/common/java/awt/geom/Area.java
     [exec]     [javac]  (at line 331)
     [exec]     [javac] 	IntersectPoint nextPoint = getNextIntersectPoint(intersectPoints,

     [exec]     [javac] 	^^^^^^^^^^^^^^
     [exec]     [javac] IntersectPoint cannot be resolved to a type
     [exec]     [javac] ----------
     [exec]     [javac] 10. ERROR in /home/hybld/continuum-working-directory/6/classlib/modules/awt/src/main/java/common/java/awt/geom/Area.java
     [exec]     [javac]  (at line 384)
     [exec]     [javac] 	CrossingHelper crossHelper = new CrossingHelper(new double[][] {coords,
     [exec]     [javac] 	^^^^^^^^^^^^^^
     [exec]     [javac] CrossingHelper cannot be resolved to a type
     [exec]     [javac] ----------
     [exec]     [javac] 11. ERROR in /home/hybld/continuum-working-directory/6/classlib/modules/awt/src/main/java/common/java/awt/geom/Area.java
     [exec]     [javac]  (at line 384)
     [exec]     [javac] 	CrossingHelper crossHelper = new CrossingHelper(new double[][] {coords,
     [exec]     [javac] 	                                 ^^^^^^^^^^^^^^
     [exec]     [javac] CrossingHelper cannot be resolved to a type
     [exec]     [javac] ----------
     [exec]     [javac] 12. ERROR in /home/hybld/continuum-working-directory/6/classlib/modules/awt/src/main/java/common/java/awt/geom/Area.java
     [exec]     [javac]  (at line 388)
     [exec]     [javac] 	IntersectPoint[] intersectPoints = crossHelper.findCrossing();
     [exec]     [javac] 	^^^^^^^^^^^^^^
     [exec]     [javac] IntersectPoint cannot be resolved to a type
     [exec]     [javac] ----------
     [exec]     [javac] 13. ERROR in /home/hybld/continuum-working-directory/6/classlib/modules/awt/src/main/java/common/java/awt/geom/Area.java
     [exec]     [javac]  (at line 419)
     [exec]     [javac] 	IntersectPoint point = intersectPoints[0];
     [exec]     [javac] 	^^^^^^^^^^^^^^
     [exec]     [javac] IntersectPoint cannot be resolved to a type
     [exec]     [javac] ----------
     [exec]     [javac] 14. ERROR in /home/hybld/continuum-working-directory/6/classlib/modules/awt/src/main/java/common/java/awt/geom/Area.java
     [exec]     [javac]  (at line 438)
     [exec]     [javac] 	IntersectPoint nextPoint = getNextIntersectPoint(intersectPoints,

     [exec]     [javac] 	^^^^^^^^^^^^^^
     [exec]     [javac] IntersectPoint cannot be resolved to a type
     [exec]     [javac] ----------
     [exec]     [javac] 15. ERROR in /home/hybld/continuum-working-directory/6/classlib/modules/awt/src/main/java/common/java/awt/geom/Area.java
     [exec]     [javac]  (at line 484)
     [exec]     [javac] 	CurveCrossingHelper crossHelper = new CurveCrossingHelper(
     [exec]     [javac] 	^^^^^^^^^^^^^^^^^^^
     [exec]     [javac] CurveCrossingHelper cannot be resolved to a type
     [exec]     [javac] ----------
     [exec]     [javac] 16. ERROR in /home/hybld/continuum-working-directory/6/classlib/modules/awt/src/main/java/common/java/awt/geom/Area.java
     [exec]     [javac]  (at line 484)
     [exec]     [javac] 	CurveCrossingHelper crossHelper = new CurveCrossingHelper(
     [exec]     [javac] 	                                      ^^^^^^^^^^^^^^^^^^^
     [exec]     [javac] CurveCrossingHelper cannot be resolved to a type
     [exec]     [javac] ----------

...

     [exec]     [javac] 17. ERROR in /home/hybld/continuum-working-directory/6/classlib/modules/awt/src/main/java/common/java/awt/geom/Area.java
     [exec]     [javac]  (at line 490)
     [exec]     [javac] 	IntersectPoint[] intersectPoints = crossHelper.findCrossing();
     [exec]     [javac] 	^^^^^^^^^^^^^^
     [exec]     [javac] IntersectPoint cannot be resolved to a type
     [exec]     [javac] ----------
     [exec]     [javac] 18. ERROR in /home/hybld/continuum-working-directory/6/classlib/modules/awt/src/main/java/common/java/awt/geom/Area.java
     [exec]     [javac]  (at line 511)
     [exec]     [javac] 	IntersectPoint point = intersectPoints[0];
     [exec]     [javac] 	^^^^^^^^^^^^^^
     [exec]     [javac] IntersectPoint cannot be resolved to a type
     [exec]     [javac] ----------
     [exec]     [javac] 19. ERROR in /home/hybld/continuum-working-directory/6/classlib/modules/awt/src/main/java/common/java/awt/geom/Area.java
     [exec]     [javac]  (at line 512)
     [exec]     [javac] 	IntersectPoint nextPoint = intersectPoints[0];
     [exec]     [javac] 	^^^^^^^^^^^^^^
     [exec]     [javac] IntersectPoint cannot be resolved to a type
     [exec]     [javac] ----------
     [exec]     [javac] 20. ERROR in /home/hybld/continuum-working-directory/6/classlib/modules/awt/src/main/java/common/java/awt/geom/Area.java
     [exec]     [javac]  (at line 601)
     [exec]     [javac] 	CrossingHelper crossHelper = new CrossingHelper(new double[][] {coords,

     [exec]     [javac] 	^^^^^^^^^^^^^^
     [exec]     [javac] CrossingHelper cannot be resolved to a type
     [exec]     [javac] ----------
     [exec]     [javac] 21. ERROR in /home/hybld/continuum-working-directory/6/classlib/modules/awt/src/main/java/common/java/awt/geom/Area.java
     [exec]     [javac]  (at line 601)
     [exec]     [javac] 	CrossingHelper crossHelper = new CrossingHelper(new double[][] {coords,

     [exec]     [javac] 	                                 ^^^^^^^^^^^^^^
     [exec]     [javac] CrossingHelper cannot be resolved to a type
     [exec]     [javac] ----------
     [exec]     [javac] 22. ERROR in /home/hybld/continuum-working-directory/6/classlib/modules/awt/src/main/java/common/java/awt/geom/Area.java
     [exec]     [javac]  (at line 605)
     [exec]     [javac] 	IntersectPoint[] intersectPoints = crossHelper.findCrossing();
     [exec]     [javac] 	^^^^^^^^^^^^^^
     [exec]     [javac] IntersectPoint cannot be resolved to a type
     [exec]     [javac] ----------
     [exec]     [javac] 23. ERROR in /home/hybld/continuum-working-directory/6/classlib/modules/awt/src/main/java/common/java/awt/geom/Area.java
     [exec]     [javac]  (at line 626)
     [exec]     [javac] 	IntersectPoint point = intersectPoints[0];
     [exec]     [javac] 	^^^^^^^^^^^^^^
     [exec]     [javac] IntersectPoint cannot be resolved to a type
     [exec]     [javac] ----------
     [exec]     [javac] 24. ERROR in /home/hybld/continuum-working-directory/6/classlib/modules/awt/src/main/java/common/java/awt/geom/Area.java
     [exec]     [javac]  (at line 648)
     [exec]     [javac] 	IntersectPoint nextPoint = getNextIntersectPoint(intersectPoints,

     [exec]     [javac] 	^^^^^^^^^^^^^^
     [exec]     [javac] IntersectPoint cannot be resolved to a type
     [exec]     [javac] ----------
     [exec]     [javac] 25. ERROR in /home/hybld/continuum-working-directory/6/classlib/modules/awt/src/main/java/common/java/awt/geom/Area.java
     [exec]     [javac]  (at line 697)
     [exec]     [javac] 	CurveCrossingHelper crossHelper = new CurveCrossingHelper(
     [exec]     [javac] 	^^^^^^^^^^^^^^^^^^^
     [exec]     [javac] CurveCrossingHelper cannot be resolved to a type
     [exec]     [javac] ----------
     [exec]     [javac] 26. ERROR in /home/hybld/continuum-working-directory/6/classlib/modules/awt/src/main/java/common/java/awt/geom/Area.java
     [exec]     [javac]  (at line 697)
     [exec]     [javac] 	CurveCrossingHelper crossHelper = new CurveCrossingHelper(
     [exec]     [javac] 	                                      ^^^^^^^^^^^^^^^^^^^
     [exec]     [javac] CurveCrossingHelper cannot be resolved to a type
     [exec]     [javac] ----------

...

     [exec]     [javac] 27. ERROR in /home/hybld/continuum-working-directory/6/classlib/modules/awt/src/main/java/common/java/awt/geom/Area.java
     [exec]     [javac]  (at line 703)
     [exec]     [javac] 	IntersectPoint[] intersectPoints = crossHelper.findCrossing();
     [exec]     [javac] 	^^^^^^^^^^^^^^
     [exec]     [javac] IntersectPoint cannot be resolved to a type
     [exec]     [javac] ----------
     [exec]     [javac] 28. ERROR in /home/hybld/continuum-working-directory/6/classlib/modules/awt/src/main/java/common/java/awt/geom/Area.java
     [exec]     [javac]  (at line 720)
     [exec]     [javac] 	IntersectPoint point = intersectPoints[0];
     [exec]     [javac] 	^^^^^^^^^^^^^^
     [exec]     [javac] IntersectPoint cannot be resolved to a type
     [exec]     [javac] ----------
     [exec]     [javac] 29. ERROR in /home/hybld/continuum-working-directory/6/classlib/modules/awt/src/main/java/common/java/awt/geom/Area.java
     [exec]     [javac]  (at line 739)
     [exec]     [javac] 	IntersectPoint nextPoint = (isCurrentArea) ? 
     [exec]     [javac] 	^^^^^^^^^^^^^^
     [exec]     [javac] IntersectPoint cannot be resolved to a type
     [exec]     [javac] ----------
     [exec]     [javac] 30. ERROR in /home/hybld/continuum-working-directory/6/classlib/modules/awt/src/main/java/common/java/awt/geom/Area.java
     [exec]     [javac]  (at line 811)
     [exec]     [javac] 	CrossingHelper crossHelper = new CrossingHelper(new double[][] {coords,

     [exec]     [javac] 	^^^^^^^^^^^^^^
     [exec]     [javac] CrossingHelper cannot be resolved to a type
     [exec]     [javac] ----------
     [exec]     [javac] 31. ERROR in /home/hybld/continuum-working-directory/6/classlib/modules/awt/src/main/java/common/java/awt/geom/Area.java
     [exec]     [javac]  (at line 811)
     [exec]     [javac] 	CrossingHelper crossHelper = new CrossingHelper(new double[][] {coords,

     [exec]     [javac] 	                                 ^^^^^^^^^^^^^^
     [exec]     [javac] CrossingHelper cannot be resolved to a type
     [exec]     [javac] ----------
     [exec]     [javac] 32. ERROR in /home/hybld/continuum-working-directory/6/classlib/modules/awt/src/main/java/common/java/awt/geom/Area.java
     [exec]     [javac]  (at line 815)
     [exec]     [javac] 	IntersectPoint[] intersectPoints = crossHelper.findCrossing();
     [exec]     [javac] 	^^^^^^^^^^^^^^
     [exec]     [javac] IntersectPoint cannot be resolved to a type
     [exec]     [javac] ----------
     [exec]     [javac] 33. ERROR in /home/hybld/continuum-working-directory/6/classlib/modules/awt/src/main/java/common/java/awt/geom/Area.java
     [exec]     [javac]  (at line 833)
     [exec]     [javac] 	IntersectPoint point = intersectPoints[0];
     [exec]     [javac] 	^^^^^^^^^^^^^^
     [exec]     [javac] IntersectPoint cannot be resolved to a type
     [exec]     [javac] ----------
     [exec]     [javac] 34. ERROR in /home/hybld/continuum-working-directory/6/classlib/modules/awt/src/main/java/common/java/awt/geom/Area.java
     [exec]     [javac]  (at line 855)
     [exec]     [javac] 	IntersectPoint nextPoint = (isCurrentArea) ? 
     [exec]     [javac] 	^^^^^^^^^^^^^^
     [exec]     [javac] IntersectPoint cannot be resolved to a type
     [exec]     [javac] ----------
     [exec]     [javac] 35. ERROR in /home/hybld/continuum-working-directory/6/classlib/modules/awt/src/main/java/common/java/awt/geom/Area.java
     [exec]     [javac]  (at line 935)
     [exec]     [javac] 	private IntersectPoint getNextIntersectPoint(IntersectPoint[] iPoints,
     [exec]     [javac] 	        ^^^^^^^^^^^^^^
     [exec]     [javac] IntersectPoint cannot be resolved to a type
     [exec]     [javac] ----------
     [exec]     [javac] 36. ERROR in /home/hybld/continuum-working-directory/6/classlib/modules/awt/src/main/java/common/java/awt/geom/Area.java
     [exec]     [javac]  (at line 935)
     [exec]     [javac] 	private IntersectPoint getNextIntersectPoint(IntersectPoint[] iPoints,
     [exec]     [javac] 	                                             ^^^^^^^^^^^^^^
     [exec]     [javac] IntersectPoint cannot be resolved to a type
     [exec]     [javac] ----------

...

     [exec]     [javac] 37. ERROR in /home/hybld/continuum-working-directory/6/classlib/modules/awt/src/main/java/common/java/awt/geom/Area.java
     [exec]     [javac]  (at line 936)
     [exec]     [javac] 	IntersectPoint isectPoint, 
     [exec]     [javac] 	^^^^^^^^^^^^^^
     [exec]     [javac] IntersectPoint cannot be resolved to a type
     [exec]     [javac] ----------
     [exec]     [javac] 38. ERROR in /home/hybld/continuum-working-directory/6/classlib/modules/awt/src/main/java/common/java/awt/geom/Area.java
     [exec]     [javac]  (at line 944)
     [exec]     [javac] 	IntersectPoint firstIsectPoint = null;
     [exec]     [javac] 	^^^^^^^^^^^^^^
     [exec]     [javac] IntersectPoint cannot be resolved to a type
     [exec]     [javac] ----------
     [exec]     [javac] 39. ERROR in /home/hybld/continuum-working-directory/6/classlib/modules/awt/src/main/java/common/java/awt/geom/Area.java
     [exec]     [javac]  (at line 945)
     [exec]     [javac] 	IntersectPoint nextIsectPoint = null;
     [exec]     [javac] 	^^^^^^^^^^^^^^
     [exec]     [javac] IntersectPoint cannot be resolved to a type
     [exec]     [javac] ----------
     [exec]     [javac] 40. ERROR in /home/hybld/continuum-working-directory/6/classlib/modules/awt/src/main/java/common/java/awt/geom/Area.java
     [exec]     [javac]  (at line 946)
     [exec]     [javac] 	for (IntersectPoint point : iPoints) {
     [exec]     [javac] 	     ^^^^^^^^^^^^^^
     [exec]     [javac] IntersectPoint cannot be resolved to a type
     [exec]     [javac] ----------
     [exec]     [javac] 41. ERROR in /home/hybld/continuum-working-directory/6/classlib/modules/awt/src/main/java/common/java/awt/geom/Area.java
     [exec]     [javac]  (at line 971)
     [exec]     [javac] 	private IntersectPoint getPrevIntersectPoint(IntersectPoint[] iPoints,
     [exec]     [javac] 	        ^^^^^^^^^^^^^^
     [exec]     [javac] IntersectPoint cannot be resolved to a type
     [exec]     [javac] ----------
     [exec]     [javac] 42. ERROR in /home/hybld/continuum-working-directory/6/classlib/modules/awt/src/main/java/common/java/awt/geom/Area.java
     [exec]     [javac]  (at line 971)
     [exec]     [javac] 	private IntersectPoint getPrevIntersectPoint(IntersectPoint[] iPoints,
     [exec]     [javac] 	                                             ^^^^^^^^^^^^^^
     [exec]     [javac] IntersectPoint cannot be resolved to a type
     [exec]     [javac] ----------

...

     [exec]     [javac] 43. ERROR in /home/hybld/continuum-working-directory/6/classlib/modules/awt/src/main/java/common/java/awt/geom/Area.java
     [exec]     [javac]  (at line 972)
     [exec]     [javac] 	IntersectPoint isectPoint, 
     [exec]     [javac] 	^^^^^^^^^^^^^^
     [exec]     [javac] IntersectPoint cannot be resolved to a type
     [exec]     [javac] ----------
     [exec]     [javac] 44. ERROR in /home/hybld/continuum-working-directory/6/classlib/modules/awt/src/main/java/common/java/awt/geom/Area.java
     [exec]     [javac]  (at line 981)
     [exec]     [javac] 	IntersectPoint firstIsectPoint = null;
     [exec]     [javac] 	^^^^^^^^^^^^^^
     [exec]     [javac] IntersectPoint cannot be resolved to a type
     [exec]     [javac] ----------
     [exec]     [javac] 45. ERROR in /home/hybld/continuum-working-directory/6/classlib/modules/awt/src/main/java/common/java/awt/geom/Area.java
     [exec]     [javac]  (at line 982)
     [exec]     [javac] 	IntersectPoint predIsectPoint = null;
     [exec]     [javac] 	^^^^^^^^^^^^^^
     [exec]     [javac] IntersectPoint cannot be resolved to a type
     [exec]     [javac] ----------
     [exec]     [javac] 46. ERROR in /home/hybld/continuum-working-directory/6/classlib/modules/awt/src/main/java/common/java/awt/geom/Area.java
     [exec]     [javac]  (at line 983)
     [exec]     [javac] 	for (IntersectPoint point : iPoints) {
     [exec]     [javac] 	     ^^^^^^^^^^^^^^
     [exec]     [javac] IntersectPoint cannot be resolved to a type
     [exec]     [javac] ----------
     [exec]     [javac] 47. ERROR in /home/hybld/continuum-working-directory/6/classlib/modules/awt/src/main/java/common/java/awt/geom/Area.java
     [exec]     [javac]  (at line 1013)
     [exec]     [javac] 	int resultCoordPos, IntersectPoint point, 
     [exec]     [javac] 	                    ^^^^^^^^^^^^^^
     [exec]     [javac] IntersectPoint cannot be resolved to a type
     [exec]     [javac] ----------
     [exec]     [javac] 48. ERROR in /home/hybld/continuum-working-directory/6/classlib/modules/awt/src/main/java/common/java/awt/geom/Area.java
     [exec]     [javac]  (at line 1061)
     [exec]     [javac] 	boolean isLeft = CrossingHelper.compare(coords[index],
     [exec]     [javac] 	                 ^^^^^^^^^^^^^^
     [exec]     [javac] CrossingHelper cannot be resolved
     [exec]     [javac] ----------
     [exec]     [javac] 49. ERROR in /home/hybld/continuum-working-directory/6/classlib/modules/awt/src/main/java/common/java/awt/geom/Area.java
     [exec]     [javac]  (at line 1075)
     [exec]     [javac] 	isLeft = CrossingHelper.compare(coords[index - 2],
     [exec]     [javac] 	         ^^^^^^^^^^^^^^
     [exec]     [javac] CrossingHelper cannot be resolved
     [exec]     [javac] ----------
     [exec]     [javac] 50. ERROR in /home/hybld/continuum-working-directory/6/classlib/modules/awt/src/main/java/common/java/awt/geom/Area.java
     [exec]     [javac]  (at line 1082)
     [exec]     [javac] 	GeometryUtil
     [exec]     [javac] 	^^^^^^^^^^^^
     [exec]     [javac] GeometryUtil cannot be resolved
     [exec]     [javac] ----------
     [exec]     [javac] 51. ERROR in /home/hybld/continuum-working-directory/6/classlib/modules/awt/src/main/java/common/java/awt/geom/Area.java
     [exec]     [javac]  (at line 1100)
     [exec]     [javac] 	isLeft = CrossingHelper.compare(coords[index - 2],
     [exec]     [javac] 	         ^^^^^^^^^^^^^^
     [exec]     [javac] CrossingHelper cannot be resolved
     [exec]     [javac] ----------
     [exec]     [javac] 52. ERROR in /home/hybld/continuum-working-directory/6/classlib/modules/awt/src/main/java/common/java/awt/geom/Area.java
     [exec]     [javac]  (at line 1102)
     [exec]     [javac] 	GeometryUtil.subCubic(coefs, point.getParam(isCurrentArea),
     [exec]     [javac] 	^^^^^^^^^^^^
     [exec]     [javac] GeometryUtil cannot be resolved
     [exec]     [javac] ----------
     [exec]     [javac] 53. ERROR in /home/hybld/continuum-working-directory/6/classlib/modules/awt/src/main/java/common/java/awt/geom/Area.java
     [exec]     [javac]  (at line 1178)
     [exec]     [javac] 	if (GeometryUtil.intersectLines(curX, curY, 
     [exec]     [javac] 	    ^^^^^^^^^^^^
     [exec]     [javac] GeometryUtil cannot be resolved
     [exec]     [javac] ----------
     [exec]     [javac] 54. ERROR in /home/hybld/continuum-working-directory/6/classlib/modules/awt/src/main/java/common/java/awt/geom/Area.java
     [exec]     [javac]  (at line 1187)
     [exec]     [javac] 	if (GeometryUtil.intersectLineAndQuad(x, y, x, y, 
     [exec]     [javac] 	    ^^^^^^^^^^^^
     [exec]     [javac] GeometryUtil cannot be resolved
     [exec]     [javac] ----------
     [exec]     [javac] 55. ERROR in /home/hybld/continuum-working-directory/6/classlib/modules/awt/src/main/java/common/java/awt/geom/Area.java

     [exec]     [javac]  (at line 1197)
     [exec]     [javac] 	if (GeometryUtil.intersectLineAndCubic(x, y, x, y, 
     [exec] BUILD FAILED
     [exec]     [javac] 	    ^^^^^^^^^^^^
     [exec]     [javac] GeometryUtil cannot be resolved
     [exec] /home/hybld/continuum-working-directory/6/classlib/build.xml:113: The following
error occurred while executing this line:
     [exec]     [javac] ----------
     [exec] /home/hybld/continuum-working-directory/6/classlib/make/build-java.xml:130: Compile
failed; see the compiler error output for details.
     [exec]     [javac] 56. ERROR in /home/hybld/continuum-working-directory/6/classlib/modules/awt/src/main/java/common/java/awt/geom/Area.java

     [exec]     [javac]  (at line 1207)
     [exec] Total time: 3 minutes 24 seconds
     [exec]     [javac] 	if (GeometryUtil.intersectLines(curX, curY, moveX, moveY,
     [exec]     [javac] 	    ^^^^^^^^^^^^
     [exec]     [javac] GeometryUtil cannot be resolved
     [exec]     [javac] ----------
     [exec]     [javac] 56 problems (56 errors)

BUILD FAILED
/home/hybld/continuum-working-directory/6/build.xml:128: exec returned: 1

Total time: 3 minutes 29 seconds

****************************************************************************

...

Mime
View raw message