harmony-alerts mailing list archives

Site index · List index
Message view « Date » · « Thread »
Top « Date » · « Thread »
From nom...@intel.com
Subject [build-test alert] BUILD FAILED Windows XP SP2 msvc debug: drlvm tests
Date Wed, 13 Jun 2007 04:50:36 GMT
BUILD FAILED:
	Ant Error Message:
C:\cruise\trunk\cc\projects\drlvm\trunk\build\make\build.xml:400: The following error occurred while executing this line: C:\cruise\trunk\cc\projects\drlvm\trunk\build\make\build_component.xml:73: The following error occurred while executing this line: C:\cruise\trunk\cc\projects\drlvm\trunk\build\win_ia32_msvc_debug\semis\build\targets\test.xml:6: Some tests failed

Date of build:	06/13/2007 10:21:19
Time to build:	88 minutes 48 seconds
Last changed:	06/12/2007 23:06:18
Last log entry:	Apply patch HARMONY-4134 ([classlib] [luni] Updated Javadoc for java.util.Scanner)

***********************************************************
Execution log (errors/warnings messages):	
Java Result: 1
Java Result: 130
Java Result: 1
Java Result: 1
Java Result: 130
Java Result: 3
Java Result: 3
Java Result: 3
Java Result: 3
Java Result: 3
Java Result: 3
Java Result: 3
Java Result: 3
Java Result: 3
Java Result: 3
Java Result: 3
Java Result: 3
Java Result: 3
Java Result: 3
Java Result: 3
Java Result: 3
Java Result: 3
Java Result: 3
Java Result: 3
Java Result: 3
Java Result: 3
Java Result: 3
Java Result: 3
Java Result: 3
Java Result: 3
Java Result: 3
Java Result: 3
Java Result: 3
Java Result: 3
Java Result: 3
Java Result: 3
Java Result: 3
Java Result: 3
Java Result: 3
Java Result: 3
Java Result: 3
Java Result: 3
Java Result: 3
Java Result: 3
Java Result: 3
Java Result: 3
Java Result: 3
Java Result: 3
Java Result: 3
Java Result: 3
Java Result: 3
Java Result: 3
Java Result: 3
Java Result: 3
Java Result: 3
Java Result: 3
Java Result: 3
Java Result: 3
Java Result: 3
Java Result: 3
Java Result: 3
Java Result: 3
Java Result: 3
Java Result: 3
Java Result: 3
Java Result: 3
Java Result: 3
Java Result: 3
Java Result: 3
Java Result: 3
Java Result: 3
Java Result: 3
Java Result: 3
Java Result: 3
Java Result: 3
Java Result: 3
Java Result: 3
Java Result: 3
Java Result: 3
Java Result: 3
Java Result: 3
Java Result: 3
Java Result: 3
Java Result: 3
Java Result: 3
Java Result: 3
Java Result: 3
Java Result: 3
Java Result: 3
Java Result: 3
Java Result: 3
Java Result: 3
Java Result: 3
Java Result: 3
Java Result: 3
Java Result: 3
Java Result: 3
Java Result: 3
Java Result: 3
Java Result: 3
Java Result: 3
Java Result: 3
Java Result: 3
Java Result: 3
Java Result: 3
Java Result: 3
Java Result: 3
Java Result: 3
Java Result: 3
Java Result: 3
Java Result: 3
Java Result: 3
Java Result: 3
Java Result: 3
Java Result: 3
Java Result: 3
Java Result: 3
Java Result: 3
Java Result: 3
Java Result: 3
Java Result: 3
Java Result: 3
Java Result: 3
Java Result: 3
Java Result: 3
Java Result: 3
Java Result: 3
Java Result: 3
Java Result: 3
Java Result: 3
Java Result: 3
Java Result: 3
Java Result: 3
Java Result: 3
Java Result: 3
Java Result: 3
Java Result: 3
Java Result: 3
Java Result: 3
Java Result: 3
Java Result: 3
Java Result: 3
Java Result: 3
Java Result: 3
Java Result: 3
Java Result: 3
Java Result: 3
Java Result: 3
Java Result: 3
Java Result: 3
Java Result: 3
Java Result: 3
Java Result: 3
Java Result: 3
Java Result: 3
Java Result: 3
Java Result: 3
Java Result: 3
Java Result: 3
Java Result: 3
Java Result: 3
Java Result: 3
Java Result: 3
Java Result: 3
Java Result: 3
Java Result: 3
Java Result: 3
Java Result: 3
Java Result: 3
Java Result: 3
Java Result: 3
Java Result: 3
Java Result: 3
Java Result: 3
Java Result: 3
Java Result: 3
Java Result: 3
Java Result: 3
Java Result: 3
Java Result: 3
Java Result: 3
Java Result: 3
Java Result: 3
Java Result: 3
Java Result: 3
Java Result: 3
Java Result: 3
Java Result: 3
Java Result: 3
Java Result: 3
Java Result: 3
Java Result: 3
Java Result: 3
Java Result: 3
Java Result: 3
Java Result: 3
Java Result: 3
Java Result: 3
Java Result: 3
Java Result: 3
Java Result: 3
Java Result: 3
Java Result: 3
Java Result: 3
Java Result: 3
Java Result: 3
Java Result: 3
Java Result: 3
Java Result: 3
Java Result: 3
Java Result: 3
Java Result: 3
Java Result: 3
Java Result: 3
Java Result: 3
Java Result: 3
Java Result: 3
Java Result: 3
Java Result: 3
Java Result: 3
Java Result: 3
Java Result: 3
Tests FAILED
Tests FAILED
Tests FAILED
 Using CLASSLIB = C:\cruise\trunk\cc\projects\classlib\trunk
jars: true
using proxy settings: proxy.ims.intel.com port:911
Configuration:
     Hosting Java = 1.5.0_08 (Sun Microsystems Inc.)
    classlib root = C:\cruise\trunk\cc\projects\classlib\trunk
               os = Windows
             arch = ia32
              cxx = msvc
              cfg = debug
     svn revision = 545756
       components = deploy
## Compiling JVMTI natives in: C:\cruise\trunk\cc\projects\drlvm\trunk\vm\tests\jvmti\Breakpoint1
## Compiling JVMTI natives in: C:\cruise\trunk\cc\projects\drlvm\trunk\vm\tests\jvmti\PopFrame1
## Compiling JVMTI natives in: C:\cruise\trunk\cc\projects\drlvm\trunk\vm\tests\jvmti\SingleStep1
## Compiling JVMTI natives in: C:\cruise\trunk\cc\projects\drlvm\trunk\vm\tests\jvmti\VMInit1

        ==================================
        Run JVMTI tests using interpreter
        ==================================
        
Running Breakpoint1
Running PopFrame1
Running SingleStep1
Running VMInit1

        ==================================
        Run JVMTI tests using jitrino.JET
        ==================================
        
Running Breakpoint1
Running PopFrame1
Running SingleStep1
Running VMInit1

        ==================================
        Run JVMTI tests using Client mode JIT (default)
        ==================================
        
Running Breakpoint1
Running PopFrame1
Running SingleStep1
Running VMInit1

        ==================================
        Run JVMTI tests using jitrino.OPT
        ==================================
        

Using exclude file = C:\cruise\trunk\cc\projects\drlvm\trunk\build\make\excludes\exclude.drlvm_jvmti.windows.x86.opt   
        
Breakpoint1/Breakpoint1.java
SingleStep1/SingleStep1.java
VMInit1/VMInit1.java
PopFrame1/PopFrame1.java

                  
Running Breakpoint1
Running PopFrame1
Running SingleStep1
Running VMInit1

        ==================================
        Run JVMTI tests using Server mode JIT
        ==================================
        

Using exclude file = C:\cruise\trunk\cc\projects\drlvm\trunk\build\make\excludes\exclude.drlvm_jvmti.windows.x86.srv   
        
Breakpoint1/Breakpoint1.java
SingleStep1/SingleStep1.java
VMInit1/VMInit1.java
PopFrame1/PopFrame1.java

                  
Running Breakpoint1
Running PopFrame1
Running SingleStep1
Running VMInit1
## Compiling framework...
## Compiling C unit tests
## Linking C unit test: test_java_attrs
## Linking C unit test: test_java_basic
## Linking C unit test: test_java_identify
## Linking C unit test: test_java_interrupt
## Linking C unit test: test_java_monitors
## Linking C unit test: test_java_park
## Linking C unit test: test_java_ptr_conv
## Linking C unit test: test_java_suspend
## Linking C unit test: test_native_basic
## Linking C unit test: test_native_fat_monitor
## Linking C unit test: test_native_suspend
## Linking C unit test: test_native_thin_monitor
## Linking C unit test: test_ti_instrum
## Linking C unit test: test_ti_local_storage
## Linking C unit test: test_ti_monitor_info
## Linking C unit test: test_ti_peak_count
## Linking C unit test: test_ti_raw_monitors
## Linking C unit test: test_ti_state
## Linking C unit test: test_ti_timing
## Executing C unit test: test_java_attrs
INFO: TEST test_jthread_get_priority start
INFO: TEST test_jthread_get_priority: PASSED
INFO: TEST test_jthread_set_priority start
INFO: TEST test_jthread_set_priority: PASSED
## TEST PASSED
## Executing C unit test: test_java_basic
INFO: TEST test_jthread_attach start
INFO: TEST test_jthread_attach: PASSED
INFO: TEST test_jthread_detach start
INFO: TEST test_jthread_detach: PASSED
INFO: TEST test_hythread_create start
INFO: TEST test_hythread_create: PASSED
INFO: TEST test_hythread_create_with_function start
INFO: TEST test_hythread_create_with_function: PASSED
INFO: TEST test_jthread_get_JNI_env start
INFO: TEST test_jthread_get_JNI_env: PASSED
INFO: TEST test_jthread_join start
INFO: TEST test_jthread_join: PASSED
INFO: TEST test_jthread_timed_join start
-------- status = 00011177 (70007) 100
-------- status = 00011177 (70007) 100
-------- status = 00011177 (70007) 100
-------- status = 00011177 (70007) 100
-------- status = 00000000 (0) 50000
-------- status = 00000000 (0) 50000
-------- status = 00000000 (0) 50000
-------- status = 00000000 (0) 50000
INFO: TEST test_jthread_timed_join: PASSED
INFO: TEST test_jthread_exception_stop start
INFO: TEST test_jthread_exception_stop: PASSED
INFO: TEST test_jthread_sleep start
INFO: TEST test_jthread_sleep: PASSED
INFO: TEST test_hythread_yield start
INFO: TEST test_hythread_yield: PASSED
## TEST PASSED
## Executing C unit test: test_java_identify
INFO: TEST test_jthread_self start
INFO: TEST test_jthread_self: PASSED
INFO: TEST test_jthread_get_id start
INFO: TEST test_jthread_get_id: PASSED
INFO: TEST test_jthread_get_thread start
INFO: TEST test_jthread_get_thread: PASSED
## TEST PASSED
## Executing C unit test: test_java_interrupt
INFO: TEST test_jthread_interrupt start
INFO: TEST test_jthread_interrupt: PASSED
INFO: TEST test_jthread_is_interrupted start
INFO: TEST test_jthread_is_interrupted: PASSED
INFO: TEST test_jthread_clear_interrupted start
INFO: TEST test_jthread_clear_interrupted: PASSED
## TEST PASSED
## Executing C unit test: test_java_monitors
INFO: TEST test_jthread_monitor_init start
INFO: TEST test_jthread_monitor_init: PASSED
INFO: TEST test_jthread_monitor_enter start
INFO: TEST test_jthread_monitor_enter: PASSED
INFO: TEST test_jthread_monitor_try_enter start
INFO: TEST test_jthread_monitor_try_enter: PASSED
INFO: TEST test_jthread_monitor_exit start
INFO: TEST test_jthread_monitor_exit: PASSED
INFO: TEST test_jthread_monitor_notify_all start
INFO: TEST test_jthread_monitor_notify_all: PASSED
INFO: TEST test_jthread_monitor_wait start
INFO: TEST test_jthread_monitor_wait: PASSED
INFO: TEST test_jthread_monitor_timed_wait start
INFO: TEST test_jthread_monitor_timed_wait: PASSED
INFO: TEST test_jthread_monitor_timed_wait_timeout start
INFO: TEST test_jthread_monitor_timed_wait_timeout: PASSED
## TEST PASSED
## Executing C unit test: test_java_park
INFO: TEST test_jthread_park_unpark start
INFO: TEST test_jthread_park_unpark: PASSED
INFO: TEST test_jthread_park_interrupt start
INFO: TEST test_jthread_park_interrupt: PASSED
INFO: TEST test_jthread_timed_park start
INFO: TEST test_jthread_timed_park: PASSED
## TEST PASSED
## Executing C unit test: test_java_ptr_conv
INFO: TEST test_jthread_get_java_thread start
INFO: TEST test_jthread_get_java_thread: PASSED
INFO: TEST test_jthread_get_native_thread start
INFO: TEST test_jthread_get_native_thread: PASSED
## TEST PASSED
## Executing C unit test: test_java_suspend
INFO: TEST test_jthread_suspend_resume start
INFO: TEST test_jthread_suspend_resume: PASSED
INFO: TEST test_jthread_suspend_all_resume_all start
INFO: TEST test_jthread_suspend_all_resume_all: PASSED
## TEST PASSED
## Executing C unit test: test_native_basic
INFO: TEST test_hythread_self_base start
INFO: TEST test_hythread_self_base: PASSED
INFO: TEST test_hythread_create start
INFO: TEST test_hythread_create: PASSED
INFO: TEST test_hythread_create_many start
INFO: TEST test_hythread_create_many: PASSED
INFO: TEST test_hythread_iterator start
iterator size: 100
INFO: TEST test_hythread_iterator: PASSED
INFO: TEST test_hythread_iterator_default start
default group iterator: 104
INFO: TEST test_hythread_iterator_default: PASSED
## TEST PASSED
## Executing C unit test: test_native_fat_monitor
INFO: TEST test_wait_signal start
INFO: TEST test_wait_signal: PASSED
## TEST PASSED
## Executing C unit test: test_native_suspend
INFO: TEST test_hythread_thread_suspend start
INFO: TEST test_hythread_thread_suspend: PASSED
INFO: TEST test_hythread_thread_suspend_all start
INFO: TEST test_hythread_thread_suspend_all: PASSED
## TEST PASSED
## Executing C unit test: test_native_thin_monitor
INFO: TEST test_hythread_thin_monitor_enter start
INFO: TEST test_hythread_thin_monitor_enter: PASSED
INFO: TEST test_hythread_thin_monitor_try_enter start
INFO: TEST test_hythread_thin_monitor_try_enter: PASSED
INFO: TEST test_hythread_thin_monitor_wait_timed_illegal start
INFO: TEST test_hythread_thin_monitor_wait_timed_illegal: PASSED
INFO: TEST test_hythread_thin_monitor_wait_timed start
INFO: TEST test_hythread_thin_monitor_wait_timed: PASSED
INFO: TEST test_hythread_thin_monitor_fat_unlock start
status: 70007
INFO: TEST test_hythread_thin_monitor_fat_unlock: PASSED
INFO: TEST test_hythread_thin_monitor_enter_contended start
INFO: TEST test_hythread_thin_monitor_enter_contended: PASSED
## TEST PASSED
## Executing C unit test: test_ti_instrum
INFO: TEST test_jthread_get_all_threads start
INFO: TEST test_jthread_get_all_threads: PASSED
INFO: TEST test_jthread_get_thread_count start
INFO: TEST test_jthread_get_thread_count: PASSED
INFO: TEST test_jthread_get_blocked_count start
INFO: TEST test_jthread_get_blocked_count: PASSED
## TEST PASSED
## Executing C unit test: test_ti_local_storage
## TEST PASSED
## Executing C unit test: test_ti_monitor_info
INFO: TEST test_jthread_get_contended_monitor start
INFO: TEST test_jthread_get_contended_monitor: PASSED
INFO: TEST test_jthread_holds_lock start
INFO: TEST test_jthread_holds_lock: PASSED
INFO: TEST test_jthread_get_lock_owner start
INFO: TEST test_jthread_get_lock_owner: PASSED
INFO: TEST test_jthread_get_owned_monitors start
INFO: TEST test_jthread_get_owned_monitors: PASSED
## TEST PASSED
## Executing C unit test: test_ti_peak_count
## TEST PASSED
## Executing C unit test: test_ti_raw_monitors
INFO: TEST test_jthread_raw_monitor_create start
INFO: TEST test_jthread_raw_monitor_create: PASSED
INFO: TEST test_jthread_raw_monitor_destroy start
INFO: TEST test_jthread_raw_monitor_destroy: PASSED
INFO: TEST test_jthread_raw_monitor_enter start
INFO: TEST test_jthread_raw_monitor_enter: PASSED
INFO: TEST test_jthread_raw_monitor_try_enter start
INFO: TEST test_jthread_raw_monitor_try_enter: PASSED
INFO: TEST test_jthread_raw_monitor_exit start
INFO: TEST test_jthread_raw_monitor_exit: PASSED
## TEST PASSED
## Executing C unit test: test_ti_state
INFO: TEST test_jthread_get_state_6 start
state = 00000002 (00000002)
state = 00000002 (00000002)
state = 00000002 (00000002)
state = 00000002 (00000002)
state = 00000002 (00000002)
INFO: TEST test_jthread_get_state_6: PASSED
## TEST PASSED
## Executing C unit test: test_ti_timing
## TEST PASSED
## Please find tests and results at C:\cruise\trunk\cc\projects\drlvm\trunk\build\win_ia32_msvc_debug\semis/vm/_cunit.tests/
Note: C:\cruise\trunk\cc\projects\drlvm\trunk\vm\tests\smoke\gc\RunFinalizersOnExitTest.java uses or overrides a deprecated API.
Note: Recompile with -Xlint:deprecation for details.
Note: Some input files use unchecked or unsafe operations.
Note: Recompile with -Xlint:unchecked for details.
Compiling C:\cruise\trunk\cc\projects\drlvm\trunk\build\win_ia32_msvc_debug\semis\vm\_smoke.tests\natives/shutdown/TestDaemonOnWait
Compiling C:\cruise\trunk\cc\projects\drlvm\trunk\build\win_ia32_msvc_debug\semis\vm\_smoke.tests\natives/shutdown/TestFatalError
Compiling C:\cruise\trunk\cc\projects\drlvm\trunk\build\win_ia32_msvc_debug\semis\vm\_smoke.tests\natives/shutdown/TestInterrupt

        ==================================
        Smoke tests on interpreter
        ==================================
        

Using exclude file = C:\cruise\trunk\cc\projects\drlvm\trunk\build\make\excludes\exclude.drlvm_smoke.windows.x86.int   
        
Check.java
PerfCheck.java

# slow
gc/Mark.java

# HARMONY-2977
io/Integers.java

# HARMONY-3917
gc/PhantomReferenceTest.java
gc/WeakReferenceTest.java

# This stress test is very slow on interpreter
stress/Intern.java


                  
Running test : Hi
 PASSED : Hi
Running test : StackTest
 PASSED : StackTest
Running test : classloader.ClassTestGetDeclaringClass
 PASSED : classloader.ClassTestGetDeclaringClass
Running test : classloader.ExceptionInInitializerTest
 PASSED : classloader.ExceptionInInitializerTest
Running test : classloader.LogLoader
 PASSED : classloader.LogLoader
Running test : classloader.NotFound
 PASSED : classloader.NotFound
Running test : classloader.StressLoader
 PASSED : classloader.StressLoader
Running test : exception.ExceptionStackTest
 PASSED : exception.ExceptionStackTest
Running test : exception.FinalizeStackTest
 PASSED : exception.FinalizeStackTest
Running test : exception.NPE
 PASSED : exception.NPE
Running test : gc.FinAlloc
 PASSED : gc.FinAlloc
Running test : gc.Finalizer
 PASSED : gc.Finalizer
Running test : gc.Force
 PASSED : gc.Force
Running test : gc.Fragment
 PASSED : gc.Fragment
Running test : gc.Free
 PASSED : gc.Free
Running test : gc.LOS
 PASSED : gc.LOS
Running test : gc.List
 PASSED : gc.List
Running test : gc.MultiThreads
 PASSED : gc.MultiThreads
Running test : gc.NPE
 PASSED : gc.NPE
Running test : gc.PhantomReferenceQueueTest
 PASSED : gc.PhantomReferenceQueueTest
Running test : gc.RefRemove
 PASSED : gc.RefRemove
Running test : gc.RunFinalizersOnExitTest
 PASSED : gc.RunFinalizersOnExitTest
Running test : gc.StressRef
 PASSED : gc.StressRef
Running test : gc.SynchronizedFinalizersTest
 PASSED : gc.SynchronizedFinalizersTest
Running test : gc.ThreadSuspension
 PASSED : gc.ThreadSuspension
Running test : init.ErrorInInitializer
 PASSED : init.ErrorInInitializer
Running test : init.Other
 PASSED : init.Other
Running test : io.ArrayList
 PASSED : io.ArrayList
Running test : jni.LoadLibrary
 PASSED : jni.LoadLibrary
Running test : outofmemory.Double
 PASSED : outofmemory.Double
Running test : outofmemory.Int
 PASSED : outofmemory.Int
Running test : outofmemory.Plain
 PASSED : outofmemory.Plain
Running test : outofmemory.Ref
 PASSED : outofmemory.Ref
Running test : outofmemory.Throw
 PASSED : outofmemory.Throw
Running test : outofmemory.Vector
 PASSED : outofmemory.Vector
Running test : outofmemory.VectorDouble
 PASSED : outofmemory.VectorDouble
Running test : outofmemory.VectorInt
 PASSED : outofmemory.VectorInt
Running test : outofmemory.VectorRef
 PASSED : outofmemory.VectorRef
Running test : perf.CreateManyExceptions
 PASSED : perf.CreateManyExceptions
Running test : perf.CreateManyExceptions_depth
 PASSED : perf.CreateManyExceptions_depth
Running test : perf.MultiThreadsSimple
 PASSED : perf.MultiThreadsSimple
Running test : perf.SeveralThreads
 PASSED : perf.SeveralThreads
Running test : perf.StressCornerSize
 PASSED : perf.StressCornerSize
Running test : perf.StressCornerSize_a
 PASSED : perf.StressCornerSize_a
Running test : perf.ThrowMany
 PASSED : perf.ThrowMany
Running test : perf.ThrowManyExceptions
 PASSED : perf.ThrowManyExceptions
Running test : perf.ThrowManyExceptions_depth
 PASSED : perf.ThrowManyExceptions_depth
Running test : perf.ThrowMany_depth
 PASSED : perf.ThrowMany_depth
Running test : reflect.GetMethod
 PASSED : reflect.GetMethod
Running test : shutdown.TestDaemonOnWait
 PASSED : shutdown.TestDaemonOnWait
Running test : shutdown.TestFatalError
 PASSED : shutdown.TestFatalError
Running test : shutdown.TestInterrupt
 PASSED : shutdown.TestInterrupt
Running test : shutdown.TestLock
 PASSED : shutdown.TestLock
Running test : stress.BigStringBuffer
 PASSED : stress.BigStringBuffer
Running test : stress.Finalizer
 PASSED : stress.Finalizer
Running test : stress.Mix
 PASSED : stress.Mix
Running test : stress.Stack
 PASSED : stress.Stack
Running test : stress.Sync
 PASSED : stress.Sync
Running test : stress.Threads
 PASSED : stress.Threads
Running test : stress.Vector
 PASSED : stress.Vector
Running test : stress.WeakHashmapTest
 PASSED : stress.WeakHashmapTest
Running test : thread.ExitShutdownHook
 PASSED : thread.ExitShutdownHook
Running test : thread.InfiniteFinalizer
 PASSED : thread.InfiniteFinalizer
Running test : thread.InterruptWait
 PASSED : thread.InterruptWait
Running test : thread.ManyThreadsTest
 PASSED : thread.ManyThreadsTest
Running test : thread.Sleep
 PASSED : thread.Sleep
Running test : thread.ThreadInterrupt
 PASSED : thread.ThreadInterrupt
Running test : thread.ThreadOOM
 PASSED : thread.ThreadOOM
Running test : util.Date
 PASSED : util.Date
Running test : util.DoPriveleged
 PASSED : util.DoPriveleged
Running test : util.Prop
 PASSED : util.Prop
Running test : util.StringIntern
 PASSED : util.StringIntern
Please find test classes and results at C:\cruise\trunk\cc\projects\drlvm\trunk\build\win_ia32_msvc_debug\semis/vm/_smoke.tests/

        ==================================
        Smoke tests on jitrino.JET
        ==================================
        

Using exclude file = C:\cruise\trunk\cc\projects\drlvm\trunk\build\make\excludes\exclude.drlvm_smoke.windows.x86.jet   
        
Check.java
PerfCheck.java

# HARMONY-2977
io/Integers.java

# HARMONY-3917
gc/PhantomReferenceTest.java
gc/WeakReferenceTest.java

                  
Running test : Hi
 PASSED : Hi
Running test : StackTest
 PASSED : StackTest
Running test : classloader.ClassTestGetDeclaringClass
 PASSED : classloader.ClassTestGetDeclaringClass
Running test : classloader.ExceptionInInitializerTest
 PASSED : classloader.ExceptionInInitializerTest
Running test : classloader.LogLoader
 PASSED : classloader.LogLoader
Running test : classloader.NotFound
 PASSED : classloader.NotFound
Running test : classloader.StressLoader
 PASSED : classloader.StressLoader
Running test : exception.ExceptionStackTest
 PASSED : exception.ExceptionStackTest
Running test : exception.FinalizeStackTest
 PASSED : exception.FinalizeStackTest
Running test : exception.NPE
 PASSED : exception.NPE
Running test : gc.FinAlloc
 PASSED : gc.FinAlloc
Running test : gc.Finalizer
 PASSED : gc.Finalizer
Running test : gc.Force
 PASSED : gc.Force
Running test : gc.Fragment
 PASSED : gc.Fragment
Running test : gc.Free
 PASSED : gc.Free
Running test : gc.LOS
 PASSED : gc.LOS
Running test : gc.List
 PASSED : gc.List
Running test : gc.Mark
 PASSED : gc.Mark
Running test : gc.MultiThreads
 PASSED : gc.MultiThreads
Running test : gc.NPE
 PASSED : gc.NPE
Running test : gc.PhantomReferenceQueueTest
 PASSED : gc.PhantomReferenceQueueTest
Running test : gc.RefRemove
 PASSED : gc.RefRemove
Running test : gc.RunFinalizersOnExitTest
 PASSED : gc.RunFinalizersOnExitTest
Running test : gc.StressRef
 PASSED : gc.StressRef
Running test : gc.SynchronizedFinalizersTest
 PASSED : gc.SynchronizedFinalizersTest
Running test : gc.ThreadSuspension
 PASSED : gc.ThreadSuspension
Running test : init.ErrorInInitializer
 PASSED : init.ErrorInInitializer
Running test : init.Other
 PASSED : init.Other
Running test : io.ArrayList
 PASSED : io.ArrayList
Running test : jni.LoadLibrary
 PASSED : jni.LoadLibrary
Running test : outofmemory.Double
 PASSED : outofmemory.Double
Running test : outofmemory.Int
 PASSED : outofmemory.Int
Running test : outofmemory.Plain
 PASSED : outofmemory.Plain
Running test : outofmemory.Ref
 PASSED : outofmemory.Ref
Running test : outofmemory.Throw
 PASSED : outofmemory.Throw
Running test : outofmemory.Vector
 PASSED : outofmemory.Vector
Running test : outofmemory.VectorDouble
 PASSED : outofmemory.VectorDouble
Running test : outofmemory.VectorInt
 PASSED : outofmemory.VectorInt
Running test : outofmemory.VectorRef
 PASSED : outofmemory.VectorRef
Running test : perf.CreateManyExceptions
 PASSED : perf.CreateManyExceptions
Running test : perf.CreateManyExceptions_depth
 PASSED : perf.CreateManyExceptions_depth
Running test : perf.MultiThreadsSimple
 PASSED : perf.MultiThreadsSimple
Running test : perf.SeveralThreads
 PASSED : perf.SeveralThreads
Running test : perf.StressCornerSize
 PASSED : perf.StressCornerSize
Running test : perf.StressCornerSize_a
 PASSED : perf.StressCornerSize_a
Running test : perf.ThrowMany
 PASSED : perf.ThrowMany
Running test : perf.ThrowManyExceptions
 PASSED : perf.ThrowManyExceptions
Running test : perf.ThrowManyExceptions_depth
 PASSED : perf.ThrowManyExceptions_depth
Running test : perf.ThrowMany_depth
 PASSED : perf.ThrowMany_depth
Running test : reflect.GetMethod
 PASSED : reflect.GetMethod
Running test : shutdown.TestDaemonOnWait
 PASSED : shutdown.TestDaemonOnWait
Running test : shutdown.TestFatalError
 PASSED : shutdown.TestFatalError
Running test : shutdown.TestInterrupt
 PASSED : shutdown.TestInterrupt
Running test : shutdown.TestLock
 PASSED : shutdown.TestLock
Running test : stress.BigStringBuffer
 PASSED : stress.BigStringBuffer
Running test : stress.Finalizer
 PASSED : stress.Finalizer
Running test : stress.Intern
 PASSED : stress.Intern
Running test : stress.Mix
 PASSED : stress.Mix
Running test : stress.Stack
 PASSED : stress.Stack
Running test : stress.Sync
 PASSED : stress.Sync
Running test : stress.Threads
 PASSED : stress.Threads
Running test : stress.Vector
 PASSED : stress.Vector
Running test : stress.WeakHashmapTest
 PASSED : stress.WeakHashmapTest
Running test : thread.ExitShutdownHook
 PASSED : thread.ExitShutdownHook
Running test : thread.InfiniteFinalizer
 PASSED : thread.InfiniteFinalizer
Running test : thread.InterruptWait
 PASSED : thread.InterruptWait
Running test : thread.ManyThreadsTest
 PASSED : thread.ManyThreadsTest
Running test : thread.Sleep
 PASSED : thread.Sleep
Running test : thread.ThreadInterrupt
 PASSED : thread.ThreadInterrupt
Running test : thread.ThreadOOM
 PASSED : thread.ThreadOOM
Running test : util.Date
 PASSED : util.Date
Running test : util.DoPriveleged
 PASSED : util.DoPriveleged
Running test : util.Prop
 PASSED : util.Prop
Running test : util.StringIntern
 PASSED : util.StringIntern
Please find test classes and results at C:\cruise\trunk\cc\projects\drlvm\trunk\build\win_ia32_msvc_debug\semis/vm/_smoke.tests/

        ==================================
        Smoke tests on Client mode JIT (default)
        ==================================
        

Using exclude file = C:\cruise\trunk\cc\projects\drlvm\trunk\build\make\excludes\exclude.drlvm_smoke.windows.x86.jit   
        
Check.java
PerfCheck.java

# HARMONY-2977
io/Integers.java

# HARMONY-3917
gc/PhantomReferenceTest.java
gc/WeakReferenceTest.java

                  
Running test : Hi
*** FAILED **** : Hi (3 res code)
Running test : StackTest
*** FAILED **** : StackTest (3 res code)
Running test : classloader.ClassTestGetDeclaringClass
*** FAILED **** : classloader.ClassTestGetDeclaringClass (3 res code)
Running test : classloader.ExceptionInInitializerTest
*** FAILED **** : classloader.ExceptionInInitializerTest (3 res code)
Running test : classloader.LogLoader
*** FAILED **** : classloader.LogLoader (3 res code)
Running test : classloader.NotFound
*** FAILED **** : classloader.NotFound (3 res code)
Running test : classloader.StressLoader
*** FAILED **** : classloader.StressLoader (3 res code)
Running test : exception.ExceptionStackTest
*** FAILED **** : exception.ExceptionStackTest (3 res code)
Running test : exception.FinalizeStackTest
*** FAILED **** : exception.FinalizeStackTest (3 res code)
Running test : exception.NPE
*** FAILED **** : exception.NPE (3 res code)
Running test : gc.FinAlloc
*** FAILED **** : gc.FinAlloc (3 res code)
Running test : gc.Finalizer
*** FAILED **** : gc.Finalizer (3 res code)
Running test : gc.Force
*** FAILED **** : gc.Force (3 res code)
Running test : gc.Fragment
*** FAILED **** : gc.Fragment (3 res code)
Running test : gc.Free
*** FAILED **** : gc.Free (3 res code)
Running test : gc.LOS
*** FAILED **** : gc.LOS (3 res code)
Running test : gc.List
*** FAILED **** : gc.List (3 res code)
Running test : gc.Mark
*** FAILED **** : gc.Mark (3 res code)
Running test : gc.MultiThreads
*** FAILED **** : gc.MultiThreads (3 res code)
Running test : gc.NPE
*** FAILED **** : gc.NPE (3 res code)
Running test : gc.PhantomReferenceQueueTest
*** FAILED **** : gc.PhantomReferenceQueueTest (3 res code)
Running test : gc.RefRemove
*** FAILED **** : gc.RefRemove (3 res code)
Running test : gc.RunFinalizersOnExitTest
*** FAILED **** : gc.RunFinalizersOnExitTest (3 res code)
Running test : gc.StressRef
*** FAILED **** : gc.StressRef (3 res code)
Running test : gc.SynchronizedFinalizersTest
*** FAILED **** : gc.SynchronizedFinalizersTest (3 res code)
Running test : gc.ThreadSuspension
*** FAILED **** : gc.ThreadSuspension (3 res code)
Running test : init.ErrorInInitializer
*** FAILED **** : init.ErrorInInitializer (3 res code)
Running test : init.Other
*** FAILED **** : init.Other (3 res code)
Running test : io.ArrayList
*** FAILED **** : io.ArrayList (3 res code)
Running test : jni.LoadLibrary
*** FAILED **** : jni.LoadLibrary (3 res code)
Running test : outofmemory.Double
*** FAILED **** : outofmemory.Double (3 res code)
Running test : outofmemory.Int
*** FAILED **** : outofmemory.Int (3 res code)
Running test : outofmemory.Plain
*** FAILED **** : outofmemory.Plain (3 res code)
Running test : outofmemory.Ref
*** FAILED **** : outofmemory.Ref (3 res code)
Running test : outofmemory.Throw
*** FAILED **** : outofmemory.Throw (3 res code)
Running test : outofmemory.Vector
*** FAILED **** : outofmemory.Vector (3 res code)
Running test : outofmemory.VectorDouble
*** FAILED **** : outofmemory.VectorDouble (3 res code)
Running test : outofmemory.VectorInt
*** FAILED **** : outofmemory.VectorInt (3 res code)
Running test : outofmemory.VectorRef
*** FAILED **** : outofmemory.VectorRef (3 res code)
Running test : perf.CreateManyExceptions
*** FAILED **** : perf.CreateManyExceptions (3 res code)
Running test : perf.CreateManyExceptions_depth
*** FAILED **** : perf.CreateManyExceptions_depth (3 res code)
Running test : perf.MultiThreadsSimple
*** FAILED **** : perf.MultiThreadsSimple (3 res code)
Running test : perf.SeveralThreads
*** FAILED **** : perf.SeveralThreads (3 res code)
Running test : perf.StressCornerSize
*** FAILED **** : perf.StressCornerSize (3 res code)
Running test : perf.StressCornerSize_a
*** FAILED **** : perf.StressCornerSize_a (3 res code)
Running test : perf.ThrowMany
*** FAILED **** : perf.ThrowMany (3 res code)
Running test : perf.ThrowManyExceptions
*** FAILED **** : perf.ThrowManyExceptions (3 res code)
Running test : perf.ThrowManyExceptions_depth
*** FAILED **** : perf.ThrowManyExceptions_depth (3 res code)
Running test : perf.ThrowMany_depth
*** FAILED **** : perf.ThrowMany_depth (3 res code)
Running test : reflect.GetMethod
*** FAILED **** : reflect.GetMethod (3 res code)
Running test : shutdown.TestDaemonOnWait
*** FAILED **** : shutdown.TestDaemonOnWait (3 res code)
Running test : shutdown.TestFatalError
*** FAILED **** : shutdown.TestFatalError (3 res code)
Running test : shutdown.TestInterrupt
*** FAILED **** : shutdown.TestInterrupt (3 res code)
Running test : shutdown.TestLock
*** FAILED **** : shutdown.TestLock (3 res code)
Running test : stress.BigStringBuffer
*** FAILED **** : stress.BigStringBuffer (3 res code)
Running test : stress.Finalizer
*** FAILED **** : stress.Finalizer (3 res code)
Running test : stress.Intern
*** FAILED **** : stress.Intern (3 res code)
Running test : stress.Mix
*** FAILED **** : stress.Mix (3 res code)
Running test : stress.Stack
*** FAILED **** : stress.Stack (3 res code)
Running test : stress.Sync
*** FAILED **** : stress.Sync (3 res code)
Running test : stress.Threads
*** FAILED **** : stress.Threads (3 res code)
Running test : stress.Vector
*** FAILED **** : stress.Vector (3 res code)
Running test : stress.WeakHashmapTest
*** FAILED **** : stress.WeakHashmapTest (3 res code)
Running test : thread.ExitShutdownHook
*** FAILED **** : thread.ExitShutdownHook (3 res code)
Running test : thread.InfiniteFinalizer
*** FAILED **** : thread.InfiniteFinalizer (3 res code)
Running test : thread.InterruptWait
*** FAILED **** : thread.InterruptWait (3 res code)
Running test : thread.ManyThreadsTest
*** FAILED **** : thread.ManyThreadsTest (3 res code)
Running test : thread.Sleep
*** FAILED **** : thread.Sleep (3 res code)
Running test : thread.ThreadInterrupt
*** FAILED **** : thread.ThreadInterrupt (3 res code)
Running test : thread.ThreadOOM
*** FAILED **** : thread.ThreadOOM (3 res code)
Running test : util.Date
*** FAILED **** : util.Date (3 res code)
Running test : util.DoPriveleged
*** FAILED **** : util.DoPriveleged (3 res code)
Running test : util.Prop
*** FAILED **** : util.Prop (3 res code)
Running test : util.StringIntern
*** FAILED **** : util.StringIntern (3 res code)
Please find test classes and results at C:\cruise\trunk\cc\projects\drlvm\trunk\build\win_ia32_msvc_debug\semis/vm/_smoke.tests/

        ==================================
        Smoke tests on jitrino.OPT
        ==================================
        

Using exclude file = C:\cruise\trunk\cc\projects\drlvm\trunk\build\make\excludes\exclude.drlvm_smoke.windows.x86.opt   
        
Check.java
PerfCheck.java

# HARMONY-3349
gc/Finalizer.java
gc/RunFinalizersOnExitTest.java

# HARMONY-2977
io/Integers.java

# HARMONY-3731
exception/FinalizeStackTest.java

# HARMONY-3917
gc/PhantomReferenceTest.java
gc/WeakReferenceTest.java

                  
Running test : Hi
*** FAILED **** : Hi (3 res code)
Running test : StackTest
*** FAILED **** : StackTest (3 res code)
Running test : classloader.ClassTestGetDeclaringClass
*** FAILED **** : classloader.ClassTestGetDeclaringClass (3 res code)
Running test : classloader.ExceptionInInitializerTest
*** FAILED **** : classloader.ExceptionInInitializerTest (3 res code)
Running test : classloader.LogLoader
*** FAILED **** : classloader.LogLoader (3 res code)
Running test : classloader.NotFound
*** FAILED **** : classloader.NotFound (3 res code)
Running test : classloader.StressLoader
*** FAILED **** : classloader.StressLoader (3 res code)
Running test : exception.ExceptionStackTest
*** FAILED **** : exception.ExceptionStackTest (3 res code)
Running test : exception.NPE
*** FAILED **** : exception.NPE (3 res code)
Running test : gc.FinAlloc
*** FAILED **** : gc.FinAlloc (3 res code)
Running test : gc.Force
*** FAILED **** : gc.Force (3 res code)
Running test : gc.Fragment
*** FAILED **** : gc.Fragment (3 res code)
Running test : gc.Free
*** FAILED **** : gc.Free (3 res code)
Running test : gc.LOS
*** FAILED **** : gc.LOS (3 res code)
Running test : gc.List
*** FAILED **** : gc.List (3 res code)
Running test : gc.Mark
*** FAILED **** : gc.Mark (3 res code)
Running test : gc.MultiThreads
*** FAILED **** : gc.MultiThreads (3 res code)
Running test : gc.NPE
*** FAILED **** : gc.NPE (3 res code)
Running test : gc.PhantomReferenceQueueTest
*** FAILED **** : gc.PhantomReferenceQueueTest (3 res code)
Running test : gc.RefRemove
*** FAILED **** : gc.RefRemove (3 res code)
Running test : gc.StressRef
*** FAILED **** : gc.StressRef (3 res code)
Running test : gc.SynchronizedFinalizersTest
*** FAILED **** : gc.SynchronizedFinalizersTest (3 res code)
Running test : gc.ThreadSuspension
*** FAILED **** : gc.ThreadSuspension (3 res code)
Running test : init.ErrorInInitializer
*** FAILED **** : init.ErrorInInitializer (3 res code)
Running test : init.Other
*** FAILED **** : init.Other (3 res code)
Running test : io.ArrayList
*** FAILED **** : io.ArrayList (3 res code)
Running test : jni.LoadLibrary
*** FAILED **** : jni.LoadLibrary (3 res code)
Running test : outofmemory.Double
*** FAILED **** : outofmemory.Double (3 res code)
Running test : outofmemory.Int
*** FAILED **** : outofmemory.Int (3 res code)
Running test : outofmemory.Plain
*** FAILED **** : outofmemory.Plain (3 res code)
Running test : outofmemory.Ref
*** FAILED **** : outofmemory.Ref (3 res code)
Running test : outofmemory.Throw
*** FAILED **** : outofmemory.Throw (3 res code)
Running test : outofmemory.Vector
*** FAILED **** : outofmemory.Vector (3 res code)
Running test : outofmemory.VectorDouble
*** FAILED **** : outofmemory.VectorDouble (3 res code)
Running test : outofmemory.VectorInt
*** FAILED **** : outofmemory.VectorInt (3 res code)
Running test : outofmemory.VectorRef
*** FAILED **** : outofmemory.VectorRef (3 res code)
Running test : perf.CreateManyExceptions
*** FAILED **** : perf.CreateManyExceptions (3 res code)
Running test : perf.CreateManyExceptions_depth
*** FAILED **** : perf.CreateManyExceptions_depth (3 res code)
Running test : perf.MultiThreadsSimple
*** FAILED **** : perf.MultiThreadsSimple (3 res code)
Running test : perf.SeveralThreads
*** FAILED **** : perf.SeveralThreads (3 res code)
Running test : perf.StressCornerSize
*** FAILED **** : perf.StressCornerSize (3 res code)
Running test : perf.StressCornerSize_a
*** FAILED **** : perf.StressCornerSize_a (3 res code)
Running test : perf.ThrowMany
*** FAILED **** : perf.ThrowMany (3 res code)
Running test : perf.ThrowManyExceptions
*** FAILED **** : perf.ThrowManyExceptions (3 res code)
Running test : perf.ThrowManyExceptions_depth
*** FAILED **** : perf.ThrowManyExceptions_depth (3 res code)
Running test : perf.ThrowMany_depth
*** FAILED **** : perf.ThrowMany_depth (3 res code)
Running test : reflect.GetMethod
*** FAILED **** : reflect.GetMethod (3 res code)
Running test : shutdown.TestDaemonOnWait
*** FAILED **** : shutdown.TestDaemonOnWait (3 res code)
Running test : shutdown.TestFatalError
*** FAILED **** : shutdown.TestFatalError (3 res code)
Running test : shutdown.TestInterrupt
*** FAILED **** : shutdown.TestInterrupt (3 res code)
Running test : shutdown.TestLock
*** FAILED **** : shutdown.TestLock (3 res code)
Running test : stress.BigStringBuffer
*** FAILED **** : stress.BigStringBuffer (3 res code)
Running test : stress.Finalizer
*** FAILED **** : stress.Finalizer (3 res code)
Running test : stress.Intern
*** FAILED **** : stress.Intern (3 res code)
Running test : stress.Mix
*** FAILED **** : stress.Mix (3 res code)
Running test : stress.Stack
*** FAILED **** : stress.Stack (3 res code)
Running test : stress.Sync
*** FAILED **** : stress.Sync (3 res code)
Running test : stress.Threads
*** FAILED **** : stress.Threads (3 res code)
Running test : stress.Vector
*** FAILED **** : stress.Vector (3 res code)
Running test : stress.WeakHashmapTest
*** FAILED **** : stress.WeakHashmapTest (3 res code)
Running test : thread.ExitShutdownHook
*** FAILED **** : thread.ExitShutdownHook (3 res code)
Running test : thread.InfiniteFinalizer
*** FAILED **** : thread.InfiniteFinalizer (3 res code)
Running test : thread.InterruptWait
*** FAILED **** : thread.InterruptWait (3 res code)
Running test : thread.ManyThreadsTest
*** FAILED **** : thread.ManyThreadsTest (3 res code)
Running test : thread.Sleep
*** FAILED **** : thread.Sleep (3 res code)
Running test : thread.ThreadInterrupt
*** FAILED **** : thread.ThreadInterrupt (3 res code)
Running test : thread.ThreadOOM
*** FAILED **** : thread.ThreadOOM (3 res code)
Running test : util.Date
*** FAILED **** : util.Date (3 res code)
Running test : util.DoPriveleged
*** FAILED **** : util.DoPriveleged (3 res code)
Running test : util.Prop
*** FAILED **** : util.Prop (3 res code)
Running test : util.StringIntern
*** FAILED **** : util.StringIntern (3 res code)
Please find test classes and results at C:\cruise\trunk\cc\projects\drlvm\trunk\build\win_ia32_msvc_debug\semis/vm/_smoke.tests/

        ==================================
        Smoke tests on Server mode JIT
        ==================================
        

Using exclude file = C:\cruise\trunk\cc\projects\drlvm\trunk\build\make\excludes\exclude.drlvm_smoke.windows.x86.srv   
        
Check.java
PerfCheck.java

# HARMONY-2977
io/Integers.java

# HARMONY-3731
exception/FinalizeStackTest.java
StackTest.java

# HARMONY-3917
gc/PhantomReferenceTest.java
gc/WeakReferenceTest.java

                  
Running test : Hi
*** FAILED **** : Hi (3 res code)
Running test : classloader.ClassTestGetDeclaringClass
*** FAILED **** : classloader.ClassTestGetDeclaringClass (3 res code)
Running test : classloader.ExceptionInInitializerTest
*** FAILED **** : classloader.ExceptionInInitializerTest (3 res code)
Running test : classloader.LogLoader
*** FAILED **** : classloader.LogLoader (3 res code)
Running test : classloader.NotFound
*** FAILED **** : classloader.NotFound (3 res code)
Running test : classloader.StressLoader
*** FAILED **** : classloader.StressLoader (3 res code)
Running test : exception.ExceptionStackTest
*** FAILED **** : exception.ExceptionStackTest (3 res code)
Running test : exception.NPE
*** FAILED **** : exception.NPE (3 res code)
Running test : gc.FinAlloc
*** FAILED **** : gc.FinAlloc (3 res code)
Running test : gc.Finalizer
*** FAILED **** : gc.Finalizer (3 res code)
Running test : gc.Force
*** FAILED **** : gc.Force (3 res code)
Running test : gc.Fragment
*** FAILED **** : gc.Fragment (3 res code)
Running test : gc.Free
*** FAILED **** : gc.Free (3 res code)
Running test : gc.LOS
*** FAILED **** : gc.LOS (3 res code)
Running test : gc.List
*** FAILED **** : gc.List (3 res code)
Running test : gc.Mark
*** FAILED **** : gc.Mark (3 res code)
Running test : gc.MultiThreads
*** FAILED **** : gc.MultiThreads (3 res code)
Running test : gc.NPE
*** FAILED **** : gc.NPE (3 res code)
Running test : gc.PhantomReferenceQueueTest
*** FAILED **** : gc.PhantomReferenceQueueTest (3 res code)
Running test : gc.RefRemove
*** FAILED **** : gc.RefRemove (3 res code)
Running test : gc.RunFinalizersOnExitTest
*** FAILED **** : gc.RunFinalizersOnExitTest (3 res code)
Running test : gc.StressRef
*** FAILED **** : gc.StressRef (3 res code)
Running test : gc.SynchronizedFinalizersTest
*** FAILED **** : gc.SynchronizedFinalizersTest (3 res code)
Running test : gc.ThreadSuspension
*** FAILED **** : gc.ThreadSuspension (3 res code)
Running test : init.ErrorInInitializer
*** FAILED **** : init.ErrorInInitializer (3 res code)
Running test : init.Other
*** FAILED **** : init.Other (3 res code)
Running test : io.ArrayList
*** FAILED **** : io.ArrayList (3 res code)
Running test : jni.LoadLibrary
*** FAILED **** : jni.LoadLibrary (3 res code)
Running test : outofmemory.Double
*** FAILED **** : outofmemory.Double (3 res code)
Running test : outofmemory.Int
*** FAILED **** : outofmemory.Int (3 res code)
Running test : outofmemory.Plain
*** FAILED **** : outofmemory.Plain (3 res code)
Running test : outofmemory.Ref
*** FAILED **** : outofmemory.Ref (3 res code)
Running test : outofmemory.Throw
*** FAILED **** : outofmemory.Throw (3 res code)
Running test : outofmemory.Vector
*** FAILED **** : outofmemory.Vector (3 res code)
Running test : outofmemory.VectorDouble
*** FAILED **** : outofmemory.VectorDouble (3 res code)
Running test : outofmemory.VectorInt
*** FAILED **** : outofmemory.VectorInt (3 res code)
Running test : outofmemory.VectorRef
*** FAILED **** : outofmemory.VectorRef (3 res code)
Running test : perf.CreateManyExceptions
*** FAILED **** : perf.CreateManyExceptions (3 res code)
Running test : perf.CreateManyExceptions_depth
*** FAILED **** : perf.CreateManyExceptions_depth (3 res code)
Running test : perf.MultiThreadsSimple
*** FAILED **** : perf.MultiThreadsSimple (3 res code)
Running test : perf.SeveralThreads
*** FAILED **** : perf.SeveralThreads (3 res code)
Running test : perf.StressCornerSize
*** FAILED **** : perf.StressCornerSize (3 res code)
Running test : perf.StressCornerSize_a
*** FAILED **** : perf.StressCornerSize_a (3 res code)
Running test : perf.ThrowMany
*** FAILED **** : perf.ThrowMany (3 res code)
Running test : perf.ThrowManyExceptions
*** FAILED **** : perf.ThrowManyExceptions (3 res code)
Running test : perf.ThrowManyExceptions_depth
*** FAILED **** : perf.ThrowManyExceptions_depth (3 res code)
Running test : perf.ThrowMany_depth
*** FAILED **** : perf.ThrowMany_depth (3 res code)
Running test : reflect.GetMethod
*** FAILED **** : reflect.GetMethod (3 res code)
Running test : shutdown.TestDaemonOnWait
*** FAILED **** : shutdown.TestDaemonOnWait (3 res code)
Running test : shutdown.TestFatalError
*** FAILED **** : shutdown.TestFatalError (3 res code)
Running test : shutdown.TestInterrupt
*** FAILED **** : shutdown.TestInterrupt (3 res code)
Running test : shutdown.TestLock
*** FAILED **** : shutdown.TestLock (3 res code)
Running test : stress.BigStringBuffer
*** FAILED **** : stress.BigStringBuffer (3 res code)
Running test : stress.Finalizer
*** FAILED **** : stress.Finalizer (3 res code)
Running test : stress.Intern
*** FAILED **** : stress.Intern (3 res code)
Running test : stress.Mix
*** FAILED **** : stress.Mix (3 res code)
Running test : stress.Stack
*** FAILED **** : stress.Stack (3 res code)
Running test : stress.Sync
*** FAILED **** : stress.Sync (3 res code)
Running test : stress.Threads
*** FAILED **** : stress.Threads (3 res code)
Running test : stress.Vector
*** FAILED **** : stress.Vector (3 res code)
Running test : stress.WeakHashmapTest
*** FAILED **** : stress.WeakHashmapTest (3 res code)
Running test : thread.ExitShutdownHook
*** FAILED **** : thread.ExitShutdownHook (3 res code)
Running test : thread.InfiniteFinalizer
*** FAILED **** : thread.InfiniteFinalizer (3 res code)
Running test : thread.InterruptWait
*** FAILED **** : thread.InterruptWait (3 res code)
Running test : thread.ManyThreadsTest
*** FAILED **** : thread.ManyThreadsTest (3 res code)
Running test : thread.Sleep
*** FAILED **** : thread.Sleep (3 res code)
Running test : thread.ThreadInterrupt
*** FAILED **** : thread.ThreadInterrupt (3 res code)
Running test : thread.ThreadOOM
*** FAILED **** : thread.ThreadOOM (3 res code)
Running test : util.Date
*** FAILED **** : util.Date (3 res code)
Running test : util.DoPriveleged
*** FAILED **** : util.DoPriveleged (3 res code)
Running test : util.Prop
*** FAILED **** : util.Prop (3 res code)
Running test : util.StringIntern
*** FAILED **** : util.StringIntern (3 res code)
Please find test classes and results at C:\cruise\trunk\cc\projects\drlvm\trunk\build\win_ia32_msvc_debug\semis/vm/_smoke.tests/
The test report is in C:\cruise\trunk\cc\projects\drlvm\trunk\build\win_ia32_msvc_debug\semis\vm\_smoke.tests\reports\html\index.html
Note: Some input files use or override a deprecated API.
Note: Recompile with -Xlint:deprecation for details.
Note: C:\cruise\trunk\cc\projects\drlvm\trunk\vm\tests\kernel\java\lang\ClassAnnotationsTest.java uses unchecked or unsafe operations.
Note: Recompile with -Xlint:unchecked for details.

        ==================================
        Run kernel tests using interpreter
        ==================================
        

Using exclude file = C:\cruise\trunk\cc\projects\drlvm\trunk\build\make\excludes\exclude.drlvm_kernel.windows.x86.int   
        
## These tests are too slow
java/lang/RuntimeAdditionalTest*.java

## These tests are unstable and hang often
java/lang/RuntimeAdditionalTest11.java
java/lang/RuntimeAdditionalTest34.java
java/lang/RuntimeAdditionalTest39.java
java/lang/RuntimeAdditionalTest40.java
java/lang/RuntimeAdditionalTest41.java
java/lang/RuntimeAdditionalTest42.java

                  
The GC did not provide gc_add_weak_root_set_entry()

        ==================================
        Run kernel tests using jitrino.JET
        ==================================
        

Using exclude file = C:\cruise\trunk\cc\projects\drlvm\trunk\build\make\excludes\exclude.drlvm_kernel.windows.x86.jet   
        
## These tests are too slow
java/lang/RuntimeAdditionalTest*.java

## These tests are unstable and hang often
java/lang/RuntimeAdditionalTest11.java
java/lang/RuntimeAdditionalTest34.java
java/lang/RuntimeAdditionalTest39.java
java/lang/RuntimeAdditionalTest40.java
java/lang/RuntimeAdditionalTest41.java
java/lang/RuntimeAdditionalTest42.java

                  
The GC did not provide gc_add_weak_root_set_entry()

        ==================================
        Run kernel tests using Client mode JIT (default)
        ==================================
        

Using exclude file = C:\cruise\trunk\cc\projects\drlvm\trunk\build\make\excludes\exclude.drlvm_kernel.windows.x86.jit   
        
## These tests are too slow
java/lang/RuntimeAdditionalTest*.java

## These tests are unstable and hang often
java/lang/RuntimeAdditionalTest11.java
java/lang/RuntimeAdditionalTest34.java
java/lang/RuntimeAdditionalTest39.java
java/lang/RuntimeAdditionalTest40.java
java/lang/RuntimeAdditionalTest41.java
java/lang/RuntimeAdditionalTest42.java

# HARMONY-2453 
java/lang/SystemTest.java

                  
Assertion failed: 0, file C:\cruise\trunk\cc\projects\drlvm\trunk\vm\jitrino\src\translator\java\JavaLabelPrepass.cpp, line 693
This application has requested the Runtime to terminate it in an unusual way.
Please contact the application's support team for more information.
Assertion failed: depth == 0, file C:\cruise\trunk\cc\projects\drlvm\trunk\vm\jitrino\src\main\PMF.cpp, line 708
This application has requested the Runtime to terminate it in an unusual way.
Please contact the application's support team for more information.

        ==================================
        Run kernel tests using jitrino.OPT
        ==================================
        

Using exclude file = C:\cruise\trunk\cc\projects\drlvm\trunk\build\make\excludes\exclude.drlvm_kernel.windows.x86.opt   
        
## These tests are too slow
java/lang/RuntimeAdditionalTest*.java

## These tests are unstable and hang often
java/lang/RuntimeAdditionalTest11.java
java/lang/RuntimeAdditionalTest34.java
java/lang/RuntimeAdditionalTest39.java
java/lang/RuntimeAdditionalTest40.java
java/lang/RuntimeAdditionalTest41.java
java/lang/RuntimeAdditionalTest42.java

                  
Assertion failed: 0, file C:\cruise\trunk\cc\projects\drlvm\trunk\vm\jitrino\src\translator\java\JavaLabelPrepass.cpp, line 693
This application has requested the Runtime to terminate it in an unusual way.
Please contact the application's support team for more information.
Assertion failed: depth == 0, file C:\cruise\trunk\cc\projects\drlvm\trunk\vm\jitrino\src\main\PMF.cpp, line 708
This application has requested the Runtime to terminate it in an unusual way.
Please contact the application's support team for more information.

        ==================================
        Run kernel tests using Server mode JIT
        ==================================
        

Using exclude file = C:\cruise\trunk\cc\projects\drlvm\trunk\build\make\excludes\exclude.drlvm_kernel.windows.x86.srv   
        
## These tests are too slow
java/lang/RuntimeAdditionalTest*.java

## These tests are unstable and hang often
java/lang/RuntimeAdditionalTest11.java
java/lang/RuntimeAdditionalTest34.java
java/lang/RuntimeAdditionalTest39.java
java/lang/RuntimeAdditionalTest40.java
java/lang/RuntimeAdditionalTest41.java
java/lang/RuntimeAdditionalTest42.java

# HARMONY-2453 
java/lang/SystemTest.java

# HARMONY-3171
java/lang/ThreadRTest.java
## These tests are too slow
java/lang/RuntimeAdditionalTest*.java

## These tests are unstable and hang often
java/lang/RuntimeAdditionalTest11.java
java/lang/RuntimeAdditionalTest34.java
java/lang/RuntimeAdditionalTest39.java
java/lang/RuntimeAdditionalTest40.java
java/lang/RuntimeAdditionalTest41.java
java/lang/RuntimeAdditionalTest42.java

# HARMONY-2453 
java/lang/SystemTest.java

                  
Assertion failed: 0, file C:\cruise\trunk\cc\projects\drlvm\trunk\vm\jitrino\src\translator\java\JavaLabelPrepass.cpp, line 693
This application has requested the Runtime to terminate it in an unusual way.
Please contact the application's support team for more information.
Assertion failed: depth == 0, file C:\cruise\trunk\cc\projects\drlvm\trunk\vm\jitrino\src\main\PMF.cpp, line 708
This application has requested the Runtime to terminate it in an unusual way.
Please contact the application's support team for more information.
  ***************************
  *** Kernel tests status ***
  ***************************
      interpreter PASSED
      jitrino.JET PASSED
      Client mode JIT (default) FAILED
      jitrino.OPT FAILED
      Server mode JIT FAILED
Please find detailed results under C:\cruise\trunk\cc\projects\drlvm\trunk\build\win_ia32_msvc_debug\semis\kernel.tests/reports directory.

***********************************************************
Unit Tests: (1956)
        
error: test classloader.ClassTestGetDeclaringClass_jit
error: test classloader.ClassTestGetDeclaringClass_opt
error: test classloader.ClassTestGetDeclaringClass_srv
error: test classloader.ExceptionInInitializerTest_jit
error: test classloader.ExceptionInInitializerTest_opt
error: test classloader.ExceptionInInitializerTest_srv
error: test classloader.LogLoader_jit
error: test classloader.LogLoader_opt
error: test classloader.LogLoader_srv
error: test classloader.NotFound_jit
error: test classloader.NotFound_opt
error: test classloader.NotFound_srv
error: test classloader.StressLoader_jit
error: test classloader.StressLoader_opt
error: test classloader.StressLoader_srv
error: test exception.ExceptionStackTest_jit
error: test exception.ExceptionStackTest_opt
error: test exception.ExceptionStackTest_srv
error: test exception.FinalizeStackTest_jit
error: test exception.NPE_jit
error: test exception.NPE_opt
error: test exception.NPE_srv
error: test gc.Finalizer_jit
error: test gc.Finalizer_srv
error: test gc.FinAlloc_jit
error: test gc.FinAlloc_opt
error: test gc.FinAlloc_srv
error: test gc.Force_jit
error: test gc.Force_opt
error: test gc.Force_srv
error: test gc.Fragment_jit
error: test gc.Fragment_opt
error: test gc.Fragment_srv
error: test gc.Free_jit
error: test gc.Free_opt
error: test gc.Free_srv
error: test gc.List_jit
error: test gc.List_opt
error: test gc.List_srv
error: test gc.LOS_jit
error: test gc.LOS_opt
error: test gc.LOS_srv
error: test gc.Mark_jit
error: test gc.Mark_opt
error: test gc.Mark_srv
error: test gc.MultiThreads_jit
error: test gc.MultiThreads_opt
error: test gc.MultiThreads_srv
error: test gc.NPE_jit
error: test gc.NPE_opt
error: test gc.NPE_srv
error: test gc.PhantomReferenceQueueTest_jit
error: test gc.PhantomReferenceQueueTest_opt
error: test gc.PhantomReferenceQueueTest_srv
error: test gc.RefRemove_jit
error: test gc.RefRemove_opt
error: test gc.RefRemove_srv
error: test gc.RunFinalizersOnExitTest_jit
error: test gc.RunFinalizersOnExitTest_srv
error: test gc.StressRef_jit
error: test gc.StressRef_opt
error: test gc.StressRef_srv
error: test gc.SynchronizedFinalizersTest_jit
error: test gc.SynchronizedFinalizersTest_opt
error: test gc.SynchronizedFinalizersTest_srv
error: test gc.ThreadSuspension_jit
error: test gc.ThreadSuspension_opt
error: test gc.ThreadSuspension_srv
error: test Hi_jit
error: test Hi_opt
error: test Hi_srv
error: test init.ErrorInInitializer_jit
error: test init.ErrorInInitializer_opt
error: test init.ErrorInInitializer_srv
error: test init.Other_jit
error: test init.Other_opt
error: test init.Other_srv
error: test io.ArrayList_jit
error: test io.ArrayList_opt
error: test io.ArrayList_srv
error: test jni.LoadLibrary_jit
error: test jni.LoadLibrary_opt
error: test jni.LoadLibrary_srv
error: test outofmemory.Double_jit
error: test outofmemory.Double_opt
error: test outofmemory.Double_srv
error: test outofmemory.Int_jit
error: test outofmemory.Int_opt
error: test outofmemory.Int_srv
error: test outofmemory.Plain_jit
error: test outofmemory.Plain_opt
error: test outofmemory.Plain_srv
error: test outofmemory.Ref_jit
error: test outofmemory.Ref_opt
error: test outofmemory.Ref_srv
error: test outofmemory.Throw_jit
error: test outofmemory.Throw_opt
error: test outofmemory.Throw_srv
error: test outofmemory.Vector_jit
error: test outofmemory.Vector_opt
error: test outofmemory.Vector_srv
error: test outofmemory.VectorDouble_jit
error: test outofmemory.VectorDouble_opt
error: test outofmemory.VectorDouble_srv
error: test outofmemory.VectorInt_jit
error: test outofmemory.VectorInt_opt
error: test outofmemory.VectorInt_srv
error: test outofmemory.VectorRef_jit
error: test outofmemory.VectorRef_opt
error: test outofmemory.VectorRef_srv
error: test perf.CreateManyExceptions_depth_jit
error: test perf.CreateManyExceptions_depth_opt
error: test perf.CreateManyExceptions_depth_srv
error: test perf.CreateManyExceptions_jit
error: test perf.CreateManyExceptions_opt
error: test perf.CreateManyExceptions_srv
error: test perf.MultiThreadsSimple_jit
error: test perf.MultiThreadsSimple_opt
error: test perf.MultiThreadsSimple_srv
error: test perf.SeveralThreads_jit
error: test perf.SeveralThreads_opt
error: test perf.SeveralThreads_srv
error: test perf.StressCornerSize_a_jit
error: test perf.StressCornerSize_a_opt
error: test perf.StressCornerSize_a_srv
error: test perf.StressCornerSize_jit
error: test perf.StressCornerSize_opt
error: test perf.StressCornerSize_srv
error: test perf.ThrowMany_depth_jit
error: test perf.ThrowMany_depth_opt
error: test perf.ThrowMany_depth_srv
error: test perf.ThrowMany_jit
error: test perf.ThrowMany_opt
error: test perf.ThrowMany_srv
error: test perf.ThrowManyExceptions_depth_jit
error: test perf.ThrowManyExceptions_depth_opt
error: test perf.ThrowManyExceptions_depth_srv
error: test perf.ThrowManyExceptions_jit
error: test perf.ThrowManyExceptions_opt
error: test perf.ThrowManyExceptions_srv
error: test reflect.GetMethod_jit
error: test reflect.GetMethod_opt
error: test reflect.GetMethod_srv
error: test shutdown.TestDaemonOnWait_jit
error: test shutdown.TestDaemonOnWait_opt
error: test shutdown.TestDaemonOnWait_srv
error: test shutdown.TestFatalError_jit
error: test shutdown.TestFatalError_opt
error: test shutdown.TestFatalError_srv
error: test shutdown.TestInterrupt_jit
error: test shutdown.TestInterrupt_opt
error: test shutdown.TestInterrupt_srv
error: test shutdown.TestLock_jit
error: test shutdown.TestLock_opt
error: test shutdown.TestLock_srv
error: test StackTest_jit
error: test StackTest_opt
error: test stress.BigStringBuffer_jit
error: test stress.BigStringBuffer_opt
error: test stress.BigStringBuffer_srv
error: test stress.Finalizer_jit
error: test stress.Finalizer_opt
error: test stress.Finalizer_srv
error: test stress.Intern_jit
error: test stress.Intern_opt
error: test stress.Intern_srv
error: test stress.Mix_jit
error: test stress.Mix_opt
error: test stress.Mix_srv
error: test stress.Stack_jit
error: test stress.Stack_opt
error: test stress.Stack_srv
error: test stress.Sync_jit
error: test stress.Sync_opt
error: test stress.Sync_srv
error: test stress.Threads_jit
error: test stress.Threads_opt
error: test stress.Threads_srv
error: test stress.Vector_jit
error: test stress.Vector_opt
error: test stress.Vector_srv
error: test stress.WeakHashmapTest_jit
error: test stress.WeakHashmapTest_opt
error: test stress.WeakHashmapTest_srv
error: test thread.ExitShutdownHook_jit
error: test thread.ExitShutdownHook_opt
error: test thread.ExitShutdownHook_srv
error: test thread.InfiniteFinalizer_jit
error: test thread.InfiniteFinalizer_opt
error: test thread.InfiniteFinalizer_srv
error: test thread.InterruptWait_jit
error: test thread.InterruptWait_opt
error: test thread.InterruptWait_srv
error: test thread.ManyThreadsTest_jit
error: test thread.ManyThreadsTest_opt
error: test thread.ManyThreadsTest_srv
error: test thread.Sleep_jit
error: test thread.Sleep_opt
error: test thread.Sleep_srv
error: test thread.ThreadInterrupt_jit
error: test thread.ThreadInterrupt_opt
error: test thread.ThreadInterrupt_srv
error: test thread.ThreadOOM_jit
error: test thread.ThreadOOM_opt
error: test thread.ThreadOOM_srv
error: test util.Date_jit
error: test util.Date_opt
error: test util.Date_srv
error: test util.DoPriveleged_jit
error: test util.DoPriveleged_opt
error: test util.DoPriveleged_srv
error: test util.Prop_jit
error: test util.Prop_opt
error: test util.Prop_srv
error: test util.StringIntern_jit
error: test util.StringIntern_opt
error: test util.StringIntern_srv
Unit Test Error Details:	(217)
                
Test: testClass: classloader.ClassTestGetDeclaringClass_jit
Test: testClass: classloader.ClassTestGetDeclaringClass_opt
Test: testClass: classloader.ClassTestGetDeclaringClass_srv
Test: testClass: classloader.ExceptionInInitializerTest_jit
Test: testClass: classloader.ExceptionInInitializerTest_opt
Test: testClass: classloader.ExceptionInInitializerTest_srv
Test: testClass: classloader.LogLoader_jit
Test: testClass: classloader.LogLoader_opt
Test: testClass: classloader.LogLoader_srv
Test: testClass: classloader.NotFound_jit
Test: testClass: classloader.NotFound_opt
Test: testClass: classloader.NotFound_srv
Test: testClass: classloader.StressLoader_jit
Test: testClass: classloader.StressLoader_opt
Test: testClass: classloader.StressLoader_srv
Test: testClass: exception.ExceptionStackTest_jit
Test: testClass: exception.ExceptionStackTest_opt
Test: testClass: exception.ExceptionStackTest_srv
Test: testClass: exception.FinalizeStackTest_jit
Test: testClass: exception.NPE_jit
Test: testClass: exception.NPE_opt
Test: testClass: exception.NPE_srv
Test: testClass: gc.Finalizer_jit
Test: testClass: gc.Finalizer_srv
Test: testClass: gc.FinAlloc_jit
Test: testClass: gc.FinAlloc_opt
Test: testClass: gc.FinAlloc_srv
Test: testClass: gc.Force_jit
Test: testClass: gc.Force_opt
Test: testClass: gc.Force_srv
Test: testClass: gc.Fragment_jit
Test: testClass: gc.Fragment_opt
Test: testClass: gc.Fragment_srv
Test: testClass: gc.Free_jit
Test: testClass: gc.Free_opt
Test: testClass: gc.Free_srv
Test: testClass: gc.List_jit
Test: testClass: gc.List_opt
Test: testClass: gc.List_srv
Test: testClass: gc.LOS_jit
Test: testClass: gc.LOS_opt
Test: testClass: gc.LOS_srv
Test: testClass: gc.Mark_jit
Test: testClass: gc.Mark_opt
Test: testClass: gc.Mark_srv
Test: testClass: gc.MultiThreads_jit
Test: testClass: gc.MultiThreads_opt
Test: testClass: gc.MultiThreads_srv
Test: testClass: gc.NPE_jit
Test: testClass: gc.NPE_opt
Test: testClass: gc.NPE_srv
Test: testClass: gc.PhantomReferenceQueueTest_jit
Test: testClass: gc.PhantomReferenceQueueTest_opt
Test: testClass: gc.PhantomReferenceQueueTest_srv
Test: testClass: gc.RefRemove_jit
Test: testClass: gc.RefRemove_opt
Test: testClass: gc.RefRemove_srv
Test: testClass: gc.RunFinalizersOnExitTest_jit
Test: testClass: gc.RunFinalizersOnExitTest_srv
Test: testClass: gc.StressRef_jit
Test: testClass: gc.StressRef_opt
Test: testClass: gc.StressRef_srv
Test: testClass: gc.SynchronizedFinalizersTest_jit
Test: testClass: gc.SynchronizedFinalizersTest_opt
Test: testClass: gc.SynchronizedFinalizersTest_srv
Test: testClass: gc.ThreadSuspension_jit
Test: testClass: gc.ThreadSuspension_opt
Test: testClass: gc.ThreadSuspension_srv
Test: testClass: Hi_jit
Test: testClass: Hi_opt
Test: testClass: Hi_srv
Test: testClass: init.ErrorInInitializer_jit
Test: testClass: init.ErrorInInitializer_opt
Test: testClass: init.ErrorInInitializer_srv
Test: testClass: init.Other_jit
Test: testClass: init.Other_opt
Test: testClass: init.Other_srv
Test: testClass: io.ArrayList_jit
Test: testClass: io.ArrayList_opt
Test: testClass: io.ArrayList_srv
Test: testClass: jni.LoadLibrary_jit
Test: testClass: jni.LoadLibrary_opt
Test: testClass: jni.LoadLibrary_srv
Test: testClass: outofmemory.Double_jit
Test: testClass: outofmemory.Double_opt
Test: testClass: outofmemory.Double_srv
Test: testClass: outofmemory.Int_jit
Test: testClass: outofmemory.Int_opt
Test: testClass: outofmemory.Int_srv
Test: testClass: outofmemory.Plain_jit
Test: testClass: outofmemory.Plain_opt
Test: testClass: outofmemory.Plain_srv
Test: testClass: outofmemory.Ref_jit
Test: testClass: outofmemory.Ref_opt
Test: testClass: outofmemory.Ref_srv
Test: testClass: outofmemory.Throw_jit
Test: testClass: outofmemory.Throw_opt
Test: testClass: outofmemory.Throw_srv
Test: testClass: outofmemory.Vector_jit
Test: testClass: outofmemory.Vector_opt
Test: testClass: outofmemory.Vector_srv
Test: testClass: outofmemory.VectorDouble_jit
Test: testClass: outofmemory.VectorDouble_opt
Test: testClass: outofmemory.VectorDouble_srv
Test: testClass: outofmemory.VectorInt_jit
Test: testClass: outofmemory.VectorInt_opt
Test: testClass: outofmemory.VectorInt_srv
Test: testClass: outofmemory.VectorRef_jit
Test: testClass: outofmemory.VectorRef_opt
Test: testClass: outofmemory.VectorRef_srv
Test: testClass: perf.CreateManyExceptions_depth_jit
Test: testClass: perf.CreateManyExceptions_depth_opt
Test: testClass: perf.CreateManyExceptions_depth_srv
Test: testClass: perf.CreateManyExceptions_jit
Test: testClass: perf.CreateManyExceptions_opt
Test: testClass: perf.CreateManyExceptions_srv
Test: testClass: perf.MultiThreadsSimple_jit
Test: testClass: perf.MultiThreadsSimple_opt
Test: testClass: perf.MultiThreadsSimple_srv
Test: testClass: perf.SeveralThreads_jit
Test: testClass: perf.SeveralThreads_opt
Test: testClass: perf.SeveralThreads_srv
Test: testClass: perf.StressCornerSize_a_jit
Test: testClass: perf.StressCornerSize_a_opt
Test: testClass: perf.StressCornerSize_a_srv
Test: testClass: perf.StressCornerSize_jit
Test: testClass: perf.StressCornerSize_opt
Test: testClass: perf.StressCornerSize_srv
Test: testClass: perf.ThrowMany_depth_jit
Test: testClass: perf.ThrowMany_depth_opt
Test: testClass: perf.ThrowMany_depth_srv
Test: testClass: perf.ThrowMany_jit
Test: testClass: perf.ThrowMany_opt
Test: testClass: perf.ThrowMany_srv
Test: testClass: perf.ThrowManyExceptions_depth_jit
Test: testClass: perf.ThrowManyExceptions_depth_opt
Test: testClass: perf.ThrowManyExceptions_depth_srv
Test: testClass: perf.ThrowManyExceptions_jit
Test: testClass: perf.ThrowManyExceptions_opt
Test: testClass: perf.ThrowManyExceptions_srv
Test: testClass: reflect.GetMethod_jit
Test: testClass: reflect.GetMethod_opt
Test: testClass: reflect.GetMethod_srv
Test: testClass: shutdown.TestDaemonOnWait_jit
Test: testClass: shutdown.TestDaemonOnWait_opt
Test: testClass: shutdown.TestDaemonOnWait_srv
Test: testClass: shutdown.TestFatalError_jit
Test: testClass: shutdown.TestFatalError_opt
Test: testClass: shutdown.TestFatalError_srv
Test: testClass: shutdown.TestInterrupt_jit
Test: testClass: shutdown.TestInterrupt_opt
Test: testClass: shutdown.TestInterrupt_srv
Test: testClass: shutdown.TestLock_jit
Test: testClass: shutdown.TestLock_opt
Test: testClass: shutdown.TestLock_srv
Test: testClass: StackTest_jit
Test: testClass: StackTest_opt
Test: testClass: stress.BigStringBuffer_jit
Test: testClass: stress.BigStringBuffer_opt
Test: testClass: stress.BigStringBuffer_srv
Test: testClass: stress.Finalizer_jit
Test: testClass: stress.Finalizer_opt
Test: testClass: stress.Finalizer_srv
Test: testClass: stress.Intern_jit
Test: testClass: stress.Intern_opt
Test: testClass: stress.Intern_srv
Test: testClass: stress.Mix_jit
Test: testClass: stress.Mix_opt
Test: testClass: stress.Mix_srv
Test: testClass: stress.Stack_jit
Test: testClass: stress.Stack_opt
Test: testClass: stress.Stack_srv
Test: testClass: stress.Sync_jit
Test: testClass: stress.Sync_opt
Test: testClass: stress.Sync_srv
Test: testClass: stress.Threads_jit
Test: testClass: stress.Threads_opt
Test: testClass: stress.Threads_srv
Test: testClass: stress.Vector_jit
Test: testClass: stress.Vector_opt
Test: testClass: stress.Vector_srv
Test: testClass: stress.WeakHashmapTest_jit
Test: testClass: stress.WeakHashmapTest_opt
Test: testClass: stress.WeakHashmapTest_srv
Test: testClass: thread.ExitShutdownHook_jit
Test: testClass: thread.ExitShutdownHook_opt
Test: testClass: thread.ExitShutdownHook_srv
Test: testClass: thread.InfiniteFinalizer_jit
Test: testClass: thread.InfiniteFinalizer_opt
Test: testClass: thread.InfiniteFinalizer_srv
Test: testClass: thread.InterruptWait_jit
Test: testClass: thread.InterruptWait_opt
Test: testClass: thread.InterruptWait_srv
Test: testClass: thread.ManyThreadsTest_jit
Test: testClass: thread.ManyThreadsTest_opt
Test: testClass: thread.ManyThreadsTest_srv
Test: testClass: thread.Sleep_jit
Test: testClass: thread.Sleep_opt
Test: testClass: thread.Sleep_srv
Test: testClass: thread.ThreadInterrupt_jit
Test: testClass: thread.ThreadInterrupt_opt
Test: testClass: thread.ThreadInterrupt_srv
Test: testClass: thread.ThreadOOM_jit
Test: testClass: thread.ThreadOOM_opt
Test: testClass: thread.ThreadOOM_srv
Test: testClass: util.Date_jit
Test: testClass: util.Date_opt
Test: testClass: util.Date_srv
Test: testClass: util.DoPriveleged_jit
Test: testClass: util.DoPriveleged_opt
Test: testClass: util.DoPriveleged_srv
Test: testClass: util.Prop_jit
Test: testClass: util.Prop_opt
Test: testClass: util.Prop_srv
Test: testClass: util.StringIntern_jit
Test: testClass: util.StringIntern_opt
Test: testClass: util.StringIntern_srv

***********************************************************
Modifications since last successful build:	(122)
            
modified odeakin  /harmony/enhanced/classlib/trunk/modules/luni/src/main/java/java/util/Scanner.java 06/12/2007 23:06:18 Apply patch HARMONY-4134 ([classlib] [luni] Updated Javadoc for java.util.Scanner)
modified odeakin  /harmony/enhanced/classlib/trunk/modules/security/src/main/java/common/java/security/BasicPermissionCollection.java 06/12/2007 17:44:44 Apply patch HARMONY-4092 ([classlib] [security] Javadoc update for java.security.BasicPermissionCollection)
modified odeakin  /harmony/enhanced/classlib/trunk/THIRD_PARTY_NOTICES.txt 06/12/2007 16:26:38 Apply patch HARMONY-4028 ([classlib] THIRD_PARTY_NOTICES.txt needs copyright statement for RFC 2891 specification (and others))
modified odeakin  /harmony/enhanced/classlib/trunk/modules/security/src/main/java/common/java/security/Provider.java 06/12/2007 16:12:09 Apply patch HARMONY-4090 ([classlib] [security] Javadoc update for java.security.Provider)
modified tellison  /harmony/enhanced/classlib/trunk/modules/luni/src/main/java/java/util/ListResourceBundle.java 06/12/2007 00:15:36 Apply patch HARMONY-4083 ([classlib][luni] Performance improvement of java.util.ListResourceBundle)
modified tellison  /harmony/enhanced/classlib/trunk/modules/luni/src/main/java/java/util/LinkedHashMap.java 06/12/2007 00:11:27 Apply slightly modified patch for HARMONY-4082 ([classlib][luni] Performance improvement of java.util.LinkedHashMap)
modified tellison  /harmony/enhanced/classlib/trunk/modules/luni/src/main/java/java/util/Observable.java 06/12/2007 00:04:45 Apply patch HARMONY-4087 ([classlib][luni] Performance improvement of java.util.Observable)
modified tellison  /harmony/enhanced/classlib/trunk/modules/luni/src/main/java/java/util/UUID.java 06/11/2007 23:58:29 Apply patch HARMONY-4120 ([classlib][luni] Remove some unnecessary synchronization blocks for java.util.Vector & java.util.UUID)
modified tellison  /harmony/enhanced/classlib/trunk/modules/luni/src/test/java/tests/api/java/util/VectorTest.java 06/11/2007 23:58:29 Apply patch HARMONY-4120 ([classlib][luni] Remove some unnecessary synchronization blocks for java.util.Vector & java.util.UUID)
modified tellison  /harmony/enhanced/classlib/trunk/modules/luni/src/main/java/java/util/Vector.java 06/11/2007 23:58:29 Apply patch HARMONY-4120 ([classlib][luni] Remove some unnecessary synchronization blocks for java.util.Vector & java.util.UUID)
modified varlax  /harmony/enhanced/drlvm/trunk/vm/jitrino/src/translator/java/JavaLabelPrepass.cpp 06/11/2007 23:52:07 Fix up spoiled commit [545753] HARMONY-3797
modified tellison  /harmony/enhanced/classlib/trunk/modules/sql/src/main/java/javax/sql/rowset/serial/SQLInputImpl.java 06/11/2007 21:22:50 Remove not implemented markers for methods that are now written.
modified tellison  /harmony/enhanced/drlvm/trunk/vm/vmcore/src/kernel_classes/javasrc/java/lang/ClassLoader.java 06/11/2007 21:17:55 Mark a number of kernel class API methods deprecated as spec.
modified tellison  /harmony/enhanced/drlvm/trunk/vm/vmcore/src/kernel_classes/javasrc/java/lang/Runtime.java 06/11/2007 21:17:55 Mark a number of kernel class API methods deprecated as spec.
modified tellison  /harmony/enhanced/drlvm/trunk/vm/vmcore/src/kernel_classes/javasrc/java/lang/System.java 06/11/2007 21:17:55 Mark a number of kernel class API methods deprecated as spec.
modified tellison  /harmony/enhanced/drlvm/trunk/vm/vmcore/src/kernel_classes/javasrc/java/lang/ThreadGroup.java 06/11/2007 21:17:55 Mark a number of kernel class API methods deprecated as spec.
modified tellison  /harmony/enhanced/drlvm/trunk/vm/vmcore/src/kernel_classes/javasrc/java/lang/Thread.java 06/11/2007 21:17:55 Mark a number of kernel class API methods deprecated as spec.
added apetrenko  /harmony/enhanced/classlib/trunk/modules/awt/src/main/native/fontlib/shared/T1Glyph.cpp 06/11/2007 00:31:22 Font library contributionHARMONY-3583 and HARMONY-4104
added apetrenko  /harmony/enhanced/classlib/trunk/modules/awt/src/main/native/fontlib/shared/Glyph.h 06/11/2007 00:31:22 Font library contributionHARMONY-3583 and HARMONY-4104
added apetrenko  /harmony/enhanced/classlib/trunk/modules/awt/src/main/native/fontlib/shared/include/fljni.h 06/11/2007 00:31:22 Font library contributionHARMONY-3583 and HARMONY-4104
added apetrenko  /harmony/enhanced/classlib/trunk/modules/awt/src/main/native/fontlib/unix 06/11/2007 00:31:22 Font library contributionHARMONY-3583 and HARMONY-4104
added apetrenko  /harmony/enhanced/classlib/trunk/modules/awt/src/main/native/fontlib/shared/TTCurve.h 06/11/2007 00:31:22 Font library contributionHARMONY-3583 and HARMONY-4104
added apetrenko  /harmony/enhanced/classlib/trunk/modules/awt/src/main/native/fontlib/shared/include 06/11/2007 00:31:22 Font library contributionHARMONY-3583 and HARMONY-4104
added apetrenko  /harmony/enhanced/classlib/trunk/modules/awt/src/main/native/fontlib/shared/include/org_apache_harmony_awt_gl_font_fontlib_FLGlyph.h 06/11/2007 00:31:22 Font library contributionHARMONY-3583 and HARMONY-4104
added apetrenko  /harmony/enhanced/classlib/trunk/modules/awt/src/main/native/fontlib/shared/EncodedValue.h 06/11/2007 00:31:22 Font library contributionHARMONY-3583 and HARMONY-4104
added apetrenko  /harmony/enhanced/classlib/trunk/modules/awt/src/main/native/fontlib/shared/Environment.cpp 06/11/2007 00:31:22 Font library contributionHARMONY-3583 and HARMONY-4104
added apetrenko  /harmony/enhanced/classlib/trunk/modules/awt/src/main/java/common/org/apache/harmony/awt/gl/font/fontlib/FLOutline.java 06/11/2007 00:31:22 Font library contributionHARMONY-3583 and HARMONY-4104
added apetrenko  /harmony/enhanced/classlib/trunk/modules/awt/src/main/native/fontlib/shared/Font.cpp 06/11/2007 00:31:22 Font library contributionHARMONY-3583 and HARMONY-4104
added apetrenko  /harmony/enhanced/classlib/trunk/modules/awt/src/main/native/fontlib/windows/fl.rc 06/11/2007 00:31:22 Font library contributionHARMONY-3583 and HARMONY-4104
modified apetrenko  /harmony/enhanced/classlib/trunk/modules/awt/build.xml 06/11/2007 00:31:22 Font library contributionHARMONY-3583 and HARMONY-4104
added apetrenko  /harmony/enhanced/classlib/trunk/modules/awt/src/main/native/fontlib 06/11/2007 00:31:22 Font library contributionHARMONY-3583 and HARMONY-4104
added apetrenko  /harmony/enhanced/classlib/trunk/modules/awt/src/main/java/common/org/apache/harmony/awt/gl/font/fontlib/FLGlyph.java 06/11/2007 00:31:22 Font library contributionHARMONY-3583 and HARMONY-4104
added apetrenko  /harmony/enhanced/classlib/trunk/modules/awt/src/main/native/fontlib/unix/makefile 06/11/2007 00:31:22 Font library contributionHARMONY-3583 and HARMONY-4104
modified apetrenko  /harmony/enhanced/classlib/trunk/modules/awt/src/main/java/unix/org/apache/harmony/awt/gl/linux/XGraphics2D.java 06/11/2007 00:31:22 Font library contributionHARMONY-3583 and HARMONY-4104
added apetrenko  /harmony/enhanced/classlib/trunk/modules/awt/src/main/native/fontlib/shared/T1Font.cpp 06/11/2007 00:31:22 Font library contributionHARMONY-3583 and HARMONY-4104
modified apetrenko  /harmony/enhanced/classlib/trunk/modules/awt/src/main/java/common/org/apache/harmony/awt/gl/font/FontPeerImpl.java 06/11/2007 00:31:22 Font library contributionHARMONY-3583 and HARMONY-4104
added apetrenko  /harmony/enhanced/classlib/trunk/modules/awt/src/main/native/fontlib/unix/exports.txt 06/11/2007 00:31:22 Font library contributionHARMONY-3583 and HARMONY-4104
added apetrenko  /harmony/enhanced/classlib/trunk/modules/awt/src/main/native/fontlib/shared/Outline.cpp 06/11/2007 00:31:22 Font library contributionHARMONY-3583 and HARMONY-4104
added apetrenko  /harmony/enhanced/classlib/trunk/modules/awt/src/main/native/fontlib/shared 06/11/2007 00:31:22 Font library contributionHARMONY-3583 and HARMONY-4104
added apetrenko  /harmony/enhanced/classlib/trunk/modules/awt/src/main/native/fontlib/shared/Tables.h 06/11/2007 00:31:22 Font library contributionHARMONY-3583 and HARMONY-4104
added apetrenko  /harmony/enhanced/classlib/trunk/modules/awt/src/main/native/fontlib/windows/makefile 06/11/2007 00:31:22 Font library contributionHARMONY-3583 and HARMONY-4104
added apetrenko  /harmony/enhanced/classlib/trunk/modules/awt/src/main/native/fontlib/shared/include/org_apache_harmony_awt_gl_font_fontlib_FLFontManager.h 06/11/2007 00:31:22 Font library contributionHARMONY-3583 and HARMONY-4104
added apetrenko  /harmony/enhanced/classlib/trunk/modules/awt/src/main/native/fontlib/shared/Glyph.cpp 06/11/2007 00:31:22 Font library contributionHARMONY-3583 and HARMONY-4104
added apetrenko  /harmony/enhanced/classlib/trunk/modules/awt/src/main/native/fontlib/shared/TTFont.h 06/11/2007 00:31:22 Font library contributionHARMONY-3583 and HARMONY-4104
added apetrenko  /harmony/enhanced/classlib/trunk/modules/awt/src/main/java/common/org/apache/harmony/awt/gl/font/fontlib 06/11/2007 00:31:22 Font library contributionHARMONY-3583 and HARMONY-4104
modified apetrenko  /harmony/enhanced/classlib/trunk/modules/awt/src/main/java/common/org/apache/harmony/awt/gl/font/FontMetricsImpl.java 06/11/2007 00:31:22 Font library contributionHARMONY-3583 and HARMONY-4104
added apetrenko  /harmony/enhanced/classlib/trunk/modules/awt/src/main/java/common/org/apache/harmony/awt/gl/font/fontlib/FLFontManager.java 06/11/2007 00:31:22 Font library contributionHARMONY-3583 and HARMONY-4104
modified apetrenko  /harmony/enhanced/classlib/trunk/modules/awt/src/main/java/common/org/apache/harmony/awt/gl/font/Glyph.java 06/11/2007 00:31:22 Font library contributionHARMONY-3583 and HARMONY-4104
added apetrenko  /harmony/enhanced/classlib/trunk/modules/awt/src/main/native/fontlib/shared/TTCurve.cpp 06/11/2007 00:31:22 Font library contributionHARMONY-3583 and HARMONY-4104
added apetrenko  /harmony/enhanced/classlib/trunk/modules/awt/src/main/native/fontlib/shared/T1Glyph.h 06/11/2007 00:31:22 Font library contributionHARMONY-3583 and HARMONY-4104
added apetrenko  /harmony/enhanced/classlib/trunk/modules/awt/src/main/native/fontlib/shared/ParsingTables.cpp 06/11/2007 00:31:22 Font library contributionHARMONY-3583 and HARMONY-4104
added apetrenko  /harmony/enhanced/classlib/trunk/modules/awt/src/main/native/fontlib/shared/EncodedValue.cpp 06/11/2007 00:31:22 Font library contributionHARMONY-3583 and HARMONY-4104
modified apetrenko  /harmony/enhanced/classlib/trunk/modules/awt/src/main/java/common/org/apache/harmony/awt/gl/CommonGraphicsEnvironment.java 06/11/2007 00:31:22 Font library contributionHARMONY-3583 and HARMONY-4104
added apetrenko  /harmony/enhanced/classlib/trunk/modules/awt/src/main/native/fontlib/shared/Type1Structs.h 06/11/2007 00:31:22 Font library contributionHARMONY-3583 and HARMONY-4104
modified apetrenko  /harmony/enhanced/classlib/trunk/modules/awt/src/main/java/common/org/apache/harmony/awt/gl/CommonGraphics2D.java 06/11/2007 00:31:22 Font library contributionHARMONY-3583 and HARMONY-4104
added apetrenko  /harmony/enhanced/classlib/trunk/modules/awt/src/main/native/fontlib/shared/include/org_apache_harmony_awt_gl_font_fontlib_FLFontPeer.h 06/11/2007 00:31:22 Font library contributionHARMONY-3583 and HARMONY-4104
added apetrenko  /harmony/enhanced/classlib/trunk/modules/awt/src/main/native/fontlib/windows/fl.def 06/11/2007 00:31:22 Font library contributionHARMONY-3583 and HARMONY-4104
modified apetrenko  /harmony/enhanced/classlib/trunk/modules/awt/src/main/java/common/java/awt/Font.java 06/11/2007 00:31:22 Font library contributionHARMONY-3583 and HARMONY-4104
added apetrenko  /harmony/enhanced/classlib/trunk/modules/awt/src/main/java/common/org/apache/harmony/awt/gl/font/fontlib/FLTextRenderer.java 06/11/2007 00:31:22 Font library contributionHARMONY-3583 and HARMONY-4104
added apetrenko  /harmony/enhanced/classlib/trunk/modules/awt/src/main/native/fontlib/shared/fljni.cpp 06/11/2007 00:31:22 Font library contributionHARMONY-3583 and HARMONY-4104
added apetrenko  /harmony/enhanced/classlib/trunk/modules/awt/src/main/native/fontlib/windows 06/11/2007 00:31:22 Font library contributionHARMONY-3583 and HARMONY-4104
modified apetrenko  /harmony/enhanced/classlib/trunk/modules/awt/src/main/java/windows/org/apache/harmony/awt/gl/windows/WinGDIPGraphics2D.java 06/11/2007 00:31:22 Font library contributionHARMONY-3583 and HARMONY-4104
modified apetrenko  /harmony/enhanced/classlib/trunk/modules/awt/src/main/java/common/org/apache/harmony/awt/gl/font/FontManager.java 06/11/2007 00:31:22 Font library contributionHARMONY-3583 and HARMONY-4104
added apetrenko  /harmony/enhanced/classlib/trunk/modules/awt/src/main/native/fontlib/shared/AGL.h 06/11/2007 00:31:22 Font library contributionHARMONY-3583 and HARMONY-4104
added apetrenko  /harmony/enhanced/classlib/trunk/modules/awt/src/main/java/common/org/apache/harmony/awt/gl/font/fontlib/FLFontPeer.java 06/11/2007 00:31:22 Font library contributionHARMONY-3583 and HARMONY-4104
added apetrenko  /harmony/enhanced/classlib/trunk/modules/awt/src/main/native/fontlib/shared/Environment.h 06/11/2007 00:31:22 Font library contributionHARMONY-3583 and HARMONY-4104
added apetrenko  /harmony/enhanced/classlib/trunk/modules/awt/src/main/native/fontlib/shared/include/org_apache_harmony_awt_gl_font_fontlib_FLPath.h 06/11/2007 00:31:22 Font library contributionHARMONY-3583 and HARMONY-4104
added apetrenko  /harmony/enhanced/classlib/trunk/modules/awt/src/main/native/fontlib/shared/Font.h 06/11/2007 00:31:22 Font library contributionHARMONY-3583 and HARMONY-4104
modified apetrenko  /harmony/enhanced/classlib/trunk/modules/awt/src/main/java/common/org/apache/harmony/awt/gl/opengl/OGLGraphics2D.java 06/11/2007 00:31:22 Font library contributionHARMONY-3583 and HARMONY-4104
added apetrenko  /harmony/enhanced/classlib/trunk/modules/awt/src/main/native/fontlib/shared/TTFont.cpp 06/11/2007 00:31:22 Font library contributionHARMONY-3583 and HARMONY-4104
added apetrenko  /harmony/enhanced/classlib/trunk/modules/awt/src/main/native/fontlib/shared/T1Font.h 06/11/2007 00:31:22 Font library contributionHARMONY-3583 and HARMONY-4104
added apetrenko  /harmony/enhanced/classlib/trunk/modules/awt/src/main/java/common/org/apache/harmony/awt/gl/font/fontlib/FLPath.java 06/11/2007 00:31:22 Font library contributionHARMONY-3583 and HARMONY-4104
added apetrenko  /harmony/enhanced/classlib/trunk/modules/awt/src/main/native/fontlib/shared/Outline.h 06/11/2007 00:31:22 Font library contributionHARMONY-3583 and HARMONY-4104
modified wjwashburn  /harmony/enhanced/drlvm/trunk/vm/vmcore/src/init/parse_arguments.cpp 06/10/2007 09:56:01 Harmony-4001, this patch provides the ability to set the size of a thread'sstack"build test2" has been known to pass on most platforms
modified wjwashburn  /harmony/enhanced/drlvm/trunk/vm/vmcore/src/util/win/ia32_em64t/nt_exception_filter_common.cpp 06/10/2007 09:56:01 Harmony-4001, this patch provides the ability to set the size of a thread'sstack"build test2" has been known to pass on most platforms
modified wjwashburn  /harmony/enhanced/drlvm/trunk/vm/vmcore/src/class_support/C_Interface.cpp 06/10/2007 09:56:01 Harmony-4001, this patch provides the ability to set the size of a thread'sstack"build test2" has been known to pass on most platforms
modified wjwashburn  /harmony/enhanced/drlvm/trunk/vm/vmcore/src/util/linux/signals_ipf.cpp 06/10/2007 09:56:01 Harmony-4001, this patch provides the ability to set the size of a thread'sstack"build test2" has been known to pass on most platforms
modified wjwashburn  /harmony/enhanced/drlvm/trunk/vm/vmcore/src/thread/thread_generic.cpp 06/10/2007 09:56:01 Harmony-4001, this patch provides the ability to set the size of a thread'sstack"build test2" has been known to pass on most platforms
modified wjwashburn  /harmony/enhanced/drlvm/trunk/vm/thread/src/win/os_thread.c 06/10/2007 09:56:01 Harmony-4001, this patch provides the ability to set the size of a thread'sstack"build test2" has been known to pass on most platforms
modified wjwashburn  /harmony/enhanced/drlvm/trunk/vm/vmcore/include/exceptions.h 06/10/2007 09:56:01 Harmony-4001, this patch provides the ability to set the size of a thread'sstack"build test2" has been known to pass on most platforms
modified wjwashburn  /harmony/enhanced/drlvm/trunk/vm/thread/src/thread_private.h 06/10/2007 09:56:01 Harmony-4001, this patch provides the ability to set the size of a thread'sstack"build test2" has been known to pass on most platforms
modified wjwashburn  /harmony/enhanced/drlvm/trunk/vm/thread/src/linux/os_thread.c 06/10/2007 09:56:01 Harmony-4001, this patch provides the ability to set the size of a thread'sstack"build test2" has been known to pass on most platforms
modified wjwashburn  /harmony/enhanced/drlvm/trunk/vm/thread/src/hythr.exp 06/10/2007 09:56:01 Harmony-4001, this patch provides the ability to set the size of a thread'sstack"build test2" has been known to pass on most platforms
modified wjwashburn  /harmony/enhanced/drlvm/trunk/vm/thread/src/thread_java_basic.c 06/10/2007 09:56:01 Harmony-4001, this patch provides the ability to set the size of a thread'sstack"build test2" has been known to pass on most platforms
modified wjwashburn  /harmony/enhanced/drlvm/trunk/vm/thread/src/hythr.def 06/10/2007 09:56:01 Harmony-4001, this patch provides the ability to set the size of a thread'sstack"build test2" has been known to pass on most platforms
modified wjwashburn  /harmony/enhanced/drlvm/trunk/vm/include/open/vm.h 06/10/2007 09:56:01 Harmony-4001, this patch provides the ability to set the size of a thread'sstack"build test2" has been known to pass on most platforms
modified wjwashburn  /harmony/enhanced/drlvm/trunk/vm/vmcore/src/init/harmony.properties 06/10/2007 09:56:01 Harmony-4001, this patch provides the ability to set the size of a thread'sstack"build test2" has been known to pass on most platforms
modified wjwashburn  /harmony/enhanced/drlvm/trunk/vm/thread/src/thread_native_basic.c 06/10/2007 09:56:01 Harmony-4001, this patch provides the ability to set the size of a thread'sstack"build test2" has been known to pass on most platforms
modified wjwashburn  /harmony/enhanced/drlvm/trunk/vm/vmcore/src/util/linux/signals_ia32.cpp 06/10/2007 09:56:01 Harmony-4001, this patch provides the ability to set the size of a thread'sstack"build test2" has been known to pass on most platforms
modified wjwashburn  /harmony/enhanced/drlvm/trunk/vm/vmcore/src/util/linux/signals_em64t.cpp 06/10/2007 09:56:01 Harmony-4001, this patch provides the ability to set the size of a thread'sstack"build test2" has been known to pass on most platforms
modified wjwashburn  /harmony/enhanced/drlvm/trunk/vm/vmcore/include/properties.h 06/10/2007 09:56:01 Harmony-4001, this patch provides the ability to set the size of a thread'sstack"build test2" has been known to pass on most platforms
modified wjwashburn  /harmony/enhanced/drlvm/trunk/vm/vmcore/include/vm_threads.h 06/10/2007 09:56:01 Harmony-4001, this patch provides the ability to set the size of a thread'sstack"build test2" has been known to pass on most platforms
modified wjwashburn  /harmony/enhanced/drlvm/trunk/vm/include/open/hythread_ext.h 06/10/2007 09:56:01 Harmony-4001, this patch provides the ability to set the size of a thread'sstack"build test2" has been known to pass on most platforms
modified varlax  /harmony/enhanced/drlvm/trunk/build/make/build.xml 06/09/2007 21:42:48 Minor improvements to build scripts
modified varlax  /harmony/enhanced/drlvm/trunk/build/make/targets/reg.test.run.xml 06/09/2007 21:42:48 Minor improvements to build scripts
added varlax  /harmony/enhanced/drlvm/trunk/src/test/regression/H4073/Test.java 06/09/2007 21:40:01 Applied HARMONY-4073 drlvm][jit] RCE must not substitute EFLAGS values produced by CMP with ones produced by SBB
added varlax  /harmony/enhanced/drlvm/trunk/src/test/regression/H4073 06/09/2007 21:40:01 Applied HARMONY-4073 drlvm][jit] RCE must not substitute EFLAGS values produced by CMP with ones produced by SBB
added varlax  /harmony/enhanced/drlvm/trunk/src/test/regression/H4073/run.test.xml 06/09/2007 21:40:01 Applied HARMONY-4073 drlvm][jit] RCE must not substitute EFLAGS values produced by CMP with ones produced by SBB
modified varlax  /harmony/enhanced/drlvm/trunk/vm/jitrino/src/codegenerator/ia32/Ia32RCE.cpp 06/09/2007 21:40:01 Applied HARMONY-4073 drlvm][jit] RCE must not substitute EFLAGS values produced by CMP with ones produced by SBB
modified varlax  /harmony/enhanced/drlvm/trunk/vm/jitrino/src/codegenerator/ia32/Ia32I8Lowerer.cpp 06/09/2007 21:40:01 Applied HARMONY-4073 drlvm][jit] RCE must not substitute EFLAGS values produced by CMP with ones produced by SBB
deleted varlax  /harmony/enhanced/drlvm/trunk/vm/jitrino/src/translator/ExceptionInfo.cpp 06/09/2007 21:34:44 Fixed OPT compiler, HARMONY-3797 [drlvm][jit] bad handling of fall-through-reachable exception handlers
modified varlax  /harmony/enhanced/drlvm/trunk/vm/jitrino/src/translator/java/JavaByteCodeTranslator.cpp 06/09/2007 21:34:44 Fixed OPT compiler, HARMONY-3797 [drlvm][jit] bad handling of fall-through-reachable exception handlers
modified varlax  /harmony/enhanced/drlvm/trunk/vm/jitrino/src/translator/TranslatorIntfc.cpp 06/09/2007 21:34:44 Fixed OPT compiler, HARMONY-3797 [drlvm][jit] bad handling of fall-through-reachable exception handlers
modified varlax  /harmony/enhanced/drlvm/trunk/vm/jitrino/src/translator/java/JavaByteCodeParser.cpp 06/09/2007 21:34:44 Fixed OPT compiler, HARMONY-3797 [drlvm][jit] bad handling of fall-through-reachable exception handlers
modified varlax  /harmony/enhanced/drlvm/trunk/vm/jitrino/src/translator/ExceptionInfo.h 06/09/2007 21:34:44 Fixed OPT compiler, HARMONY-3797 [drlvm][jit] bad handling of fall-through-reachable exception handlers
modified varlax  /harmony/enhanced/drlvm/trunk/vm/jitrino/src/translator/java/JavaLabelPrepass.cpp 06/09/2007 21:34:44 Fixed OPT compiler, HARMONY-3797 [drlvm][jit] bad handling of fall-through-reachable exception handlers
modified varlax  /harmony/enhanced/drlvm/trunk/build/custom/msvc_2003/jitrino/jitrino.vcproj 06/09/2007 21:34:44 Fixed OPT compiler, HARMONY-3797 [drlvm][jit] bad handling of fall-through-reachable exception handlers
modified varlax  /harmony/enhanced/drlvm/trunk/vm/jitrino/src/translator/TranslatorIntfc.h 06/09/2007 21:34:44 Fixed OPT compiler, HARMONY-3797 [drlvm][jit] bad handling of fall-through-reachable exception handlers
modified varlax  /harmony/enhanced/drlvm/trunk/vm/jitrino/src/translator/java/JavaByteCodeParser.h 06/09/2007 21:34:44 Fixed OPT compiler, HARMONY-3797 [drlvm][jit] bad handling of fall-through-reachable exception handlers
modified varlax  /harmony/enhanced/drlvm/trunk/vm/jitrino/src/translator/java/JavaFlowGraphBuilder.cpp 06/09/2007 21:34:44 Fixed OPT compiler, HARMONY-3797 [drlvm][jit] bad handling of fall-through-reachable exception handlers
modified varlax  /harmony/enhanced/drlvm/trunk/build/custom/msvc_2005/jitrino/jitrino.vcproj 06/09/2007 21:34:44 Fixed OPT compiler, HARMONY-3797 [drlvm][jit] bad handling of fall-through-reachable exception handlers
modified varlax  /harmony/enhanced/drlvm/trunk/vm/jitrino/src/translator/java/JavaLabelPrepass.h 06/09/2007 21:34:44 Fixed OPT compiler, HARMONY-3797 [drlvm][jit] bad handling of fall-through-reachable exception handlers
modified varlax  /harmony/enhanced/drlvm/trunk/vm/jitrino/src/jet/cg_regs.cpp 06/09/2007 21:31:24 Fixed JET compiler, HARMONY-3797 [drlvm][jit] bad handling of fall-through-reachable exception handlers
modified varlax  /harmony/enhanced/drlvm/trunk/vm/jitrino/src/jet/compiler.cpp 06/09/2007 21:31:24 Fixed JET compiler, HARMONY-3797 [drlvm][jit] bad handling of fall-through-reachable exception handlers
modified varlax  /harmony/enhanced/drlvm/trunk/vm/vmcore/src/kernel_classes/javasrc/org/apache/harmony/lang/reflect/parser/Parser.java 06/09/2007 21:18:59 Applied partial fix to HARMONY-2052 [drlvm][kernel] Improve/re-implement a parser of generic signatures
modified varlax  /harmony/enhanced/drlvm/trunk/vm/vmcore/src/kernel_classes/javasrc/java/lang/reflect/Method.java 06/09/2007 21:18:59 Applied partial fix to HARMONY-2052 [drlvm][kernel] Improve/re-implement a parser of generic signatures
modified varlax  /harmony/enhanced/drlvm/trunk/vm/vmcore/src/kernel_classes/javasrc/java/lang/Class.java 06/09/2007 21:18:59 Applied partial fix to HARMONY-2052 [drlvm][kernel] Improve/re-implement a parser of generic signatures
modified varlax  /harmony/enhanced/drlvm/trunk/vm/vmcore/src/kernel_classes/javasrc/java/lang/reflect/Field.java 06/09/2007 21:18:59 Applied partial fix to HARMONY-2052 [drlvm][kernel] Improve/re-implement a parser of generic signatures
modified varlax  /harmony/enhanced/drlvm/trunk/vm/vmcore/src/kernel_classes/javasrc/java/lang/reflect/Constructor.java 06/09/2007 21:18:59 Applied partial fix to HARMONY-2052 [drlvm][kernel] Improve/re-implement a parser of generic signatures
modified ayza  /harmony/enhanced/classlib/trunk/modules/portlib/src/main/native/include/unix/hysock.h 06/09/2007 21:05:33 Reworked patch from HARMONY-4077 ([classlib][portlib] socket related functions incorrectly work in socket > FD_SETSIZE) was applied
modified ayza  /harmony/enhanced/classlib/trunk/modules/luni/src/main/native/luni/unix/OSNetworkSystemLinux.c 06/09/2007 21:05:33 Reworked patch from HARMONY-4077 ([classlib][portlib] socket related functions incorrectly work in socket > FD_SETSIZE) was applied
modified ayza  /harmony/enhanced/classlib/trunk/modules/portlib/src/main/native/port/unix/hysock.c 06/09/2007 21:05:33 Reworked patch from HARMONY-4077 ([classlib][portlib] socket related functions incorrectly work in socket > FD_SETSIZE) was applied

Mime
View raw message