harmony-alerts mailing list archives

Site index · List index
Message view « Date » · « Thread »
Top « Date » · « Thread »
From nom...@intel.com
Subject [build-test alert] BUILD FAILED Windows 2003 x86_64 msvc debug: classlib tests
Date Wed, 13 Jun 2007 04:26:21 GMT
BUILD FAILED:
	Ant Error Message:
C:\cruise\cc\projects\classlib\trunk\build.xml:169: The following error occurred while executing
this line: C:\cruise\cc\projects\classlib\trunk\make\build-test.xml:148: There were test failures.

Date of build:	06/13/2007 10:38:05
Time to build:	47 minutes 42 seconds
Last changed:	06/12/2007 23:06:18
Last log entry:	Apply patch HARMONY-4134 ([classlib] [luni] Updated Javadoc for java.util.Scanner)

***********************************************************
Execution log (errors/warnings messages):	

========================================
Testing class libraries...
========================================

Checking for depends/jars/yoko_M2-20070130/yoko.jar
Checking for depends/jars/yoko_M2-20070130/yoko-core.jar
Checking for depends/jars/yoko_M2-20070130/yoko-rmi-impl.jar
Checking for depends/jars/yoko_M2-20070130/yoko-rmi-spec.jar
Checking for depends/jars/bcel-5.2/bcel-5.2.jar
Checking for depends/jars/xalan-j_2.7.0/xalan.jar
Checking for depends/jars/xerces_2.9.0/xerces.zip
Checking for depends/jars/junit_3.8.2/junit.jar
Checking for depends/jars/bcprov-jdk15-136/bcprov.jar
Checking for depends/jars/icu4j_3.4.4/icu4j_3_4_4.jar
Checking for depends/jars/mx4j_3.0.2/mx4j.zip
Checking for depends/jars/jetty/jetty-6.0.0.jar
Checking for depends/jars/jetty/jetty-util-6.0.0.jar
Checking for depends/jars/jetty/servlet-api-2.5-6.0.0.jar
Checking for depends/libs/windows.x86_64/msvcr80.dll
Checking for depends/libs/windows.x86_64/swing_awt_deps_win64_2007-02-08.tgz
hy.test.vm.name = drl
Compiling ACCESSIBILITY classes
Compiling ACCESSIBILITY tests
Since fork is false, ignoring memoryMaximumSize setting
Compiling ANNOTATION classes
Compiling ANNOTATION tests
Since fork is false, ignoring memoryMaximumSize setting
----------
1. WARNING in C:\cruise\cc\projects\classlib\trunk\modules\annotation\src\test\java\org\apache\harmony\annotation\tests\java\lang\annotation\IncompleteAnnotationExceptionTest.java
 (at line 53)
	clazz, elementName);
	^^^^^
Type safety: The expression of type Class needs unchecked conversion to conform to Class<?
extends Annotation>
----------
1 problem (1 warning)
Compiling APPLET classes
Compiling APPLET tests
Since fork is false, ignoring memoryMaximumSize setting
Compiling ARCHIVE classes
Compiling ARCHIVE tests
Since fork is false, ignoring memoryMaximumSize setting
The GC did not provide gc_add_weak_root_set_entry()
Compiling AUTH classes
Compiling AUTH tests
Since fork is false, ignoring memoryMaximumSize setting
The GC did not provide gc_add_weak_root_set_entry()
Compiling AWT classes
Compiling AWT tests
Since fork is false, ignoring memoryMaximumSize setting
The GC did not provide gc_add_weak_root_set_entry()
The GC did not provide gc_add_weak_root_set_entry()
Compiling BEANS classes
Compiling support classes for BEANS tests
Compiling internal BEANS tests
Compiling BEANS tests
Since fork is false, ignoring memoryMaximumSize setting
Running internal BEANS tests
Running BEANS tests
The GC did not provide gc_add_weak_root_set_entry()
Compiling CRYPTO classes
Compiling CRYPTO test support files
Compiling CRYPTO api tests
Since fork is false, ignoring memoryMaximumSize setting
Compiling CRYPTO api injected tests
Since fork is false, ignoring memoryMaximumSize setting
Compiling CRYPTO impl injected tests
Since fork is false, ignoring memoryMaximumSize setting
Compiling CRYPTO impl tests
Since fork is false, ignoring memoryMaximumSize setting
Running CRYPTO api tests
The GC did not provide gc_add_weak_root_set_entry()
Running CRYPTO api.injected tests
The GC did not provide gc_add_weak_root_set_entry()
Running CRYPTO impl tests
The GC did not provide gc_add_weak_root_set_entry()
Running CRYPTO impl injected tests
Compiling ImageIO classes
Compiling ImageIO tests
Since fork is false, ignoring memoryMaximumSize setting
Compiling INSTRUMENT classes
Compiling INSTRUMENT tests
Since fork is false, ignoring memoryMaximumSize setting
Compiling JNDI classes
Compiling JNDI tests
Since fork is false, ignoring memoryMaximumSize setting
The GC did not provide gc_add_weak_root_set_entry()
Compiling LANG-MANAGEMENT classes
Compiling LANG-MANAGEMENT API tests
Since fork is false, ignoring memoryMaximumSize setting
Compiling LANG-MANAGEMENT Implementation tests
Since fork is false, ignoring memoryMaximumSize setting
Compiling LOGGING classes
Compiling LOGGING tests
Since fork is false, ignoring memoryMaximumSize setting
The GC did not provide gc_add_weak_root_set_entry()
Compiling LUNI classes
Compiling LUNI JUnit Tests
Since fork is false, ignoring memoryMaximumSize setting
Running LUNI JUnit Tests
The GC did not provide gc_add_weak_root_set_entry()
java.io.IOException: Stream is closed
	at java.io.BufferedInputStream.read(BufferedInputStream.java:247)
	at java.io.FilterInputStream.read(FilterInputStream.java:137)
	at tests.support.Support_Exec$1.run(Support_Exec.java:177)
	at java.lang.Thread.run(Thread.java:662)
2007-06-13 10:56:45.376::INFO:  Logging to STDERR via org.mortbay.log.StdErrLog
2007-06-13 10:56:45.735::INFO:  jetty-6.0.x
2007-06-13 10:56:46.235::INFO:  Started SocketConnector @ 0.0.0.0:3527
2007-06-13 10:58:05.251::INFO:  jetty-6.0.x
2007-06-13 10:58:05.251::INFO:  Started SocketConnector @ 0.0.0.0:3776
2007-06-13 10:58:06.485::INFO:  jetty-6.0.x
2007-06-13 10:58:06.485::INFO:  Started SocketConnector @ 0.0.0.0:3787
Compiling MATH classes
Compiling MATH tests
Since fork is false, ignoring memoryMaximumSize setting
The GC did not provide gc_add_weak_root_set_entry()
Compiling MISC classes
Compiling MISC tests
Since fork is false, ignoring memoryMaximumSize setting
Compiling NIO classes
Compiling NIO tests
Since fork is false, ignoring memoryMaximumSize setting
The GC did not provide gc_add_weak_root_set_entry()
Compiling NIO_CHAR classes
Compiling NIO_CHAR tests
Since fork is false, ignoring memoryMaximumSize setting
The GC did not provide gc_add_weak_root_set_entry()
Cannot find unmappable byte array for US-ASCII
Cannot find unmappable byte array for gb18030
Cannot find unmappable byte array for ISO-8859-1
Cannot find malform byte array for ISO-8859-1
Cannot find unmappable byte array for UTF-16BE
Cannot find malform byte array for UTF-16BE
Cannot find unmappable byte array for UTF-16
Cannot find malform byte array for UTF-16
Cannot find unmappable byte array for UTF-16LE
Cannot find malform byte array for UTF-16LE
Cannot find unmappable byte array for UTF-8
Compiling PACK200 classes
Compiling PACK200 tests
Since fork is false, ignoring memoryMaximumSize setting
Running PACK200 tests
The GC did not provide gc_add_weak_root_set_entry()
Compiling PREFS classes
Compiling PREFS tests
Since fork is false, ignoring memoryMaximumSize setting
The GC did not provide gc_add_weak_root_set_entry()
Compiling PRINT classes
Compiling Print tests
Since fork is false, ignoring memoryMaximumSize setting
The GC did not provide gc_add_weak_root_set_entry()
Compiling REGEX classes
Compiling REGEX tests
Since fork is false, ignoring memoryMaximumSize setting
The GC did not provide gc_add_weak_root_set_entry()
Compiling RMI classes
Compiling RMI api tests
Since fork is false, ignoring memoryMaximumSize setting
Running RMI api tests
testDirectSocket_SingleVM starting
Test server started.
Object: MyRemoteObject[UnicastServerRef[endpoint:[[10.125.122.44:1167]](local), ObjID[65536,
UID[118dfea0:1132342cffb:-8000]]]] created and exported.
Jun 13, 2007 11:06:33 AM org.apache.harmony.rmi.server.RMIReference makeStrong
FINER: main: Strongly referenced RegistryImpl
Registry created.
Object bound in the registry.
Registry located.
Jun 13, 2007 11:06:36 AM org.apache.harmony.rmi.client.ClientConnection sendDGCAck
FINER: main: Sent DGC ack to [localhost:1099] for UID[118dfea0:1132342cffb:-7ffd]
Lookup object is: Proxy[interf:[org.apache.harmony.rmi.test.MyRemoteInterface, java.rmi.Remote],
RemoteObjectInvocationHandler[UnicastRef[endpoint:[[10.125.122.44:1167]](remote), ObjID[65536,
UID[118dfea0:1132342cffb:-8000]]]]]
Testing test_String_Void...
Done.
Testing test_Void_String...
Returned: MyRemoteObject.test_Void_String
Done.
Testing test_Int_Void...
Done.
Testing test_Void_Int...
Returned: 987654321
Done.
Testing test_Remote_Void...
Done.
Testing test_Remote_Void with remote object extending another remote object...
Done.
Testing test_Void_Remote...
The GC did not provide gc_add_weak_root_set_entry()
Jun 13, 2007 11:06:37 AM org.apache.harmony.rmi.client.ClientConnection sendDGCAck
FINER: main: Sent DGC ack to [10.125.122.44:1167] for UID[118dfea0:1132342cffb:-7fe8]
Returned: Proxy[interf:[org.apache.harmony.rmi.test.MyRemoteInterface2, java.rmi.Remote],
RemoteObjectInvocationHandler[UnicastRef[endpoint:[[10.125.122.44:1175]](remote), ObjID[65539,
UID[118dfea0:1132342cffb:-7fe9]]]]]
Done.
Testing test_Long_Long...
Returned: 998877665544332211
Done.
Testing test_String_String...
Returned: MyRemoteObject.test_String_String
Done.
Testing test_Remote_Remote...
Jun 13, 2007 11:06:37 AM org.apache.harmony.rmi.client.ClientConnection sendDGCAck
FINER: main: Sent DGC ack to [10.125.122.44:1167] for UID[118dfea0:1132342cffb:-7fde]
Returned: Proxy[interf:[org.apache.harmony.rmi.test.MyRemoteInterface2, java.rmi.Remote],
RemoteObjectInvocationHandler[UnicastRef[endpoint:[[10.125.122.44:1179]](remote), ObjID[65541,
UID[118dfea0:1132342cffb:-7fdf]]]]]
Done.
Testing test_RemoteString_Void...
Done.
Testing test_RemoteRemote_Remote...
Jun 13, 2007 11:06:38 AM org.apache.harmony.rmi.client.ClientConnection sendDGCAck
FINER: main: Sent DGC ack to [10.125.122.44:1167] for UID[118dfea0:1132342cffb:-7fd0]
Returned: Proxy[interf:[org.apache.harmony.rmi.test.MyRemoteInterface2, java.rmi.Remote],
RemoteObjectInvocationHandler[UnicastRef[endpoint:[[10.125.122.44:1186]](remote), ObjID[65545,
UID[118dfea0:1132342cffb:-7fd1]]]]]
Done.
Testing test_BooleanStringRemote_Void...
Done.
Testing test_Proxy_Void...
Done.
Testing test_Array_Void...
Done.
Testing test_Void_Array...
Done.
Testing test_RemoteArray_Void...
Done.
Testing test_Void_RemoteArray...
Jun 13, 2007 11:06:38 AM org.apache.harmony.rmi.client.ClientConnection sendDGCAck
FINER: main: Sent DGC ack to [10.125.122.44:1167] for UID[118dfea0:1132342cffb:-7fbd]
Done.
Testing test_Exception...
org.apache.harmony.rmi.test.MyException: MyRemoteObject.test_Exception
Done.
Testing test_Error...
java.rmi.ServerError: Error occurred while remote method invocation; nested exception is:
	java.lang.Error: MyRemoteObject.test_Error
Done.
Testing test_RuntimeException...
java.lang.RuntimeException: MyRemoteObject.text_RuntimeException
Done.
Testing test_RemoteException...
java.rmi.ServerException: RemoteException occurred while remote method invocation; nested
exception is:
	java.rmi.RemoteException: MyRemoteObject.text_RemoteException
Done.
Test server complete.
Test server closing.
Unexporting MyRemoteObject[UnicastServerRef[endpoint:[[10.125.122.44:1167]](local), ObjID[65536,
UID[118dfea0:1132342cffb:-8000]]]] ...
testDirectHTTP_SingleVM starting
Test server started.
Object: MyRemoteObject[UnicastServerRef[endpoint:[[10.125.122.44:1195]](local), ObjID[65536,
UID[118dfea0:11323431a33:-8000]]]] created and exported.
Jun 13, 2007 11:06:52 AM org.apache.harmony.rmi.server.RMIReference makeStrong
FINER: main: Strongly referenced RegistryImpl
Registry created.
Object bound in the registry.
Registry located.
Jun 13, 2007 11:06:55 AM org.apache.harmony.rmi.client.ClientConnection sendDGCAck
FINER: main: Sent DGC ack to [localhost:1099] for UID[118dfea0:11323431a33:-7ffd]
Lookup object is: Proxy[interf:[org.apache.harmony.rmi.test.MyRemoteInterface, java.rmi.Remote],
RemoteObjectInvocationHandler[UnicastRef[endpoint:[[10.125.122.44:1195]](remote), ObjID[65536,
UID[118dfea0:11323431a33:-8000]]]]]
Testing test_String_Void...
Done.
Testing test_Void_String...
Returned: MyRemoteObject.test_Void_String
Done.
Testing test_Int_Void...
Done.
Testing test_Void_Int...
Returned: 987654321
Done.
Testing test_Remote_Void...
Done.
Testing test_Remote_Void with remote object extending another remote object...
Done.
Testing test_Void_Remote...
The GC did not provide gc_add_weak_root_set_entry()
Jun 13, 2007 11:06:56 AM org.apache.harmony.rmi.client.ClientConnection sendDGCAck
FINER: main: Sent DGC ack to [10.125.122.44:1195] for UID[118dfea0:11323431a33:-7fe8]
Returned: Proxy[interf:[org.apache.harmony.rmi.test.MyRemoteInterface2, java.rmi.Remote],
RemoteObjectInvocationHandler[UnicastRef[endpoint:[[10.125.122.44:1203]](remote), ObjID[65539,
UID[118dfea0:11323431a33:-7fe9]]]]]
Done.
Testing test_Long_Long...
Returned: 998877665544332211
Done.
Testing test_String_String...
Returned: MyRemoteObject.test_String_String
Done.
Testing test_Remote_Remote...
Jun 13, 2007 11:06:56 AM org.apache.harmony.rmi.client.ClientConnection sendDGCAck
FINER: main: Sent DGC ack to [10.125.122.44:1195] for UID[118dfea0:11323431a33:-7fde]
Returned: Proxy[interf:[org.apache.harmony.rmi.test.MyRemoteInterface2, java.rmi.Remote],
RemoteObjectInvocationHandler[UnicastRef[endpoint:[[10.125.122.44:1207]](remote), ObjID[65541,
UID[118dfea0:11323431a33:-7fdf]]]]]
Done.
Testing test_RemoteString_Void...
Done.
Testing test_RemoteRemote_Remote...
Jun 13, 2007 11:06:57 AM org.apache.harmony.rmi.client.ClientConnection sendDGCAck
FINER: main: Sent DGC ack to [10.125.122.44:1195] for UID[118dfea0:11323431a33:-7fd0]
Returned: Proxy[interf:[org.apache.harmony.rmi.test.MyRemoteInterface2, java.rmi.Remote],
RemoteObjectInvocationHandler[UnicastRef[endpoint:[[10.125.122.44:1214]](remote), ObjID[65545,
UID[118dfea0:11323431a33:-7fd1]]]]]
Done.
Testing test_BooleanStringRemote_Void...
Done.
Testing test_Proxy_Void...
Done.
Testing test_Array_Void...
Done.
Testing test_Void_Array...
Done.
Testing test_RemoteArray_Void...
Done.
Testing test_Void_RemoteArray...
Jun 13, 2007 11:06:57 AM org.apache.harmony.rmi.client.ClientConnection sendDGCAck
FINER: main: Sent DGC ack to [10.125.122.44:1195] for UID[118dfea0:11323431a33:-7fbd]
Done.
Testing test_Exception...
org.apache.harmony.rmi.test.MyException: MyRemoteObject.test_Exception
Done.
Testing test_Error...
java.rmi.ServerError: Error occurred while remote method invocation; nested exception is:
	java.lang.Error: MyRemoteObject.test_Error
Done.
Testing test_RuntimeException...
java.lang.RuntimeException: MyRemoteObject.text_RuntimeException
Done.
Testing test_RemoteException...
java.rmi.ServerException: RemoteException occurred while remote method invocation; nested
exception is:
	java.rmi.RemoteException: MyRemoteObject.text_RemoteException
Done.
Test server complete.
Test server closing.
The GC did not provide gc_add_weak_root_set_entry()
Unexporting MyRemoteObject1[UnicastServerRef[endpoint:[[10.125.122.44:1223]](local), ObjID[65536,
UID[11ee1be8:11323435cab:-7ff7]]]] ...
Done.
Unexporting MyRemoteObject1[UnicastServerRef[endpoint:[[10.125.122.44:1224]](local), ObjID[65537,
UID[11ee1be8:11323435cab:-7ff6]]]] ...
Done.
Unexporting MyRemoteObject1[UnicastServerRef[endpoint:[[10.125.122.44:1225]](local), ObjID[65538,
UID[11ee1be8:11323435cab:-7ff5]]]] ...
Done.
Unexporting MyRemoteObject1[UnicastServerRef[endpoint:[[10.125.122.44:1226]](local), ObjID[65539,
UID[11ee1be8:11323435cab:-7ff4]]]] ...
Done.
Unexporting MyRemoteObject1[UnicastServerRef[endpoint:[[10.125.122.44:1227]](local), ObjID[65540,
UID[11ee1be8:11323435cab:-7ff3]]]] ...
Done.
Unexporting MyRemoteObject1[UnicastServerRef[endpoint:[[10.125.122.44:1228]](local), ObjID[65541,
UID[11ee1be8:11323435cab:-7ff2]]]] ...
Done.
Unexporting MyRemoteObject1[UnicastServerRef[endpoint:[[10.125.122.44:1229]](local), ObjID[65542,
UID[11ee1be8:11323435cab:-7ff1]]]] ...
Done.
Unexporting MyRemoteObject1[UnicastServerRef[endpoint:[[10.125.122.44:1230]](local), ObjID[65543,
UID[11ee1be8:11323435cab:-7ff0]]]] ...
Done.
LogStream[tst]:
Compiling SECURITY classes
Compiling SECURITY test support files
Since fork is false, ignoring memoryMaximumSize setting
Compiling SECURITY api tests
Since fork is false, ignoring memoryMaximumSize setting
Compiling SECURITY api injected tests
Since fork is false, ignoring memoryMaximumSize setting
Compiling SECURITY impl injected tests
Since fork is false, ignoring memoryMaximumSize setting
Compiling SECURITY impl tests
Since fork is false, ignoring memoryMaximumSize setting
Running SECURITY api tests
The GC did not provide gc_add_weak_root_set_entry()
Running SECURITY api.injected tests
The GC did not provide gc_add_weak_root_set_entry()
Running SECURITY impl tests
The GC did not provide gc_add_weak_root_set_entry()
Running SECURITY impl injected tests
The GC did not provide gc_add_weak_root_set_entry()
Compiling SOUND classes
Compiling SOUND tests
Since fork is false, ignoring memoryMaximumSize setting
The GC did not provide gc_add_weak_root_set_entry()
Compiling SQL classes
Compiling SQL tests
Since fork is false, ignoring memoryMaximumSize setting
The GC did not provide gc_add_weak_root_set_entry()
Compiling Sun Compat classes
Compiling SUNCOMPAT tests
Compiling TEXT classes
Compiling TEXT tests
Since fork is false, ignoring memoryMaximumSize setting
The GC did not provide gc_add_weak_root_set_entry()
Compiling X-NET classes
Compiling X-NET test support files
Compiling X-NET api tests
Since fork is false, ignoring memoryMaximumSize setting
Compiling X-NET impl injected tests
Since fork is false, ignoring memoryMaximumSize setting
Compiling X-NET impl tests
Since fork is false, ignoring memoryMaximumSize setting
Running X-NET api tests
The GC did not provide gc_add_weak_root_set_entry()
Running X-NET impl tests
The GC did not provide gc_add_weak_root_set_entry()
Running X-NET impl injected tests
The GC did not provide gc_add_weak_root_set_entry()
The test report is in C:\cruise\cc\projects\classlib\trunk\build\test_report\html\index.html

***********************************************************
Unit Tests: (16474)
        
failure: test_read tests.api.java.io.InputStreamReaderTest
Unit Test Error Details:	(1)
                
Test: test_readClass: tests.api.java.io.InputStreamReaderTestjunit.framework.AssertionFailedError:
Exception during setUp : null
	at tests.api.java.io.InputStreamReaderTest.setUp(InputStreamReaderTest.java:119)


***********************************************************
Modifications since last successful build:	(134)
            
modified odeakin  /harmony/enhanced/classlib/trunk/modules/luni/src/main/java/java/util/Scanner.java
06/12/2007 23:06:18 Apply patch HARMONY-4134 ([classlib] [luni] Updated Javadoc for java.util.Scanner)
modified odeakin  /harmony/enhanced/classlib/trunk/modules/security/src/main/java/common/java/security/BasicPermissionCollection.java
06/12/2007 17:44:44 Apply patch HARMONY-4092 ([classlib] [security] Javadoc update for java.security.BasicPermissionCollection)
modified odeakin  /harmony/enhanced/classlib/trunk/THIRD_PARTY_NOTICES.txt 06/12/2007 16:26:38
Apply patch HARMONY-4028 ([classlib] THIRD_PARTY_NOTICES.txt needs copyright statement for
RFC 2891 specification (and others))
modified odeakin  /harmony/enhanced/classlib/trunk/modules/security/src/main/java/common/java/security/Provider.java
06/12/2007 16:12:09 Apply patch HARMONY-4090 ([classlib] [security] Javadoc update for java.security.Provider)
modified tellison  /harmony/enhanced/classlib/trunk/modules/luni/src/main/java/java/util/ListResourceBundle.java
06/12/2007 00:15:36 Apply patch HARMONY-4083 ([classlib][luni] Performance improvement of
java.util.ListResourceBundle)
modified tellison  /harmony/enhanced/classlib/trunk/modules/luni/src/main/java/java/util/LinkedHashMap.java
06/12/2007 00:11:27 Apply slightly modified patch for HARMONY-4082 ([classlib][luni] Performance
improvement of java.util.LinkedHashMap)
modified tellison  /harmony/enhanced/classlib/trunk/modules/luni/src/main/java/java/util/Observable.java
06/12/2007 00:04:45 Apply patch HARMONY-4087 ([classlib][luni] Performance improvement of
java.util.Observable)
modified tellison  /harmony/enhanced/classlib/trunk/modules/luni/src/main/java/java/util/UUID.java
06/11/2007 23:58:29 Apply patch HARMONY-4120 ([classlib][luni] Remove some unnecessary synchronization
blocks for java.util.Vector & java.util.UUID)
modified tellison  /harmony/enhanced/classlib/trunk/modules/luni/src/test/java/tests/api/java/util/VectorTest.java
06/11/2007 23:58:29 Apply patch HARMONY-4120 ([classlib][luni] Remove some unnecessary synchronization
blocks for java.util.Vector & java.util.UUID)
modified tellison  /harmony/enhanced/classlib/trunk/modules/luni/src/main/java/java/util/Vector.java
06/11/2007 23:58:29 Apply patch HARMONY-4120 ([classlib][luni] Remove some unnecessary synchronization
blocks for java.util.Vector & java.util.UUID)
modified varlax  /harmony/enhanced/drlvm/trunk/vm/jitrino/src/translator/java/JavaLabelPrepass.cpp
06/11/2007 23:52:07 Fix up spoiled commit [545753] HARMONY-3797
modified tellison  /harmony/enhanced/classlib/trunk/modules/sql/src/main/java/javax/sql/rowset/serial/SQLInputImpl.java
06/11/2007 21:22:50 Remove not implemented markers for methods that are now written.
modified tellison  /harmony/enhanced/drlvm/trunk/vm/vmcore/src/kernel_classes/javasrc/java/lang/ClassLoader.java
06/11/2007 21:17:55 Mark a number of kernel class API methods deprecated as spec.
modified tellison  /harmony/enhanced/drlvm/trunk/vm/vmcore/src/kernel_classes/javasrc/java/lang/Runtime.java
06/11/2007 21:17:55 Mark a number of kernel class API methods deprecated as spec.
modified tellison  /harmony/enhanced/drlvm/trunk/vm/vmcore/src/kernel_classes/javasrc/java/lang/System.java
06/11/2007 21:17:55 Mark a number of kernel class API methods deprecated as spec.
modified tellison  /harmony/enhanced/drlvm/trunk/vm/vmcore/src/kernel_classes/javasrc/java/lang/ThreadGroup.java
06/11/2007 21:17:55 Mark a number of kernel class API methods deprecated as spec.
modified tellison  /harmony/enhanced/drlvm/trunk/vm/vmcore/src/kernel_classes/javasrc/java/lang/Thread.java
06/11/2007 21:17:55 Mark a number of kernel class API methods deprecated as spec.
added apetrenko  /harmony/enhanced/classlib/trunk/modules/awt/src/main/native/fontlib/shared/T1Glyph.cpp
06/11/2007 00:31:22 Font library contributionHARMONY-3583 and HARMONY-4104
added apetrenko  /harmony/enhanced/classlib/trunk/modules/awt/src/main/native/fontlib/shared/Glyph.h
06/11/2007 00:31:22 Font library contributionHARMONY-3583 and HARMONY-4104
added apetrenko  /harmony/enhanced/classlib/trunk/modules/awt/src/main/native/fontlib/shared/include/fljni.h
06/11/2007 00:31:22 Font library contributionHARMONY-3583 and HARMONY-4104
added apetrenko  /harmony/enhanced/classlib/trunk/modules/awt/src/main/native/fontlib/unix
06/11/2007 00:31:22 Font library contributionHARMONY-3583 and HARMONY-4104
added apetrenko  /harmony/enhanced/classlib/trunk/modules/awt/src/main/native/fontlib/shared/TTCurve.h
06/11/2007 00:31:22 Font library contributionHARMONY-3583 and HARMONY-4104
added apetrenko  /harmony/enhanced/classlib/trunk/modules/awt/src/main/native/fontlib/shared/include
06/11/2007 00:31:22 Font library contributionHARMONY-3583 and HARMONY-4104
added apetrenko  /harmony/enhanced/classlib/trunk/modules/awt/src/main/native/fontlib/shared/include/org_apache_harmony_awt_gl_font_fontlib_FLGlyph.h
06/11/2007 00:31:22 Font library contributionHARMONY-3583 and HARMONY-4104
added apetrenko  /harmony/enhanced/classlib/trunk/modules/awt/src/main/native/fontlib/shared/EncodedValue.h
06/11/2007 00:31:22 Font library contributionHARMONY-3583 and HARMONY-4104
added apetrenko  /harmony/enhanced/classlib/trunk/modules/awt/src/main/native/fontlib/shared/Environment.cpp
06/11/2007 00:31:22 Font library contributionHARMONY-3583 and HARMONY-4104
added apetrenko  /harmony/enhanced/classlib/trunk/modules/awt/src/main/java/common/org/apache/harmony/awt/gl/font/fontlib/FLOutline.java
06/11/2007 00:31:22 Font library contributionHARMONY-3583 and HARMONY-4104
added apetrenko  /harmony/enhanced/classlib/trunk/modules/awt/src/main/native/fontlib/shared/Font.cpp
06/11/2007 00:31:22 Font library contributionHARMONY-3583 and HARMONY-4104
added apetrenko  /harmony/enhanced/classlib/trunk/modules/awt/src/main/native/fontlib/windows/fl.rc
06/11/2007 00:31:22 Font library contributionHARMONY-3583 and HARMONY-4104
modified apetrenko  /harmony/enhanced/classlib/trunk/modules/awt/build.xml 06/11/2007 00:31:22
Font library contributionHARMONY-3583 and HARMONY-4104
added apetrenko  /harmony/enhanced/classlib/trunk/modules/awt/src/main/native/fontlib 06/11/2007
00:31:22 Font library contributionHARMONY-3583 and HARMONY-4104
added apetrenko  /harmony/enhanced/classlib/trunk/modules/awt/src/main/java/common/org/apache/harmony/awt/gl/font/fontlib/FLGlyph.java
06/11/2007 00:31:22 Font library contributionHARMONY-3583 and HARMONY-4104
added apetrenko  /harmony/enhanced/classlib/trunk/modules/awt/src/main/native/fontlib/unix/makefile
06/11/2007 00:31:22 Font library contributionHARMONY-3583 and HARMONY-4104
modified apetrenko  /harmony/enhanced/classlib/trunk/modules/awt/src/main/java/unix/org/apache/harmony/awt/gl/linux/XGraphics2D.java
06/11/2007 00:31:22 Font library contributionHARMONY-3583 and HARMONY-4104
added apetrenko  /harmony/enhanced/classlib/trunk/modules/awt/src/main/native/fontlib/shared/T1Font.cpp
06/11/2007 00:31:22 Font library contributionHARMONY-3583 and HARMONY-4104
modified apetrenko  /harmony/enhanced/classlib/trunk/modules/awt/src/main/java/common/org/apache/harmony/awt/gl/font/FontPeerImpl.java
06/11/2007 00:31:22 Font library contributionHARMONY-3583 and HARMONY-4104
added apetrenko  /harmony/enhanced/classlib/trunk/modules/awt/src/main/native/fontlib/unix/exports.txt
06/11/2007 00:31:22 Font library contributionHARMONY-3583 and HARMONY-4104
added apetrenko  /harmony/enhanced/classlib/trunk/modules/awt/src/main/native/fontlib/shared/Outline.cpp
06/11/2007 00:31:22 Font library contributionHARMONY-3583 and HARMONY-4104
added apetrenko  /harmony/enhanced/classlib/trunk/modules/awt/src/main/native/fontlib/shared
06/11/2007 00:31:22 Font library contributionHARMONY-3583 and HARMONY-4104
added apetrenko  /harmony/enhanced/classlib/trunk/modules/awt/src/main/native/fontlib/shared/Tables.h
06/11/2007 00:31:22 Font library contributionHARMONY-3583 and HARMONY-4104
added apetrenko  /harmony/enhanced/classlib/trunk/modules/awt/src/main/native/fontlib/windows/makefile
06/11/2007 00:31:22 Font library contributionHARMONY-3583 and HARMONY-4104
added apetrenko  /harmony/enhanced/classlib/trunk/modules/awt/src/main/native/fontlib/shared/include/org_apache_harmony_awt_gl_font_fontlib_FLFontManager.h
06/11/2007 00:31:22 Font library contributionHARMONY-3583 and HARMONY-4104
added apetrenko  /harmony/enhanced/classlib/trunk/modules/awt/src/main/native/fontlib/shared/Glyph.cpp
06/11/2007 00:31:22 Font library contributionHARMONY-3583 and HARMONY-4104
added apetrenko  /harmony/enhanced/classlib/trunk/modules/awt/src/main/native/fontlib/shared/TTFont.h
06/11/2007 00:31:22 Font library contributionHARMONY-3583 and HARMONY-4104
added apetrenko  /harmony/enhanced/classlib/trunk/modules/awt/src/main/java/common/org/apache/harmony/awt/gl/font/fontlib
06/11/2007 00:31:22 Font library contributionHARMONY-3583 and HARMONY-4104
modified apetrenko  /harmony/enhanced/classlib/trunk/modules/awt/src/main/java/common/org/apache/harmony/awt/gl/font/FontMetricsImpl.java
06/11/2007 00:31:22 Font library contributionHARMONY-3583 and HARMONY-4104
added apetrenko  /harmony/enhanced/classlib/trunk/modules/awt/src/main/java/common/org/apache/harmony/awt/gl/font/fontlib/FLFontManager.java
06/11/2007 00:31:22 Font library contributionHARMONY-3583 and HARMONY-4104
modified apetrenko  /harmony/enhanced/classlib/trunk/modules/awt/src/main/java/common/org/apache/harmony/awt/gl/font/Glyph.java
06/11/2007 00:31:22 Font library contributionHARMONY-3583 and HARMONY-4104
added apetrenko  /harmony/enhanced/classlib/trunk/modules/awt/src/main/native/fontlib/shared/TTCurve.cpp
06/11/2007 00:31:22 Font library contributionHARMONY-3583 and HARMONY-4104
added apetrenko  /harmony/enhanced/classlib/trunk/modules/awt/src/main/native/fontlib/shared/T1Glyph.h
06/11/2007 00:31:22 Font library contributionHARMONY-3583 and HARMONY-4104
added apetrenko  /harmony/enhanced/classlib/trunk/modules/awt/src/main/native/fontlib/shared/ParsingTables.cpp
06/11/2007 00:31:22 Font library contributionHARMONY-3583 and HARMONY-4104
added apetrenko  /harmony/enhanced/classlib/trunk/modules/awt/src/main/native/fontlib/shared/EncodedValue.cpp
06/11/2007 00:31:22 Font library contributionHARMONY-3583 and HARMONY-4104
modified apetrenko  /harmony/enhanced/classlib/trunk/modules/awt/src/main/java/common/org/apache/harmony/awt/gl/CommonGraphicsEnvironment.java
06/11/2007 00:31:22 Font library contributionHARMONY-3583 and HARMONY-4104
added apetrenko  /harmony/enhanced/classlib/trunk/modules/awt/src/main/native/fontlib/shared/Type1Structs.h
06/11/2007 00:31:22 Font library contributionHARMONY-3583 and HARMONY-4104
modified apetrenko  /harmony/enhanced/classlib/trunk/modules/awt/src/main/java/common/org/apache/harmony/awt/gl/CommonGraphics2D.java
06/11/2007 00:31:22 Font library contributionHARMONY-3583 and HARMONY-4104
added apetrenko  /harmony/enhanced/classlib/trunk/modules/awt/src/main/native/fontlib/shared/include/org_apache_harmony_awt_gl_font_fontlib_FLFontPeer.h
06/11/2007 00:31:22 Font library contributionHARMONY-3583 and HARMONY-4104
added apetrenko  /harmony/enhanced/classlib/trunk/modules/awt/src/main/native/fontlib/windows/fl.def
06/11/2007 00:31:22 Font library contributionHARMONY-3583 and HARMONY-4104
modified apetrenko  /harmony/enhanced/classlib/trunk/modules/awt/src/main/java/common/java/awt/Font.java
06/11/2007 00:31:22 Font library contributionHARMONY-3583 and HARMONY-4104
added apetrenko  /harmony/enhanced/classlib/trunk/modules/awt/src/main/java/common/org/apache/harmony/awt/gl/font/fontlib/FLTextRenderer.java
06/11/2007 00:31:22 Font library contributionHARMONY-3583 and HARMONY-4104
added apetrenko  /harmony/enhanced/classlib/trunk/modules/awt/src/main/native/fontlib/shared/fljni.cpp
06/11/2007 00:31:22 Font library contributionHARMONY-3583 and HARMONY-4104
added apetrenko  /harmony/enhanced/classlib/trunk/modules/awt/src/main/native/fontlib/windows
06/11/2007 00:31:22 Font library contributionHARMONY-3583 and HARMONY-4104
modified apetrenko  /harmony/enhanced/classlib/trunk/modules/awt/src/main/java/windows/org/apache/harmony/awt/gl/windows/WinGDIPGraphics2D.java
06/11/2007 00:31:22 Font library contributionHARMONY-3583 and HARMONY-4104
modified apetrenko  /harmony/enhanced/classlib/trunk/modules/awt/src/main/java/common/org/apache/harmony/awt/gl/font/FontManager.java
06/11/2007 00:31:22 Font library contributionHARMONY-3583 and HARMONY-4104
added apetrenko  /harmony/enhanced/classlib/trunk/modules/awt/src/main/native/fontlib/shared/AGL.h
06/11/2007 00:31:22 Font library contributionHARMONY-3583 and HARMONY-4104
added apetrenko  /harmony/enhanced/classlib/trunk/modules/awt/src/main/java/common/org/apache/harmony/awt/gl/font/fontlib/FLFontPeer.java
06/11/2007 00:31:22 Font library contributionHARMONY-3583 and HARMONY-4104
added apetrenko  /harmony/enhanced/classlib/trunk/modules/awt/src/main/native/fontlib/shared/Environment.h
06/11/2007 00:31:22 Font library contributionHARMONY-3583 and HARMONY-4104
added apetrenko  /harmony/enhanced/classlib/trunk/modules/awt/src/main/native/fontlib/shared/include/org_apache_harmony_awt_gl_font_fontlib_FLPath.h
06/11/2007 00:31:22 Font library contributionHARMONY-3583 and HARMONY-4104
added apetrenko  /harmony/enhanced/classlib/trunk/modules/awt/src/main/native/fontlib/shared/Font.h
06/11/2007 00:31:22 Font library contributionHARMONY-3583 and HARMONY-4104
modified apetrenko  /harmony/enhanced/classlib/trunk/modules/awt/src/main/java/common/org/apache/harmony/awt/gl/opengl/OGLGraphics2D.java
06/11/2007 00:31:22 Font library contributionHARMONY-3583 and HARMONY-4104
added apetrenko  /harmony/enhanced/classlib/trunk/modules/awt/src/main/native/fontlib/shared/TTFont.cpp
06/11/2007 00:31:22 Font library contributionHARMONY-3583 and HARMONY-4104
added apetrenko  /harmony/enhanced/classlib/trunk/modules/awt/src/main/native/fontlib/shared/T1Font.h
06/11/2007 00:31:22 Font library contributionHARMONY-3583 and HARMONY-4104
added apetrenko  /harmony/enhanced/classlib/trunk/modules/awt/src/main/java/common/org/apache/harmony/awt/gl/font/fontlib/FLPath.java
06/11/2007 00:31:22 Font library contributionHARMONY-3583 and HARMONY-4104
added apetrenko  /harmony/enhanced/classlib/trunk/modules/awt/src/main/native/fontlib/shared/Outline.h
06/11/2007 00:31:22 Font library contributionHARMONY-3583 and HARMONY-4104
modified wjwashburn  /harmony/enhanced/drlvm/trunk/vm/vmcore/src/init/parse_arguments.cpp
06/10/2007 09:56:01 Harmony-4001, this patch provides the ability to set the size of a thread'sstack"build
test2" has been known to pass on most platforms
modified wjwashburn  /harmony/enhanced/drlvm/trunk/vm/vmcore/src/util/win/ia32_em64t/nt_exception_filter_common.cpp
06/10/2007 09:56:01 Harmony-4001, this patch provides the ability to set the size of a thread'sstack"build
test2" has been known to pass on most platforms
modified wjwashburn  /harmony/enhanced/drlvm/trunk/vm/vmcore/src/class_support/C_Interface.cpp
06/10/2007 09:56:01 Harmony-4001, this patch provides the ability to set the size of a thread'sstack"build
test2" has been known to pass on most platforms
modified wjwashburn  /harmony/enhanced/drlvm/trunk/vm/vmcore/src/util/linux/signals_ipf.cpp
06/10/2007 09:56:01 Harmony-4001, this patch provides the ability to set the size of a thread'sstack"build
test2" has been known to pass on most platforms
modified wjwashburn  /harmony/enhanced/drlvm/trunk/vm/vmcore/src/thread/thread_generic.cpp
06/10/2007 09:56:01 Harmony-4001, this patch provides the ability to set the size of a thread'sstack"build
test2" has been known to pass on most platforms
modified wjwashburn  /harmony/enhanced/drlvm/trunk/vm/thread/src/win/os_thread.c 06/10/2007
09:56:01 Harmony-4001, this patch provides the ability to set the size of a thread'sstack"build
test2" has been known to pass on most platforms
modified wjwashburn  /harmony/enhanced/drlvm/trunk/vm/vmcore/include/exceptions.h 06/10/2007
09:56:01 Harmony-4001, this patch provides the ability to set the size of a thread'sstack"build
test2" has been known to pass on most platforms
modified wjwashburn  /harmony/enhanced/drlvm/trunk/vm/thread/src/thread_private.h 06/10/2007
09:56:01 Harmony-4001, this patch provides the ability to set the size of a thread'sstack"build
test2" has been known to pass on most platforms
modified wjwashburn  /harmony/enhanced/drlvm/trunk/vm/thread/src/linux/os_thread.c 06/10/2007
09:56:01 Harmony-4001, this patch provides the ability to set the size of a thread'sstack"build
test2" has been known to pass on most platforms
modified wjwashburn  /harmony/enhanced/drlvm/trunk/vm/thread/src/hythr.exp 06/10/2007 09:56:01
Harmony-4001, this patch provides the ability to set the size of a thread'sstack"build test2"
has been known to pass on most platforms
modified wjwashburn  /harmony/enhanced/drlvm/trunk/vm/thread/src/thread_java_basic.c 06/10/2007
09:56:01 Harmony-4001, this patch provides the ability to set the size of a thread'sstack"build
test2" has been known to pass on most platforms
modified wjwashburn  /harmony/enhanced/drlvm/trunk/vm/thread/src/hythr.def 06/10/2007 09:56:01
Harmony-4001, this patch provides the ability to set the size of a thread'sstack"build test2"
has been known to pass on most platforms
modified wjwashburn  /harmony/enhanced/drlvm/trunk/vm/include/open/vm.h 06/10/2007 09:56:01
Harmony-4001, this patch provides the ability to set the size of a thread'sstack"build test2"
has been known to pass on most platforms
modified wjwashburn  /harmony/enhanced/drlvm/trunk/vm/vmcore/src/init/harmony.properties 06/10/2007
09:56:01 Harmony-4001, this patch provides the ability to set the size of a thread'sstack"build
test2" has been known to pass on most platforms
modified wjwashburn  /harmony/enhanced/drlvm/trunk/vm/thread/src/thread_native_basic.c 06/10/2007
09:56:01 Harmony-4001, this patch provides the ability to set the size of a thread'sstack"build
test2" has been known to pass on most platforms
modified wjwashburn  /harmony/enhanced/drlvm/trunk/vm/vmcore/src/util/linux/signals_ia32.cpp
06/10/2007 09:56:01 Harmony-4001, this patch provides the ability to set the size of a thread'sstack"build
test2" has been known to pass on most platforms
modified wjwashburn  /harmony/enhanced/drlvm/trunk/vm/vmcore/src/util/linux/signals_em64t.cpp
06/10/2007 09:56:01 Harmony-4001, this patch provides the ability to set the size of a thread'sstack"build
test2" has been known to pass on most platforms
modified wjwashburn  /harmony/enhanced/drlvm/trunk/vm/vmcore/include/properties.h 06/10/2007
09:56:01 Harmony-4001, this patch provides the ability to set the size of a thread'sstack"build
test2" has been known to pass on most platforms
modified wjwashburn  /harmony/enhanced/drlvm/trunk/vm/vmcore/include/vm_threads.h 06/10/2007
09:56:01 Harmony-4001, this patch provides the ability to set the size of a thread'sstack"build
test2" has been known to pass on most platforms
modified wjwashburn  /harmony/enhanced/drlvm/trunk/vm/include/open/hythread_ext.h 06/10/2007
09:56:01 Harmony-4001, this patch provides the ability to set the size of a thread'sstack"build
test2" has been known to pass on most platforms
modified varlax  /harmony/enhanced/drlvm/trunk/build/make/build.xml 06/09/2007 21:42:48 Minor
improvements to build scripts
modified varlax  /harmony/enhanced/drlvm/trunk/build/make/targets/reg.test.run.xml 06/09/2007
21:42:48 Minor improvements to build scripts
added varlax  /harmony/enhanced/drlvm/trunk/src/test/regression/H4073/Test.java 06/09/2007
21:40:01 Applied HARMONY-4073 drlvm][jit] RCE must not substitute EFLAGS values produced by
CMP with ones produced by SBB
added varlax  /harmony/enhanced/drlvm/trunk/src/test/regression/H4073 06/09/2007 21:40:01
Applied HARMONY-4073 drlvm][jit] RCE must not substitute EFLAGS values produced by CMP with
ones produced by SBB
added varlax  /harmony/enhanced/drlvm/trunk/src/test/regression/H4073/run.test.xml 06/09/2007
21:40:01 Applied HARMONY-4073 drlvm][jit] RCE must not substitute EFLAGS values produced by
CMP with ones produced by SBB
modified varlax  /harmony/enhanced/drlvm/trunk/vm/jitrino/src/codegenerator/ia32/Ia32RCE.cpp
06/09/2007 21:40:01 Applied HARMONY-4073 drlvm][jit] RCE must not substitute EFLAGS values
produced by CMP with ones produced by SBB
modified varlax  /harmony/enhanced/drlvm/trunk/vm/jitrino/src/codegenerator/ia32/Ia32I8Lowerer.cpp
06/09/2007 21:40:01 Applied HARMONY-4073 drlvm][jit] RCE must not substitute EFLAGS values
produced by CMP with ones produced by SBB
deleted varlax  /harmony/enhanced/drlvm/trunk/vm/jitrino/src/translator/ExceptionInfo.cpp
06/09/2007 21:34:44 Fixed OPT compiler, HARMONY-3797 [drlvm][jit] bad handling of fall-through-reachable
exception handlers
modified varlax  /harmony/enhanced/drlvm/trunk/vm/jitrino/src/translator/java/JavaByteCodeTranslator.cpp
06/09/2007 21:34:44 Fixed OPT compiler, HARMONY-3797 [drlvm][jit] bad handling of fall-through-reachable
exception handlers
modified varlax  /harmony/enhanced/drlvm/trunk/vm/jitrino/src/translator/TranslatorIntfc.cpp
06/09/2007 21:34:44 Fixed OPT compiler, HARMONY-3797 [drlvm][jit] bad handling of fall-through-reachable
exception handlers
modified varlax  /harmony/enhanced/drlvm/trunk/vm/jitrino/src/translator/java/JavaByteCodeParser.cpp
06/09/2007 21:34:44 Fixed OPT compiler, HARMONY-3797 [drlvm][jit] bad handling of fall-through-reachable
exception handlers
modified varlax  /harmony/enhanced/drlvm/trunk/vm/jitrino/src/translator/ExceptionInfo.h 06/09/2007
21:34:44 Fixed OPT compiler, HARMONY-3797 [drlvm][jit] bad handling of fall-through-reachable
exception handlers
modified varlax  /harmony/enhanced/drlvm/trunk/vm/jitrino/src/translator/java/JavaLabelPrepass.cpp
06/09/2007 21:34:44 Fixed OPT compiler, HARMONY-3797 [drlvm][jit] bad handling of fall-through-reachable
exception handlers
modified varlax  /harmony/enhanced/drlvm/trunk/build/custom/msvc_2003/jitrino/jitrino.vcproj
06/09/2007 21:34:44 Fixed OPT compiler, HARMONY-3797 [drlvm][jit] bad handling of fall-through-reachable
exception handlers
modified varlax  /harmony/enhanced/drlvm/trunk/vm/jitrino/src/translator/TranslatorIntfc.h
06/09/2007 21:34:44 Fixed OPT compiler, HARMONY-3797 [drlvm][jit] bad handling of fall-through-reachable
exception handlers
modified varlax  /harmony/enhanced/drlvm/trunk/vm/jitrino/src/translator/java/JavaByteCodeParser.h
06/09/2007 21:34:44 Fixed OPT compiler, HARMONY-3797 [drlvm][jit] bad handling of fall-through-reachable
exception handlers
modified varlax  /harmony/enhanced/drlvm/trunk/vm/jitrino/src/translator/java/JavaFlowGraphBuilder.cpp
06/09/2007 21:34:44 Fixed OPT compiler, HARMONY-3797 [drlvm][jit] bad handling of fall-through-reachable
exception handlers
modified varlax  /harmony/enhanced/drlvm/trunk/build/custom/msvc_2005/jitrino/jitrino.vcproj
06/09/2007 21:34:44 Fixed OPT compiler, HARMONY-3797 [drlvm][jit] bad handling of fall-through-reachable
exception handlers
modified varlax  /harmony/enhanced/drlvm/trunk/vm/jitrino/src/translator/java/JavaLabelPrepass.h
06/09/2007 21:34:44 Fixed OPT compiler, HARMONY-3797 [drlvm][jit] bad handling of fall-through-reachable
exception handlers
modified varlax  /harmony/enhanced/drlvm/trunk/vm/jitrino/src/jet/cg_regs.cpp 06/09/2007 21:31:24
Fixed JET compiler, HARMONY-3797 [drlvm][jit] bad handling of fall-through-reachable exception
handlers
modified varlax  /harmony/enhanced/drlvm/trunk/vm/jitrino/src/jet/compiler.cpp 06/09/2007
21:31:24 Fixed JET compiler, HARMONY-3797 [drlvm][jit] bad handling of fall-through-reachable
exception handlers
modified varlax  /harmony/enhanced/drlvm/trunk/vm/vmcore/src/kernel_classes/javasrc/org/apache/harmony/lang/reflect/parser/Parser.java
06/09/2007 21:18:59 Applied partial fix to HARMONY-2052 [drlvm][kernel] Improve/re-implement
a parser of generic signatures
modified varlax  /harmony/enhanced/drlvm/trunk/vm/vmcore/src/kernel_classes/javasrc/java/lang/reflect/Method.java
06/09/2007 21:18:59 Applied partial fix to HARMONY-2052 [drlvm][kernel] Improve/re-implement
a parser of generic signatures
modified varlax  /harmony/enhanced/drlvm/trunk/vm/vmcore/src/kernel_classes/javasrc/java/lang/Class.java
06/09/2007 21:18:59 Applied partial fix to HARMONY-2052 [drlvm][kernel] Improve/re-implement
a parser of generic signatures
modified varlax  /harmony/enhanced/drlvm/trunk/vm/vmcore/src/kernel_classes/javasrc/java/lang/reflect/Field.java
06/09/2007 21:18:59 Applied partial fix to HARMONY-2052 [drlvm][kernel] Improve/re-implement
a parser of generic signatures
modified varlax  /harmony/enhanced/drlvm/trunk/vm/vmcore/src/kernel_classes/javasrc/java/lang/reflect/Constructor.java
06/09/2007 21:18:59 Applied partial fix to HARMONY-2052 [drlvm][kernel] Improve/re-implement
a parser of generic signatures
modified ayza  /harmony/enhanced/classlib/trunk/modules/portlib/src/main/native/include/unix/hysock.h
06/09/2007 21:05:33 Reworked patch from HARMONY-4077 ([classlib][portlib] socket related functions
incorrectly work in socket > FD_SETSIZE) was applied
modified ayza  /harmony/enhanced/classlib/trunk/modules/luni/src/main/native/luni/unix/OSNetworkSystemLinux.c
06/09/2007 21:05:33 Reworked patch from HARMONY-4077 ([classlib][portlib] socket related functions
incorrectly work in socket > FD_SETSIZE) was applied
modified ayza  /harmony/enhanced/classlib/trunk/modules/portlib/src/main/native/port/unix/hysock.c
06/09/2007 21:05:33 Reworked patch from HARMONY-4077 ([classlib][portlib] socket related functions
incorrectly work in socket > FD_SETSIZE) was applied
modified gshimansky  /harmony/enhanced/drlvm/trunk/build/make/excludes/exclude.drlvm_smoke.windows.x86.int
06/09/2007 17:47:17 Applied additional patch for garbage collectable interned strings from
HARMONY-4105Fix for Make interned string collectable by GC.Excluded stress.Intern for interpreter
because it is very slow.
modified gshimansky  /harmony/enhanced/drlvm/trunk/build/make/lnx.properties 06/09/2007 17:47:17
Applied additional patch for garbage collectable interned strings from HARMONY-4105Fix for
Make interned string collectable by GC.Excluded stress.Intern for interpreter because it is
very slow.
modified gshimansky  /harmony/enhanced/drlvm/trunk/build/make/excludes/exclude.drlvm_smoke.linux.ia64.int
06/09/2007 17:47:17 Applied additional patch for garbage collectable interned strings from
HARMONY-4105Fix for Make interned string collectable by GC.Excluded stress.Intern for interpreter
because it is very slow.
modified gshimansky  /harmony/enhanced/drlvm/trunk/build/make/excludes/exclude.drlvm_smoke.linux.x86.int
06/09/2007 17:47:17 Applied additional patch for garbage collectable interned strings from
HARMONY-4105Fix for Make interned string collectable by GC.Excluded stress.Intern for interpreter
because it is very slow.
modified gshimansky  /harmony/enhanced/drlvm/trunk/vm/vmcore/src/kernel_classes/javasrc/org/apache/harmony/kernel/vm/InternMap.java
06/09/2007 17:47:17 Applied additional patch for garbage collectable interned strings from
HARMONY-4105Fix for Make interned string collectable by GC.Excluded stress.Intern for interpreter
because it is very slow.
modified gshimansky  /harmony/enhanced/drlvm/trunk/build/make/excludes/exclude.drlvm_smoke.windows.x86_64.int
06/09/2007 17:47:17 Applied additional patch for garbage collectable interned strings from
HARMONY-4105Fix for Make interned string collectable by GC.Excluded stress.Intern for interpreter
because it is very slow.
modified gshimansky  /harmony/enhanced/drlvm/trunk/vm/vmcore/src/kernel_classes/javasrc/org/apache/harmony/kernel/vm/VM.java
06/09/2007 17:47:17 Applied additional patch for garbage collectable interned strings from
HARMONY-4105Fix for Make interned string collectable by GC.Excluded stress.Intern for interpreter
because it is very slow.
modified gshimansky  /harmony/enhanced/drlvm/trunk/vm/tests/smoke/stress/Intern.java 06/09/2007
17:47:17 Applied additional patch for garbage collectable interned strings from HARMONY-4105Fix
for Make interned string collectable by GC.Excluded stress.Intern for interpreter because
it is very slow.
modified gshimansky  /harmony/enhanced/drlvm/trunk/build/make/excludes/exclude.drlvm_smoke.linux.x86_64.int
06/09/2007 17:47:17 Applied additional patch for garbage collectable interned strings from
HARMONY-4105Fix for Make interned string collectable by GC.Excluded stress.Intern for interpreter
because it is very slow.
modified varlax  /harmony/enhanced/classlib/trunk/modules/nio/make/exclude.linux.x86.drl 06/09/2007
17:05:22 X-lists updated:#HARMONY-4116org/apache/harmony/nio/tests/java/nio/channels/SelectorTest.java
modified varlax  /harmony/enhanced/classlib/trunk/modules/nio/make/exclude.linux.x86.ibm 06/09/2007
17:05:22 X-lists updated:#HARMONY-4116org/apache/harmony/nio/tests/java/nio/channels/SelectorTest.java
modified varlax  /harmony/enhanced/classlib/trunk/modules/nio/make/exclude.linux.x86_64.drl
06/09/2007 17:05:22 X-lists updated:#HARMONY-4116org/apache/harmony/nio/tests/java/nio/channels/SelectorTest.java

Mime
View raw message