harmony-alerts mailing list archives

Site index · List index
Message view « Date » · « Thread »
Top « Date » · « Thread »
From nom...@intel.com
Subject [build-test alert] BUILD FAILED Windows XP SP2 msvc debug: drlvm reg.test
Date Wed, 13 Jun 2007 03:21:19 GMT
BUILD FAILED:
	Ant Error Message:
C:\cruise\trunk\cc\projects\drlvm\trunk\build\make\build.xml:474: The following error occurred while executing this line: C:\cruise\trunk\cc\projects\drlvm\trunk\build\make\targets\reg.test.run.xml:122: There were test failures

Date of build:	06/13/2007 10:13:35
Time to build:	7 minutes 26 seconds
Last changed:	06/12/2007 23:06:18
Last log entry:	Apply patch HARMONY-4134 ([classlib] [luni] Updated Javadoc for java.util.Scanner)

***********************************************************
Execution log (errors/warnings messages):	
Test org.apache.harmony.drlvm.tests.regression.H1578.NaNTest FAILED
Test org.apache.harmony.drlvm.tests.regression.h1654.H1654Test FAILED
Test org.apache.harmony.drlvm.tests.regression.h1748.IntfAccessTest FAILED
Test org.apache.harmony.drlvm.tests.regression.h1788.abcdTest FAILED
Test org.apache.harmony.drlvm.tests.regression.h1800.ExecTest FAILED
Test org.apache.harmony.drlvm.tests.regression.h1802.UnresolvedParamTest FAILED
Test org.apache.harmony.drlvm.tests.regression.h1857.Test FAILED
Test org.apache.harmony.drlvm.tests.regression.h1863.H1863Test FAILED
Test org.apache.harmony.drlvm.tests.regression.H2057.SyncTest FAILED
Test org.apache.harmony.drlvm.tests.regression.h2103.Test FAILED
Test org.apache.harmony.drlvm.tests.regression.H2113.Test FAILED
Test org.apache.harmony.drlvm.tests.regression.h2259.H2259 FAILED
Test org.apache.harmony.drlvm.tests.regression.h2261.RCETest FAILED
Test org.apache.harmony.drlvm.tests.regression.h2335.SimplestLibraryPathTest FAILED
Test org.apache.harmony.drlvm.tests.regression.h2644.BootDelegationTest FAILED
Test org.apache.harmony.drlvm.tests.regression.H2773.InfinityTest FAILED
Test org.apache.harmony.drlvm.tests.regression.h2808.finTest FAILED
Test org.apache.harmony.drlvm.tests.regression.h2846.NoVerifyTest FAILED
Test org.apache.harmony.drlvm.tests.regression.H2873.RemTest FAILED
Test org.apache.harmony.drlvm.tests.regression.H2874.Test FAILED
Test org.apache.harmony.drlvm.tests.regression.h3048.H3048 FAILED
Test org.apache.harmony.drlvm.tests.regression.h3067.Test FAILED
Test org.apache.harmony.drlvm.tests.regression.h3074.Test FAILED
Test org.apache.harmony.drlvm.tests.regression.H3110.FieldTest FAILED
Test org.apache.harmony.drlvm.tests.regression.h3121.H3121 FAILED
Test org.apache.harmony.drlvm.tests.regression.h3150.Test FAILED
Test org.apache.harmony.drlvm.tests.regression.h3175.Test FAILED
Test org.apache.harmony.drlvm.tests.regression.h3216.ASETest FAILED
Test org.apache.harmony.drlvm.tests.regression.h3228.H3228 FAILED
Test org.apache.harmony.drlvm.tests.regression.h3283.JavaLibraryPathTest FAILED
Test org.apache.harmony.drlvm.tests.regression.h3285.Test FAILED
Test org.apache.harmony.drlvm.tests.regression.h3404.H3404 FAILED
Test org.apache.harmony.drlvm.tests.regression.h3619.ObjectLongWaitTest FAILED
Test org.apache.harmony.drlvm.tests.regression.h3652.Test FAILED
Test org.apache.harmony.drlvm.tests.regression.h3658.Test FAILED
Test org.apache.harmony.drlvm.tests.regression.h3691.Test FAILED
Test org.apache.harmony.drlvm.tests.regression.h3738.Test FAILED
Test org.apache.harmony.drlvm.tests.regression.h3751.Test FAILED
Test org.apache.harmony.drlvm.tests.regression.h3954.Test FAILED
Test org.apache.harmony.drlvm.tests.regression.h788.Test FAILED
Configuration:
     Hosting Java = 1.5.0_08 (Sun Microsystems Inc.)
    classlib root = C:\cruise\trunk\cc\projects\classlib\trunk
               os = Windows
             arch = ia32
              cxx = msvc
              cfg = debug
     svn revision = ${svn.revision}
       components = deploy

=====================================
DRLVM Regression Testing on platform: windows.x86
=====================================
        
Assertion failed: 0, file C:\cruise\trunk\cc\projects\drlvm\trunk\vm\jitrino\src\translator\java\JavaLabelPrepass.cpp, line 693
This application has requested the Runtime to terminate it in an unusual way.
Please contact the application's support team for more information.
Assertion failed: depth == 0, file C:\cruise\trunk\cc\projects\drlvm\trunk\vm\jitrino\src\main\PMF.cpp, line 708
This application has requested the Runtime to terminate it in an unusual way.
Please contact the application's support team for more information.
Assertion failed: 0, file C:\cruise\trunk\cc\projects\drlvm\trunk\vm\jitrino\src\translator\java\JavaLabelPrepass.cpp, line 693
This application has requested the Runtime to terminate it in an unusual way.
Please contact the application's support team for more information.
Assertion failed: depth == 0, file C:\cruise\trunk\cc\projects\drlvm\trunk\vm\jitrino\src\main\PMF.cpp, line 708
This application has requested the Runtime to terminate it in an unusual way.
Please contact the application's support team for more information.
Assertion failed: 0, file C:\cruise\trunk\cc\projects\drlvm\trunk\vm\jitrino\src\translator\java\JavaLabelPrepass.cpp, line 693
This application has requested the Runtime to terminate it in an unusual way.
Please contact the application's support team for more information.
Assertion failed: depth == 0, file C:\cruise\trunk\cc\projects\drlvm\trunk\vm\jitrino\src\main\PMF.cpp, line 708
This application has requested the Runtime to terminate it in an unusual way.
Please contact the application's support team for more information.
Assertion failed: 0, file C:\cruise\trunk\cc\projects\drlvm\trunk\vm\jitrino\src\translator\java\JavaLabelPrepass.cpp, line 693
This application has requested the Runtime to terminate it in an unusual way.
Please contact the application's support team for more information.
Assertion failed: depth == 0, file C:\cruise\trunk\cc\projects\drlvm\trunk\vm\jitrino\src\main\PMF.cpp, line 708
This application has requested the Runtime to terminate it in an unusual way.
Please contact the application's support team for more information.
Assertion failed: 0, file C:\cruise\trunk\cc\projects\drlvm\trunk\vm\jitrino\src\translator\java\JavaLabelPrepass.cpp, line 693
This application has requested the Runtime to terminate it in an unusual way.
Please contact the application's support team for more information.
Assertion failed: depth == 0, file C:\cruise\trunk\cc\projects\drlvm\trunk\vm\jitrino\src\main\PMF.cpp, line 708
This application has requested the Runtime to terminate it in an unusual way.
Please contact the application's support team for more information.
Assertion failed: 0, file C:\cruise\trunk\cc\projects\drlvm\trunk\vm\jitrino\src\translator\java\JavaLabelPrepass.cpp, line 693
This application has requested the Runtime to terminate it in an unusual way.
Please contact the application's support team for more information.
Assertion failed: depth == 0, file C:\cruise\trunk\cc\projects\drlvm\trunk\vm\jitrino\src\main\PMF.cpp, line 708
This application has requested the Runtime to terminate it in an unusual way.
Please contact the application's support team for more information.
Assertion failed: 0, file C:\cruise\trunk\cc\projects\drlvm\trunk\vm\jitrino\src\translator\java\JavaLabelPrepass.cpp, line 693
This application has requested the Runtime to terminate it in an unusual way.
Please contact the application's support team for more information.
Assertion failed: depth == 0, file C:\cruise\trunk\cc\projects\drlvm\trunk\vm\jitrino\src\main\PMF.cpp, line 708
This application has requested the Runtime to terminate it in an unusual way.
Please contact the application's support team for more information.
Assertion failed: 0, file C:\cruise\trunk\cc\projects\drlvm\trunk\vm\jitrino\src\translator\java\JavaLabelPrepass.cpp, line 693
This application has requested the Runtime to terminate it in an unusual way.
Please contact the application's support team for more information.
Assertion failed: depth == 0, file C:\cruise\trunk\cc\projects\drlvm\trunk\vm\jitrino\src\main\PMF.cpp, line 708
This application has requested the Runtime to terminate it in an unusual way.
Please contact the application's support team for more information.
Assertion failed: 0, file C:\cruise\trunk\cc\projects\drlvm\trunk\vm\jitrino\src\translator\java\JavaLabelPrepass.cpp, line 693
This application has requested the Runtime to terminate it in an unusual way.
Please contact the application's support team for more information.
Assertion failed: depth == 0, file C:\cruise\trunk\cc\projects\drlvm\trunk\vm\jitrino\src\main\PMF.cpp, line 708
This application has requested the Runtime to terminate it in an unusual way.
Please contact the application's support team for more information.
Assertion failed: 0, file C:\cruise\trunk\cc\projects\drlvm\trunk\vm\jitrino\src\translator\java\JavaLabelPrepass.cpp, line 693
This application has requested the Runtime to terminate it in an unusual way.
Please contact the application's support team for more information.
Assertion failed: depth == 0, file C:\cruise\trunk\cc\projects\drlvm\trunk\vm\jitrino\src\main\PMF.cpp, line 708
This application has requested the Runtime to terminate it in an unusual way.
Please contact the application's support team for more information.
Running on JET
Assertion failed: 0, file C:\cruise\trunk\cc\projects\drlvm\trunk\vm\jitrino\src\translator\java\JavaLabelPrepass.cpp, line 693
This application has requested the Runtime to terminate it in an unusual way.
Please contact the application's support team for more information.
Assertion failed: depth == 0, file C:\cruise\trunk\cc\projects\drlvm\trunk\vm\jitrino\src\main\PMF.cpp, line 708
This application has requested the Runtime to terminate it in an unusual way.
Please contact the application's support team for more information.
Assertion failed: 0, file C:\cruise\trunk\cc\projects\drlvm\trunk\vm\jitrino\src\translator\java\JavaLabelPrepass.cpp, line 693
This application has requested the Runtime to terminate it in an unusual way.
Please contact the application's support team for more information.
Assertion failed: depth == 0, file C:\cruise\trunk\cc\projects\drlvm\trunk\vm\jitrino\src\main\PMF.cpp, line 708
This application has requested the Runtime to terminate it in an unusual way.
Please contact the application's support team for more information.
Assertion failed: 0, file C:\cruise\trunk\cc\projects\drlvm\trunk\vm\jitrino\src\translator\java\JavaLabelPrepass.cpp, line 693
This application has requested the Runtime to terminate it in an unusual way.
Please contact the application's support team for more information.
Assertion failed: depth == 0, file C:\cruise\trunk\cc\projects\drlvm\trunk\vm\jitrino\src\main\PMF.cpp, line 708
This application has requested the Runtime to terminate it in an unusual way.
Please contact the application's support team for more information.
Assertion failed: 0, file C:\cruise\trunk\cc\projects\drlvm\trunk\vm\jitrino\src\translator\java\JavaLabelPrepass.cpp, line 693
This application has requested the Runtime to terminate it in an unusual way.
Please contact the application's support team for more information.
Assertion failed: depth == 0, file C:\cruise\trunk\cc\projects\drlvm\trunk\vm\jitrino\src\main\PMF.cpp, line 708
This application has requested the Runtime to terminate it in an unusual way.
Please contact the application's support team for more information.
Assertion failed: 0, file C:\cruise\trunk\cc\projects\drlvm\trunk\vm\jitrino\src\translator\java\JavaLabelPrepass.cpp, line 693
This application has requested the Runtime to terminate it in an unusual way.
Please contact the application's support team for more information.
Assertion failed: depth == 0, file C:\cruise\trunk\cc\projects\drlvm\trunk\vm\jitrino\src\main\PMF.cpp, line 708
This application has requested the Runtime to terminate it in an unusual way.
Please contact the application's support team for more information.
Assertion failed: 0, file C:\cruise\trunk\cc\projects\drlvm\trunk\vm\jitrino\src\translator\java\JavaLabelPrepass.cpp, line 693
This application has requested the Runtime to terminate it in an unusual way.
Please contact the application's support team for more information.
Assertion failed: depth == 0, file C:\cruise\trunk\cc\projects\drlvm\trunk\vm\jitrino\src\main\PMF.cpp, line 708
This application has requested the Runtime to terminate it in an unusual way.
Please contact the application's support team for more information.
Assertion failed: 0, file C:\cruise\trunk\cc\projects\drlvm\trunk\vm\jitrino\src\translator\java\JavaLabelPrepass.cpp, line 693
This application has requested the Runtime to terminate it in an unusual way.
Please contact the application's support team for more information.
Assertion failed: depth == 0, file C:\cruise\trunk\cc\projects\drlvm\trunk\vm\jitrino\src\main\PMF.cpp, line 708
This application has requested the Runtime to terminate it in an unusual way.
Please contact the application's support team for more information.
Assertion failed: 0, file C:\cruise\trunk\cc\projects\drlvm\trunk\vm\jitrino\src\translator\java\JavaLabelPrepass.cpp, line 693
This application has requested the Runtime to terminate it in an unusual way.
Please contact the application's support team for more information.
Assertion failed: depth == 0, file C:\cruise\trunk\cc\projects\drlvm\trunk\vm\jitrino\src\main\PMF.cpp, line 708
This application has requested the Runtime to terminate it in an unusual way.
Please contact the application's support team for more information.
Assertion failed: 0, file C:\cruise\trunk\cc\projects\drlvm\trunk\vm\jitrino\src\translator\java\JavaLabelPrepass.cpp, line 693
This application has requested the Runtime to terminate it in an unusual way.
Please contact the application's support team for more information.
Assertion failed: depth == 0, file C:\cruise\trunk\cc\projects\drlvm\trunk\vm\jitrino\src\main\PMF.cpp, line 708
This application has requested the Runtime to terminate it in an unusual way.
Please contact the application's support team for more information.
Assertion failed: 0, file C:\cruise\trunk\cc\projects\drlvm\trunk\vm\jitrino\src\translator\java\JavaLabelPrepass.cpp, line 693
This application has requested the Runtime to terminate it in an unusual way.
Please contact the application's support team for more information.
Assertion failed: depth == 0, file C:\cruise\trunk\cc\projects\drlvm\trunk\vm\jitrino\src\main\PMF.cpp, line 708
This application has requested the Runtime to terminate it in an unusual way.
Please contact the application's support team for more information.
Assertion failed: 0, file C:\cruise\trunk\cc\projects\drlvm\trunk\vm\jitrino\src\translator\java\JavaLabelPrepass.cpp, line 693
This application has requested the Runtime to terminate it in an unusual way.
Please contact the application's support team for more information.
Assertion failed: depth == 0, file C:\cruise\trunk\cc\projects\drlvm\trunk\vm\jitrino\src\main\PMF.cpp, line 708
This application has requested the Runtime to terminate it in an unusual way.
Please contact the application's support team for more information.
Running on JIT
Assertion failed: 0, file C:\cruise\trunk\cc\projects\drlvm\trunk\vm\jitrino\src\translator\java\JavaLabelPrepass.cpp, line 693
This application has requested the Runtime to terminate it in an unusual way.
Please contact the application's support team for more information.
Assertion failed: depth == 0, file C:\cruise\trunk\cc\projects\drlvm\trunk\vm\jitrino\src\main\PMF.cpp, line 708
This application has requested the Runtime to terminate it in an unusual way.
Please contact the application's support team for more information.
Assertion failed: 0, file C:\cruise\trunk\cc\projects\drlvm\trunk\vm\jitrino\src\translator\java\JavaLabelPrepass.cpp, line 693
This application has requested the Runtime to terminate it in an unusual way.
Please contact the application's support team for more information.
Assertion failed: depth == 0, file C:\cruise\trunk\cc\projects\drlvm\trunk\vm\jitrino\src\main\PMF.cpp, line 708
This application has requested the Runtime to terminate it in an unusual way.
Please contact the application's support team for more information.
Assertion failed: 0, file C:\cruise\trunk\cc\projects\drlvm\trunk\vm\jitrino\src\translator\java\JavaLabelPrepass.cpp, line 693
This application has requested the Runtime to terminate it in an unusual way.
Please contact the application's support team for more information.
Assertion failed: depth == 0, file C:\cruise\trunk\cc\projects\drlvm\trunk\vm\jitrino\src\main\PMF.cpp, line 708
This application has requested the Runtime to terminate it in an unusual way.
Please contact the application's support team for more information.
Assertion failed: 0, file C:\cruise\trunk\cc\projects\drlvm\trunk\vm\jitrino\src\translator\java\JavaLabelPrepass.cpp, line 693
This application has requested the Runtime to terminate it in an unusual way.
Please contact the application's support team for more information.
Assertion failed: depth == 0, file C:\cruise\trunk\cc\projects\drlvm\trunk\vm\jitrino\src\main\PMF.cpp, line 708
This application has requested the Runtime to terminate it in an unusual way.
Please contact the application's support team for more information.
Assertion failed: 0, file C:\cruise\trunk\cc\projects\drlvm\trunk\vm\jitrino\src\translator\java\JavaLabelPrepass.cpp, line 693
This application has requested the Runtime to terminate it in an unusual way.
Please contact the application's support team for more information.
Assertion failed: depth == 0, file C:\cruise\trunk\cc\projects\drlvm\trunk\vm\jitrino\src\main\PMF.cpp, line 708
This application has requested the Runtime to terminate it in an unusual way.
Please contact the application's support team for more information.
Running on OPT
Assertion failed: 0, file C:\cruise\trunk\cc\projects\drlvm\trunk\vm\jitrino\src\translator\java\JavaLabelPrepass.cpp, line 693
This application has requested the Runtime to terminate it in an unusual way.
Please contact the application's support team for more information.
Assertion failed: depth == 0, file C:\cruise\trunk\cc\projects\drlvm\trunk\vm\jitrino\src\main\PMF.cpp, line 708
This application has requested the Runtime to terminate it in an unusual way.
Please contact the application's support team for more information.
Running on OPT
Assertion failed: 0, file C:\cruise\trunk\cc\projects\drlvm\trunk\vm\jitrino\src\translator\java\JavaLabelPrepass.cpp, line 693
This application has requested the Runtime to terminate it in an unusual way.
Please contact the application's support team for more information.
Assertion failed: depth == 0, file C:\cruise\trunk\cc\projects\drlvm\trunk\vm\jitrino\src\main\PMF.cpp, line 708
This application has requested the Runtime to terminate it in an unusual way.
Please contact the application's support team for more information.
Assertion failed: 0, file C:\cruise\trunk\cc\projects\drlvm\trunk\vm\jitrino\src\translator\java\JavaLabelPrepass.cpp, line 693
This application has requested the Runtime to terminate it in an unusual way.
Please contact the application's support team for more information.
Assertion failed: depth == 0, file C:\cruise\trunk\cc\projects\drlvm\trunk\vm\jitrino\src\main\PMF.cpp, line 708
This application has requested the Runtime to terminate it in an unusual way.
Please contact the application's support team for more information.
Assertion failed: 0, file C:\cruise\trunk\cc\projects\drlvm\trunk\vm\jitrino\src\translator\java\JavaLabelPrepass.cpp, line 693
This application has requested the Runtime to terminate it in an unusual way.
Please contact the application's support team for more information.
Assertion failed: depth == 0, file C:\cruise\trunk\cc\projects\drlvm\trunk\vm\jitrino\src\main\PMF.cpp, line 708
This application has requested the Runtime to terminate it in an unusual way.
Please contact the application's support team for more information.
Assertion failed: 0, file C:\cruise\trunk\cc\projects\drlvm\trunk\vm\jitrino\src\translator\java\JavaLabelPrepass.cpp, line 693
This application has requested the Runtime to terminate it in an unusual way.
Please contact the application's support team for more information.
Assertion failed: depth == 0, file C:\cruise\trunk\cc\projects\drlvm\trunk\vm\jitrino\src\main\PMF.cpp, line 708
This application has requested the Runtime to terminate it in an unusual way.
Please contact the application's support team for more information.
Assertion failed: 0, file C:\cruise\trunk\cc\projects\drlvm\trunk\vm\jitrino\src\translator\java\JavaLabelPrepass.cpp, line 693
This application has requested the Runtime to terminate it in an unusual way.
Please contact the application's support team for more information.
Assertion failed: depth == 0, file C:\cruise\trunk\cc\projects\drlvm\trunk\vm\jitrino\src\main\PMF.cpp, line 708
This application has requested the Runtime to terminate it in an unusual way.
Please contact the application's support team for more information.
Assertion failed: 0, file C:\cruise\trunk\cc\projects\drlvm\trunk\vm\jitrino\src\translator\java\JavaLabelPrepass.cpp, line 693
This application has requested the Runtime to terminate it in an unusual way.
Please contact the application's support team for more information.
Assertion failed: depth == 0, file C:\cruise\trunk\cc\projects\drlvm\trunk\vm\jitrino\src\main\PMF.cpp, line 708
This application has requested the Runtime to terminate it in an unusual way.
Please contact the application's support team for more information.
Assertion failed: 0, file C:\cruise\trunk\cc\projects\drlvm\trunk\vm\jitrino\src\translator\java\JavaLabelPrepass.cpp, line 693
This application has requested the Runtime to terminate it in an unusual way.
Please contact the application's support team for more information.
Assertion failed: depth == 0, file C:\cruise\trunk\cc\projects\drlvm\trunk\vm\jitrino\src\main\PMF.cpp, line 708
This application has requested the Runtime to terminate it in an unusual way.
Please contact the application's support team for more information.
Assertion failed: 0, file C:\cruise\trunk\cc\projects\drlvm\trunk\vm\jitrino\src\translator\java\JavaLabelPrepass.cpp, line 693
This application has requested the Runtime to terminate it in an unusual way.
Please contact the application's support team for more information.
Assertion failed: depth == 0, file C:\cruise\trunk\cc\projects\drlvm\trunk\vm\jitrino\src\main\PMF.cpp, line 708
This application has requested the Runtime to terminate it in an unusual way.
Please contact the application's support team for more information.
Assertion failed: 0, file C:\cruise\trunk\cc\projects\drlvm\trunk\vm\jitrino\src\translator\java\JavaLabelPrepass.cpp, line 693
This application has requested the Runtime to terminate it in an unusual way.
Please contact the application's support team for more information.
Assertion failed: depth == 0, file C:\cruise\trunk\cc\projects\drlvm\trunk\vm\jitrino\src\main\PMF.cpp, line 708
This application has requested the Runtime to terminate it in an unusual way.
Please contact the application's support team for more information.
Assertion failed: 0, file C:\cruise\trunk\cc\projects\drlvm\trunk\vm\jitrino\src\translator\java\JavaLabelPrepass.cpp, line 693
This application has requested the Runtime to terminate it in an unusual way.
Please contact the application's support team for more information.
Assertion failed: depth == 0, file C:\cruise\trunk\cc\projects\drlvm\trunk\vm\jitrino\src\main\PMF.cpp, line 708
This application has requested the Runtime to terminate it in an unusual way.
Please contact the application's support team for more information.
==> VM Init callback
==> Exception callback
    for class: Lorg/apache/harmony/drlvm/tests/regression/h3698/InvokeAgentException;
Exception location:	test()V	: 15
Catch clause location:	test()V	: 16
Top frame location:	test()V	: 15
TEST PASSED
==> VM Init callback
==> Class Prepare callback
    for class: Lorg/apache/harmony/drlvm/tests/regression/h3730/StepM2N;
==> Breakpoint callback
    at: inner()V :0
==> Frame Pop callback
    at: inner()V
==> Single Step callback
    at: Lorg/apache/harmony/drlvm/tests/regression/h3730/StepM2N;.outer()V :25
    expected location reached
TEST PASSED
Assertion failed: 0, file C:\cruise\trunk\cc\projects\drlvm\trunk\vm\jitrino\src\translator\java\JavaLabelPrepass.cpp, line 693
This application has requested the Runtime to terminate it in an unusual way.
Please contact the application's support team for more information.
Assertion failed: depth == 0, file C:\cruise\trunk\cc\projects\drlvm\trunk\vm\jitrino\src\main\PMF.cpp, line 708
This application has requested the Runtime to terminate it in an unusual way.
Please contact the application's support team for more information.
Assertion failed: 0, file C:\cruise\trunk\cc\projects\drlvm\trunk\vm\jitrino\src\translator\java\JavaLabelPrepass.cpp, line 693
This application has requested the Runtime to terminate it in an unusual way.
Please contact the application's support team for more information.
Assertion failed: depth == 0, file C:\cruise\trunk\cc\projects\drlvm\trunk\vm\jitrino\src\main\PMF.cpp, line 708
This application has requested the Runtime to terminate it in an unusual way.
Please contact the application's support team for more information.
==> VM Init callback
==> Exception callback
    for class: Lorg/apache/harmony/drlvm/tests/regression/h3894/InvokeAgentException;
Child threads:
0:	child thread 12
1:	child thread 5
2:	child thread 14
3:	child thread 8
4:	child thread 0
5:	child thread 3
6:	child thread 10
7:	child thread 6
8:	child thread 1
9:	child thread 4
10:	child thread 11
11:	child thread 13
12:	child thread 7
13:	child thread 2
14:	child thread 9
Child groups:
0:	empty child group 0
1:	empty child group 1
2:	child group 0
3:	child group 1
4:	child group 2
5:	child group 3
6:	child group 4
7:	child group 5
8:	child group 6
9:	child group 7
10:	child group 8
11:	child group 9
12:	child group 10
13:	child group 11
14:	child group 12
15:	child group 13
16:	child group 14
Checking threads...
Array length:   	15
Expected length:	15
Checking groups...
Array length:   	17
Expected length:	17
TEST PASSED
==> VM Init callback
==> Exception callback
    for class: Lorg/apache/harmony/drlvm/tests/regression/h3909/InvokeAgentException;
System group:	system
All threads:
0:	ref handler	in group: system
1:	finalizer	in group: system
ok
2:	main	in group: main
Found 1 finalizer threads. All in system group
TEST PASSED
Assertion failed: 0, file C:\cruise\trunk\cc\projects\drlvm\trunk\vm\jitrino\src\translator\java\JavaLabelPrepass.cpp, line 693
This application has requested the Runtime to terminate it in an unusual way.
Please contact the application's support team for more information.
Assertion failed: depth == 0, file C:\cruise\trunk\cc\projects\drlvm\trunk\vm\jitrino\src\main\PMF.cpp, line 708
This application has requested the Runtime to terminate it in an unusual way.
Please contact the application's support team for more information.
==> VM Init callback
starting native thread...
==> VM Init finished
native thread stated
==> Exception callback
    for class: Lorg/apache/harmony/drlvm/tests/regression/h3982/InvokeAgentException;
All threads:
0:	attached_thread	in group: main
1:	ref handler	in group: system
2:	finalizer	in group: system
3:	main	in group: main
Atached thread  stack [0]
TEST PASSED
native thread finished
Assertion failed: 0, file C:\cruise\trunk\cc\projects\drlvm\trunk\vm\jitrino\src\translator\java\JavaLabelPrepass.cpp, line 693
This application has requested the Runtime to terminate it in an unusual way.
Please contact the application's support team for more information.
Assertion failed: depth == 0, file C:\cruise\trunk\cc\projects\drlvm\trunk\vm\jitrino\src\main\PMF.cpp, line 708
This application has requested the Runtime to terminate it in an unusual way.
Please contact the application's support team for more information.
========================================
Regression testing report was stored in:
========================================
C:\cruise\trunk\cc\projects\drlvm\trunk\build\win_ia32_msvc_debug\semis\reg.tests/reports/html
========================================

***********************************************************
Unit Tests: (29)
        

***********************************************************
Modifications since last successful build:	(122)
            
modified odeakin  /harmony/enhanced/classlib/trunk/modules/luni/src/main/java/java/util/Scanner.java 06/12/2007 23:06:18 Apply patch HARMONY-4134 ([classlib] [luni] Updated Javadoc for java.util.Scanner)
modified odeakin  /harmony/enhanced/classlib/trunk/modules/security/src/main/java/common/java/security/BasicPermissionCollection.java 06/12/2007 17:44:44 Apply patch HARMONY-4092 ([classlib] [security] Javadoc update for java.security.BasicPermissionCollection)
modified odeakin  /harmony/enhanced/classlib/trunk/THIRD_PARTY_NOTICES.txt 06/12/2007 16:26:38 Apply patch HARMONY-4028 ([classlib] THIRD_PARTY_NOTICES.txt needs copyright statement for RFC 2891 specification (and others))
modified odeakin  /harmony/enhanced/classlib/trunk/modules/security/src/main/java/common/java/security/Provider.java 06/12/2007 16:12:09 Apply patch HARMONY-4090 ([classlib] [security] Javadoc update for java.security.Provider)
modified tellison  /harmony/enhanced/classlib/trunk/modules/luni/src/main/java/java/util/ListResourceBundle.java 06/12/2007 00:15:36 Apply patch HARMONY-4083 ([classlib][luni] Performance improvement of java.util.ListResourceBundle)
modified tellison  /harmony/enhanced/classlib/trunk/modules/luni/src/main/java/java/util/LinkedHashMap.java 06/12/2007 00:11:27 Apply slightly modified patch for HARMONY-4082 ([classlib][luni] Performance improvement of java.util.LinkedHashMap)
modified tellison  /harmony/enhanced/classlib/trunk/modules/luni/src/main/java/java/util/Observable.java 06/12/2007 00:04:45 Apply patch HARMONY-4087 ([classlib][luni] Performance improvement of java.util.Observable)
modified tellison  /harmony/enhanced/classlib/trunk/modules/luni/src/main/java/java/util/UUID.java 06/11/2007 23:58:29 Apply patch HARMONY-4120 ([classlib][luni] Remove some unnecessary synchronization blocks for java.util.Vector & java.util.UUID)
modified tellison  /harmony/enhanced/classlib/trunk/modules/luni/src/test/java/tests/api/java/util/VectorTest.java 06/11/2007 23:58:29 Apply patch HARMONY-4120 ([classlib][luni] Remove some unnecessary synchronization blocks for java.util.Vector & java.util.UUID)
modified tellison  /harmony/enhanced/classlib/trunk/modules/luni/src/main/java/java/util/Vector.java 06/11/2007 23:58:29 Apply patch HARMONY-4120 ([classlib][luni] Remove some unnecessary synchronization blocks for java.util.Vector & java.util.UUID)
modified varlax  /harmony/enhanced/drlvm/trunk/vm/jitrino/src/translator/java/JavaLabelPrepass.cpp 06/11/2007 23:52:07 Fix up spoiled commit [545753] HARMONY-3797
modified tellison  /harmony/enhanced/classlib/trunk/modules/sql/src/main/java/javax/sql/rowset/serial/SQLInputImpl.java 06/11/2007 21:22:50 Remove not implemented markers for methods that are now written.
modified tellison  /harmony/enhanced/drlvm/trunk/vm/vmcore/src/kernel_classes/javasrc/java/lang/ClassLoader.java 06/11/2007 21:17:55 Mark a number of kernel class API methods deprecated as spec.
modified tellison  /harmony/enhanced/drlvm/trunk/vm/vmcore/src/kernel_classes/javasrc/java/lang/Runtime.java 06/11/2007 21:17:55 Mark a number of kernel class API methods deprecated as spec.
modified tellison  /harmony/enhanced/drlvm/trunk/vm/vmcore/src/kernel_classes/javasrc/java/lang/System.java 06/11/2007 21:17:55 Mark a number of kernel class API methods deprecated as spec.
modified tellison  /harmony/enhanced/drlvm/trunk/vm/vmcore/src/kernel_classes/javasrc/java/lang/ThreadGroup.java 06/11/2007 21:17:55 Mark a number of kernel class API methods deprecated as spec.
modified tellison  /harmony/enhanced/drlvm/trunk/vm/vmcore/src/kernel_classes/javasrc/java/lang/Thread.java 06/11/2007 21:17:55 Mark a number of kernel class API methods deprecated as spec.
added apetrenko  /harmony/enhanced/classlib/trunk/modules/awt/src/main/native/fontlib/shared/T1Glyph.cpp 06/11/2007 00:31:22 Font library contributionHARMONY-3583 and HARMONY-4104
added apetrenko  /harmony/enhanced/classlib/trunk/modules/awt/src/main/native/fontlib/shared/Glyph.h 06/11/2007 00:31:22 Font library contributionHARMONY-3583 and HARMONY-4104
added apetrenko  /harmony/enhanced/classlib/trunk/modules/awt/src/main/native/fontlib/shared/include/fljni.h 06/11/2007 00:31:22 Font library contributionHARMONY-3583 and HARMONY-4104
added apetrenko  /harmony/enhanced/classlib/trunk/modules/awt/src/main/native/fontlib/unix 06/11/2007 00:31:22 Font library contributionHARMONY-3583 and HARMONY-4104
added apetrenko  /harmony/enhanced/classlib/trunk/modules/awt/src/main/native/fontlib/shared/TTCurve.h 06/11/2007 00:31:22 Font library contributionHARMONY-3583 and HARMONY-4104
added apetrenko  /harmony/enhanced/classlib/trunk/modules/awt/src/main/native/fontlib/shared/include 06/11/2007 00:31:22 Font library contributionHARMONY-3583 and HARMONY-4104
added apetrenko  /harmony/enhanced/classlib/trunk/modules/awt/src/main/native/fontlib/shared/include/org_apache_harmony_awt_gl_font_fontlib_FLGlyph.h 06/11/2007 00:31:22 Font library contributionHARMONY-3583 and HARMONY-4104
added apetrenko  /harmony/enhanced/classlib/trunk/modules/awt/src/main/native/fontlib/shared/EncodedValue.h 06/11/2007 00:31:22 Font library contributionHARMONY-3583 and HARMONY-4104
added apetrenko  /harmony/enhanced/classlib/trunk/modules/awt/src/main/native/fontlib/shared/Environment.cpp 06/11/2007 00:31:22 Font library contributionHARMONY-3583 and HARMONY-4104
added apetrenko  /harmony/enhanced/classlib/trunk/modules/awt/src/main/java/common/org/apache/harmony/awt/gl/font/fontlib/FLOutline.java 06/11/2007 00:31:22 Font library contributionHARMONY-3583 and HARMONY-4104
added apetrenko  /harmony/enhanced/classlib/trunk/modules/awt/src/main/native/fontlib/shared/Font.cpp 06/11/2007 00:31:22 Font library contributionHARMONY-3583 and HARMONY-4104
added apetrenko  /harmony/enhanced/classlib/trunk/modules/awt/src/main/native/fontlib/windows/fl.rc 06/11/2007 00:31:22 Font library contributionHARMONY-3583 and HARMONY-4104
modified apetrenko  /harmony/enhanced/classlib/trunk/modules/awt/build.xml 06/11/2007 00:31:22 Font library contributionHARMONY-3583 and HARMONY-4104
added apetrenko  /harmony/enhanced/classlib/trunk/modules/awt/src/main/native/fontlib 06/11/2007 00:31:22 Font library contributionHARMONY-3583 and HARMONY-4104
added apetrenko  /harmony/enhanced/classlib/trunk/modules/awt/src/main/java/common/org/apache/harmony/awt/gl/font/fontlib/FLGlyph.java 06/11/2007 00:31:22 Font library contributionHARMONY-3583 and HARMONY-4104
added apetrenko  /harmony/enhanced/classlib/trunk/modules/awt/src/main/native/fontlib/unix/makefile 06/11/2007 00:31:22 Font library contributionHARMONY-3583 and HARMONY-4104
modified apetrenko  /harmony/enhanced/classlib/trunk/modules/awt/src/main/java/unix/org/apache/harmony/awt/gl/linux/XGraphics2D.java 06/11/2007 00:31:22 Font library contributionHARMONY-3583 and HARMONY-4104
added apetrenko  /harmony/enhanced/classlib/trunk/modules/awt/src/main/native/fontlib/shared/T1Font.cpp 06/11/2007 00:31:22 Font library contributionHARMONY-3583 and HARMONY-4104
modified apetrenko  /harmony/enhanced/classlib/trunk/modules/awt/src/main/java/common/org/apache/harmony/awt/gl/font/FontPeerImpl.java 06/11/2007 00:31:22 Font library contributionHARMONY-3583 and HARMONY-4104
added apetrenko  /harmony/enhanced/classlib/trunk/modules/awt/src/main/native/fontlib/unix/exports.txt 06/11/2007 00:31:22 Font library contributionHARMONY-3583 and HARMONY-4104
added apetrenko  /harmony/enhanced/classlib/trunk/modules/awt/src/main/native/fontlib/shared/Outline.cpp 06/11/2007 00:31:22 Font library contributionHARMONY-3583 and HARMONY-4104
added apetrenko  /harmony/enhanced/classlib/trunk/modules/awt/src/main/native/fontlib/shared 06/11/2007 00:31:22 Font library contributionHARMONY-3583 and HARMONY-4104
added apetrenko  /harmony/enhanced/classlib/trunk/modules/awt/src/main/native/fontlib/shared/Tables.h 06/11/2007 00:31:22 Font library contributionHARMONY-3583 and HARMONY-4104
added apetrenko  /harmony/enhanced/classlib/trunk/modules/awt/src/main/native/fontlib/windows/makefile 06/11/2007 00:31:22 Font library contributionHARMONY-3583 and HARMONY-4104
added apetrenko  /harmony/enhanced/classlib/trunk/modules/awt/src/main/native/fontlib/shared/include/org_apache_harmony_awt_gl_font_fontlib_FLFontManager.h 06/11/2007 00:31:22 Font library contributionHARMONY-3583 and HARMONY-4104
added apetrenko  /harmony/enhanced/classlib/trunk/modules/awt/src/main/native/fontlib/shared/Glyph.cpp 06/11/2007 00:31:22 Font library contributionHARMONY-3583 and HARMONY-4104
added apetrenko  /harmony/enhanced/classlib/trunk/modules/awt/src/main/native/fontlib/shared/TTFont.h 06/11/2007 00:31:22 Font library contributionHARMONY-3583 and HARMONY-4104
added apetrenko  /harmony/enhanced/classlib/trunk/modules/awt/src/main/java/common/org/apache/harmony/awt/gl/font/fontlib 06/11/2007 00:31:22 Font library contributionHARMONY-3583 and HARMONY-4104
modified apetrenko  /harmony/enhanced/classlib/trunk/modules/awt/src/main/java/common/org/apache/harmony/awt/gl/font/FontMetricsImpl.java 06/11/2007 00:31:22 Font library contributionHARMONY-3583 and HARMONY-4104
added apetrenko  /harmony/enhanced/classlib/trunk/modules/awt/src/main/java/common/org/apache/harmony/awt/gl/font/fontlib/FLFontManager.java 06/11/2007 00:31:22 Font library contributionHARMONY-3583 and HARMONY-4104
modified apetrenko  /harmony/enhanced/classlib/trunk/modules/awt/src/main/java/common/org/apache/harmony/awt/gl/font/Glyph.java 06/11/2007 00:31:22 Font library contributionHARMONY-3583 and HARMONY-4104
added apetrenko  /harmony/enhanced/classlib/trunk/modules/awt/src/main/native/fontlib/shared/TTCurve.cpp 06/11/2007 00:31:22 Font library contributionHARMONY-3583 and HARMONY-4104
added apetrenko  /harmony/enhanced/classlib/trunk/modules/awt/src/main/native/fontlib/shared/T1Glyph.h 06/11/2007 00:31:22 Font library contributionHARMONY-3583 and HARMONY-4104
added apetrenko  /harmony/enhanced/classlib/trunk/modules/awt/src/main/native/fontlib/shared/ParsingTables.cpp 06/11/2007 00:31:22 Font library contributionHARMONY-3583 and HARMONY-4104
added apetrenko  /harmony/enhanced/classlib/trunk/modules/awt/src/main/native/fontlib/shared/EncodedValue.cpp 06/11/2007 00:31:22 Font library contributionHARMONY-3583 and HARMONY-4104
modified apetrenko  /harmony/enhanced/classlib/trunk/modules/awt/src/main/java/common/org/apache/harmony/awt/gl/CommonGraphicsEnvironment.java 06/11/2007 00:31:22 Font library contributionHARMONY-3583 and HARMONY-4104
added apetrenko  /harmony/enhanced/classlib/trunk/modules/awt/src/main/native/fontlib/shared/Type1Structs.h 06/11/2007 00:31:22 Font library contributionHARMONY-3583 and HARMONY-4104
modified apetrenko  /harmony/enhanced/classlib/trunk/modules/awt/src/main/java/common/org/apache/harmony/awt/gl/CommonGraphics2D.java 06/11/2007 00:31:22 Font library contributionHARMONY-3583 and HARMONY-4104
added apetrenko  /harmony/enhanced/classlib/trunk/modules/awt/src/main/native/fontlib/shared/include/org_apache_harmony_awt_gl_font_fontlib_FLFontPeer.h 06/11/2007 00:31:22 Font library contributionHARMONY-3583 and HARMONY-4104
added apetrenko  /harmony/enhanced/classlib/trunk/modules/awt/src/main/native/fontlib/windows/fl.def 06/11/2007 00:31:22 Font library contributionHARMONY-3583 and HARMONY-4104
modified apetrenko  /harmony/enhanced/classlib/trunk/modules/awt/src/main/java/common/java/awt/Font.java 06/11/2007 00:31:22 Font library contributionHARMONY-3583 and HARMONY-4104
added apetrenko  /harmony/enhanced/classlib/trunk/modules/awt/src/main/java/common/org/apache/harmony/awt/gl/font/fontlib/FLTextRenderer.java 06/11/2007 00:31:22 Font library contributionHARMONY-3583 and HARMONY-4104
added apetrenko  /harmony/enhanced/classlib/trunk/modules/awt/src/main/native/fontlib/shared/fljni.cpp 06/11/2007 00:31:22 Font library contributionHARMONY-3583 and HARMONY-4104
added apetrenko  /harmony/enhanced/classlib/trunk/modules/awt/src/main/native/fontlib/windows 06/11/2007 00:31:22 Font library contributionHARMONY-3583 and HARMONY-4104
modified apetrenko  /harmony/enhanced/classlib/trunk/modules/awt/src/main/java/windows/org/apache/harmony/awt/gl/windows/WinGDIPGraphics2D.java 06/11/2007 00:31:22 Font library contributionHARMONY-3583 and HARMONY-4104
modified apetrenko  /harmony/enhanced/classlib/trunk/modules/awt/src/main/java/common/org/apache/harmony/awt/gl/font/FontManager.java 06/11/2007 00:31:22 Font library contributionHARMONY-3583 and HARMONY-4104
added apetrenko  /harmony/enhanced/classlib/trunk/modules/awt/src/main/native/fontlib/shared/AGL.h 06/11/2007 00:31:22 Font library contributionHARMONY-3583 and HARMONY-4104
added apetrenko  /harmony/enhanced/classlib/trunk/modules/awt/src/main/java/common/org/apache/harmony/awt/gl/font/fontlib/FLFontPeer.java 06/11/2007 00:31:22 Font library contributionHARMONY-3583 and HARMONY-4104
added apetrenko  /harmony/enhanced/classlib/trunk/modules/awt/src/main/native/fontlib/shared/Environment.h 06/11/2007 00:31:22 Font library contributionHARMONY-3583 and HARMONY-4104
added apetrenko  /harmony/enhanced/classlib/trunk/modules/awt/src/main/native/fontlib/shared/include/org_apache_harmony_awt_gl_font_fontlib_FLPath.h 06/11/2007 00:31:22 Font library contributionHARMONY-3583 and HARMONY-4104
added apetrenko  /harmony/enhanced/classlib/trunk/modules/awt/src/main/native/fontlib/shared/Font.h 06/11/2007 00:31:22 Font library contributionHARMONY-3583 and HARMONY-4104
modified apetrenko  /harmony/enhanced/classlib/trunk/modules/awt/src/main/java/common/org/apache/harmony/awt/gl/opengl/OGLGraphics2D.java 06/11/2007 00:31:22 Font library contributionHARMONY-3583 and HARMONY-4104
added apetrenko  /harmony/enhanced/classlib/trunk/modules/awt/src/main/native/fontlib/shared/TTFont.cpp 06/11/2007 00:31:22 Font library contributionHARMONY-3583 and HARMONY-4104
added apetrenko  /harmony/enhanced/classlib/trunk/modules/awt/src/main/native/fontlib/shared/T1Font.h 06/11/2007 00:31:22 Font library contributionHARMONY-3583 and HARMONY-4104
added apetrenko  /harmony/enhanced/classlib/trunk/modules/awt/src/main/java/common/org/apache/harmony/awt/gl/font/fontlib/FLPath.java 06/11/2007 00:31:22 Font library contributionHARMONY-3583 and HARMONY-4104
added apetrenko  /harmony/enhanced/classlib/trunk/modules/awt/src/main/native/fontlib/shared/Outline.h 06/11/2007 00:31:22 Font library contributionHARMONY-3583 and HARMONY-4104
modified wjwashburn  /harmony/enhanced/drlvm/trunk/vm/vmcore/src/init/parse_arguments.cpp 06/10/2007 09:56:01 Harmony-4001, this patch provides the ability to set the size of a thread'sstack"build test2" has been known to pass on most platforms
modified wjwashburn  /harmony/enhanced/drlvm/trunk/vm/vmcore/src/util/win/ia32_em64t/nt_exception_filter_common.cpp 06/10/2007 09:56:01 Harmony-4001, this patch provides the ability to set the size of a thread'sstack"build test2" has been known to pass on most platforms
modified wjwashburn  /harmony/enhanced/drlvm/trunk/vm/vmcore/src/class_support/C_Interface.cpp 06/10/2007 09:56:01 Harmony-4001, this patch provides the ability to set the size of a thread'sstack"build test2" has been known to pass on most platforms
modified wjwashburn  /harmony/enhanced/drlvm/trunk/vm/vmcore/src/util/linux/signals_ipf.cpp 06/10/2007 09:56:01 Harmony-4001, this patch provides the ability to set the size of a thread'sstack"build test2" has been known to pass on most platforms
modified wjwashburn  /harmony/enhanced/drlvm/trunk/vm/vmcore/src/thread/thread_generic.cpp 06/10/2007 09:56:01 Harmony-4001, this patch provides the ability to set the size of a thread'sstack"build test2" has been known to pass on most platforms
modified wjwashburn  /harmony/enhanced/drlvm/trunk/vm/thread/src/win/os_thread.c 06/10/2007 09:56:01 Harmony-4001, this patch provides the ability to set the size of a thread'sstack"build test2" has been known to pass on most platforms
modified wjwashburn  /harmony/enhanced/drlvm/trunk/vm/vmcore/include/exceptions.h 06/10/2007 09:56:01 Harmony-4001, this patch provides the ability to set the size of a thread'sstack"build test2" has been known to pass on most platforms
modified wjwashburn  /harmony/enhanced/drlvm/trunk/vm/thread/src/thread_private.h 06/10/2007 09:56:01 Harmony-4001, this patch provides the ability to set the size of a thread'sstack"build test2" has been known to pass on most platforms
modified wjwashburn  /harmony/enhanced/drlvm/trunk/vm/thread/src/linux/os_thread.c 06/10/2007 09:56:01 Harmony-4001, this patch provides the ability to set the size of a thread'sstack"build test2" has been known to pass on most platforms
modified wjwashburn  /harmony/enhanced/drlvm/trunk/vm/thread/src/hythr.exp 06/10/2007 09:56:01 Harmony-4001, this patch provides the ability to set the size of a thread'sstack"build test2" has been known to pass on most platforms
modified wjwashburn  /harmony/enhanced/drlvm/trunk/vm/thread/src/thread_java_basic.c 06/10/2007 09:56:01 Harmony-4001, this patch provides the ability to set the size of a thread'sstack"build test2" has been known to pass on most platforms
modified wjwashburn  /harmony/enhanced/drlvm/trunk/vm/thread/src/hythr.def 06/10/2007 09:56:01 Harmony-4001, this patch provides the ability to set the size of a thread'sstack"build test2" has been known to pass on most platforms
modified wjwashburn  /harmony/enhanced/drlvm/trunk/vm/include/open/vm.h 06/10/2007 09:56:01 Harmony-4001, this patch provides the ability to set the size of a thread'sstack"build test2" has been known to pass on most platforms
modified wjwashburn  /harmony/enhanced/drlvm/trunk/vm/vmcore/src/init/harmony.properties 06/10/2007 09:56:01 Harmony-4001, this patch provides the ability to set the size of a thread'sstack"build test2" has been known to pass on most platforms
modified wjwashburn  /harmony/enhanced/drlvm/trunk/vm/thread/src/thread_native_basic.c 06/10/2007 09:56:01 Harmony-4001, this patch provides the ability to set the size of a thread'sstack"build test2" has been known to pass on most platforms
modified wjwashburn  /harmony/enhanced/drlvm/trunk/vm/vmcore/src/util/linux/signals_ia32.cpp 06/10/2007 09:56:01 Harmony-4001, this patch provides the ability to set the size of a thread'sstack"build test2" has been known to pass on most platforms
modified wjwashburn  /harmony/enhanced/drlvm/trunk/vm/vmcore/src/util/linux/signals_em64t.cpp 06/10/2007 09:56:01 Harmony-4001, this patch provides the ability to set the size of a thread'sstack"build test2" has been known to pass on most platforms
modified wjwashburn  /harmony/enhanced/drlvm/trunk/vm/vmcore/include/properties.h 06/10/2007 09:56:01 Harmony-4001, this patch provides the ability to set the size of a thread'sstack"build test2" has been known to pass on most platforms
modified wjwashburn  /harmony/enhanced/drlvm/trunk/vm/vmcore/include/vm_threads.h 06/10/2007 09:56:01 Harmony-4001, this patch provides the ability to set the size of a thread'sstack"build test2" has been known to pass on most platforms
modified wjwashburn  /harmony/enhanced/drlvm/trunk/vm/include/open/hythread_ext.h 06/10/2007 09:56:01 Harmony-4001, this patch provides the ability to set the size of a thread'sstack"build test2" has been known to pass on most platforms
modified varlax  /harmony/enhanced/drlvm/trunk/build/make/build.xml 06/09/2007 21:42:48 Minor improvements to build scripts
modified varlax  /harmony/enhanced/drlvm/trunk/build/make/targets/reg.test.run.xml 06/09/2007 21:42:48 Minor improvements to build scripts
added varlax  /harmony/enhanced/drlvm/trunk/src/test/regression/H4073/Test.java 06/09/2007 21:40:01 Applied HARMONY-4073 drlvm][jit] RCE must not substitute EFLAGS values produced by CMP with ones produced by SBB
added varlax  /harmony/enhanced/drlvm/trunk/src/test/regression/H4073 06/09/2007 21:40:01 Applied HARMONY-4073 drlvm][jit] RCE must not substitute EFLAGS values produced by CMP with ones produced by SBB
added varlax  /harmony/enhanced/drlvm/trunk/src/test/regression/H4073/run.test.xml 06/09/2007 21:40:01 Applied HARMONY-4073 drlvm][jit] RCE must not substitute EFLAGS values produced by CMP with ones produced by SBB
modified varlax  /harmony/enhanced/drlvm/trunk/vm/jitrino/src/codegenerator/ia32/Ia32RCE.cpp 06/09/2007 21:40:01 Applied HARMONY-4073 drlvm][jit] RCE must not substitute EFLAGS values produced by CMP with ones produced by SBB
modified varlax  /harmony/enhanced/drlvm/trunk/vm/jitrino/src/codegenerator/ia32/Ia32I8Lowerer.cpp 06/09/2007 21:40:01 Applied HARMONY-4073 drlvm][jit] RCE must not substitute EFLAGS values produced by CMP with ones produced by SBB
deleted varlax  /harmony/enhanced/drlvm/trunk/vm/jitrino/src/translator/ExceptionInfo.cpp 06/09/2007 21:34:44 Fixed OPT compiler, HARMONY-3797 [drlvm][jit] bad handling of fall-through-reachable exception handlers
modified varlax  /harmony/enhanced/drlvm/trunk/vm/jitrino/src/translator/java/JavaByteCodeTranslator.cpp 06/09/2007 21:34:44 Fixed OPT compiler, HARMONY-3797 [drlvm][jit] bad handling of fall-through-reachable exception handlers
modified varlax  /harmony/enhanced/drlvm/trunk/vm/jitrino/src/translator/TranslatorIntfc.cpp 06/09/2007 21:34:44 Fixed OPT compiler, HARMONY-3797 [drlvm][jit] bad handling of fall-through-reachable exception handlers
modified varlax  /harmony/enhanced/drlvm/trunk/vm/jitrino/src/translator/java/JavaByteCodeParser.cpp 06/09/2007 21:34:44 Fixed OPT compiler, HARMONY-3797 [drlvm][jit] bad handling of fall-through-reachable exception handlers
modified varlax  /harmony/enhanced/drlvm/trunk/vm/jitrino/src/translator/ExceptionInfo.h 06/09/2007 21:34:44 Fixed OPT compiler, HARMONY-3797 [drlvm][jit] bad handling of fall-through-reachable exception handlers
modified varlax  /harmony/enhanced/drlvm/trunk/vm/jitrino/src/translator/java/JavaLabelPrepass.cpp 06/09/2007 21:34:44 Fixed OPT compiler, HARMONY-3797 [drlvm][jit] bad handling of fall-through-reachable exception handlers
modified varlax  /harmony/enhanced/drlvm/trunk/build/custom/msvc_2003/jitrino/jitrino.vcproj 06/09/2007 21:34:44 Fixed OPT compiler, HARMONY-3797 [drlvm][jit] bad handling of fall-through-reachable exception handlers
modified varlax  /harmony/enhanced/drlvm/trunk/vm/jitrino/src/translator/TranslatorIntfc.h 06/09/2007 21:34:44 Fixed OPT compiler, HARMONY-3797 [drlvm][jit] bad handling of fall-through-reachable exception handlers
modified varlax  /harmony/enhanced/drlvm/trunk/vm/jitrino/src/translator/java/JavaByteCodeParser.h 06/09/2007 21:34:44 Fixed OPT compiler, HARMONY-3797 [drlvm][jit] bad handling of fall-through-reachable exception handlers
modified varlax  /harmony/enhanced/drlvm/trunk/vm/jitrino/src/translator/java/JavaFlowGraphBuilder.cpp 06/09/2007 21:34:44 Fixed OPT compiler, HARMONY-3797 [drlvm][jit] bad handling of fall-through-reachable exception handlers
modified varlax  /harmony/enhanced/drlvm/trunk/build/custom/msvc_2005/jitrino/jitrino.vcproj 06/09/2007 21:34:44 Fixed OPT compiler, HARMONY-3797 [drlvm][jit] bad handling of fall-through-reachable exception handlers
modified varlax  /harmony/enhanced/drlvm/trunk/vm/jitrino/src/translator/java/JavaLabelPrepass.h 06/09/2007 21:34:44 Fixed OPT compiler, HARMONY-3797 [drlvm][jit] bad handling of fall-through-reachable exception handlers
modified varlax  /harmony/enhanced/drlvm/trunk/vm/jitrino/src/jet/cg_regs.cpp 06/09/2007 21:31:24 Fixed JET compiler, HARMONY-3797 [drlvm][jit] bad handling of fall-through-reachable exception handlers
modified varlax  /harmony/enhanced/drlvm/trunk/vm/jitrino/src/jet/compiler.cpp 06/09/2007 21:31:24 Fixed JET compiler, HARMONY-3797 [drlvm][jit] bad handling of fall-through-reachable exception handlers
modified varlax  /harmony/enhanced/drlvm/trunk/vm/vmcore/src/kernel_classes/javasrc/org/apache/harmony/lang/reflect/parser/Parser.java 06/09/2007 21:18:59 Applied partial fix to HARMONY-2052 [drlvm][kernel] Improve/re-implement a parser of generic signatures
modified varlax  /harmony/enhanced/drlvm/trunk/vm/vmcore/src/kernel_classes/javasrc/java/lang/reflect/Method.java 06/09/2007 21:18:59 Applied partial fix to HARMONY-2052 [drlvm][kernel] Improve/re-implement a parser of generic signatures
modified varlax  /harmony/enhanced/drlvm/trunk/vm/vmcore/src/kernel_classes/javasrc/java/lang/Class.java 06/09/2007 21:18:59 Applied partial fix to HARMONY-2052 [drlvm][kernel] Improve/re-implement a parser of generic signatures
modified varlax  /harmony/enhanced/drlvm/trunk/vm/vmcore/src/kernel_classes/javasrc/java/lang/reflect/Field.java 06/09/2007 21:18:59 Applied partial fix to HARMONY-2052 [drlvm][kernel] Improve/re-implement a parser of generic signatures
modified varlax  /harmony/enhanced/drlvm/trunk/vm/vmcore/src/kernel_classes/javasrc/java/lang/reflect/Constructor.java 06/09/2007 21:18:59 Applied partial fix to HARMONY-2052 [drlvm][kernel] Improve/re-implement a parser of generic signatures
modified ayza  /harmony/enhanced/classlib/trunk/modules/portlib/src/main/native/include/unix/hysock.h 06/09/2007 21:05:33 Reworked patch from HARMONY-4077 ([classlib][portlib] socket related functions incorrectly work in socket > FD_SETSIZE) was applied
modified ayza  /harmony/enhanced/classlib/trunk/modules/luni/src/main/native/luni/unix/OSNetworkSystemLinux.c 06/09/2007 21:05:33 Reworked patch from HARMONY-4077 ([classlib][portlib] socket related functions incorrectly work in socket > FD_SETSIZE) was applied
modified ayza  /harmony/enhanced/classlib/trunk/modules/portlib/src/main/native/port/unix/hysock.c 06/09/2007 21:05:33 Reworked patch from HARMONY-4077 ([classlib][portlib] socket related functions incorrectly work in socket > FD_SETSIZE) was applied

Mime
View raw message