harmony-alerts mailing list archives

Site index · List index
Message view « Date » · « Thread »
Top « Date » · « Thread »
From nom...@intel.com
Subject [build-test alert] BUILD FAILED Windows XP SP2 x86: jdktools_test
Date Tue, 12 Jun 2007 15:55:24 GMT
BUILD FAILED:
	Ant Error Message:
C:\cruise_hdk\cc\projects\trunk\working_jdktools\build.xml:242: The following error occurred
while executing this line: C:\cruise_hdk\cc\projects\trunk\working_jdktools\make\build-test.xml:97:
There were test errors.

Date of build:	06/12/2007 22:44:09
Time to build:	10 minutes 48 seconds
Last changed:	06/12/2007 17:44:44
Last log entry:	Apply patch HARMONY-4092 ([classlib] [security] Javadoc update for java.security.BasicPermissionCollection)

***********************************************************
Errors/Warnings:	(116)
            

========================================
Testing jdktools binaries...
========================================

Compiling JPDA tests
Since fork is false, ignoring memoryMaximumSize setting
----------
1. WARNING in C:\cruise_hdk\cc\projects\trunk\working_jdktools\modules\jpda\test\common\unit\org\apache\harmony\jpda\tests\framework\DebuggeeRegister.java
 (at line 57)
	registered.add(debuggee); 
	^^^^^^^^^^^^^^^^^^^^^^^^
Type safety: The method add(Object) belongs to the raw type LinkedList. References to generic
type LinkedList<E> should be parameterized
----------
----------
2. WARNING in C:\cruise_hdk\cc\projects\trunk\working_jdktools\modules\jpda\test\common\unit\org\apache\harmony\jpda\tests\framework\TestOptions.java
 (at line 28)
	import java.io.File;
	       ^^^^^^^^^^^^
The import java.io.File is never used
----------
----------
3. WARNING in C:\cruise_hdk\cc\projects\trunk\working_jdktools\modules\jpda\test\common\unit\org\apache\harmony\jpda\tests\framework\jdwp\PacketDispatcher.java
 (at line 113)
	eventQueue.add(eventPacket);
	^^^^^^^^^^^^^^^^^^^^^^^^^^^
Type safety: The method add(Object) belongs to the raw type List. References to generic type
List<E> should be parameterized
----------
4. WARNING in C:\cruise_hdk\cc\projects\trunk\working_jdktools\modules\jpda\test\common\unit\org\apache\harmony\jpda\tests\framework\jdwp\PacketDispatcher.java
 (at line 248)
	replies.put(new Integer(replyPacket.getId()),
                                replyPacket);
	^^^^^^^^^^^^^^^^^^^^^^^^^^^^^^^^^^^^^^^^^^^^^^^^^^^^^^^^^^^^^^^^^^^^^^^^^^^^^^^^^^^^^^^^^^^
Type safety: The method put(Object, Object) belongs to the raw type Hashtable. References
to generic type Hashtable<K,V> should be parameterized
----------
5. WARNING in C:\cruise_hdk\cc\projects\trunk\working_jdktools\modules\jpda\test\common\unit\org\apache\harmony\jpda\tests\framework\jdwp\PacketDispatcher.java
 (at line 283)
	commands.put(Id, command);
	^^^^^^^^^^^^^^^^^^^^^^^^^
Type safety: The method put(Object, Object) belongs to the raw type Hashtable. References
to generic type Hashtable<K,V> should be parameterized
----------
6. WARNING in C:\cruise_hdk\cc\projects\trunk\working_jdktools\modules\jpda\test\common\unit\org\apache\harmony\jpda\tests\framework\jdwp\PacketDispatcher.java
 (at line 354)
	commands.put(Id, command);
	^^^^^^^^^^^^^^^^^^^^^^^^^
Type safety: The method put(Object, Object) belongs to the raw type Hashtable. References
to generic type Hashtable<K,V> should be parameterized
----------
----------
7. WARNING in C:\cruise_hdk\cc\projects\trunk\working_jdktools\modules\jpda\test\common\unit\org\apache\harmony\jpda\tests\framework\jdwp\VmMirror.java
 (at line 1829)
	frames.add(frame);
	^^^^^^^^^^^^^^^^^
Type safety: The method add(Object) belongs to the raw type ArrayList. References to generic
type ArrayList<E> should be parameterized
----------
8. WARNING in C:\cruise_hdk\cc\projects\trunk\working_jdktools\modules\jpda\test\common\unit\org\apache\harmony\jpda\tests\framework\jdwp\VmMirror.java
 (at line 1897)
	vars.add(var);
	^^^^^^^^^^^^^
Type safety: The method add(Object) belongs to the raw type ArrayList. References to generic
type ArrayList<E> should be parameterized
----------
9. WARNING in C:\cruise_hdk\cc\projects\trunk\working_jdktools\modules\jpda\test\common\unit\org\apache\harmony\jpda\tests\framework\jdwp\VmMirror.java
 (at line 2117)
	fields.add(superClassFields.toArray()[i]);
	^^^^^^^^^^^^^^^^^^^^^^^^^^^^^^^^^^^^^^^^^
Type safety: The method add(Object) belongs to the raw type ArrayList. References to generic
type ArrayList<E> should be parameterized
----------
10. WARNING in C:\cruise_hdk\cc\projects\trunk\working_jdktools\modules\jpda\test\common\unit\org\apache\harmony\jpda\tests\framework\jdwp\VmMirror.java
 (at line 2127)
	fields.add(field);
	^^^^^^^^^^^^^^^^^
Type safety: The method add(Object) belongs to the raw type ArrayList. References to generic
type ArrayList<E> should be parameterized
----------
----------
11. WARNING in C:\cruise_hdk\cc\projects\trunk\working_jdktools\modules\jpda\test\common\unit\org\apache\harmony\jpda\tests\jdwp\Events\ExceptionTest.java
 (at line 187)
	long frameID = reply.getNextValueAsFrameID();
	     ^^^^^^^
The local variable frameID is never read
----------
----------
12. WARNING in C:\cruise_hdk\cc\projects\trunk\working_jdktools\modules\jpda\test\common\unit\org\apache\harmony\jpda\tests\jdwp\ThreadReference\FramesTest.java
 (at line 449)
	frames.add(new FrameStruct(frameID, loc));
	^^^^^^^^^^^^^^^^^^^^^^^^^^^^^^^^^^^^^^^^^
Type safety: The method add(Object) belongs to the raw type Vector. References to generic
type Vector<E> should be parameterized
----------
12 problems (12 warnings)
JPDA exclude list: C:\cruise_hdk\cc\projects\trunk\working_classlib\deploy\build\jdktools.jpda.exclude
Running JPDA tests
  Debugger JVM=C:\cruise_hdk\cc\projects\trunk\target\hdk\jdk\jre/bin/java
  Debuggee JVM=C:\cruise_hdk\cc\projects\trunk\target\hdk\jdk\jre/bin/java
The GC did not provide gc_add_weak_root_set_entry()
SAMSA exclude list: C:\cruise_hdk\cc\projects\trunk\working_classlib\deploy\build\jdktools.samsa.exclude
Running SAMSA tests
test.jre.home=C:\cruise_hdk\cc\projects\trunk\target\hdk\jdk\jre
Run jdk/bin/java -version in C:\cruise_hdk\cc\projects\trunk\working_jdktools\build\test_report
java version "1.5.0" 
pre-alpha : not complete or compatible
svn = r546487, (Jun 12 2007), Windows/ia32/msvc 1310, release build
http://harmony.apache.org
Run jdk/bin/javac -version in C:\cruise_hdk\cc\projects\trunk\working_jdktools\build\test_report
Run jdk/bin/javah in C:\cruise_hdk\cc\projects\trunk\working_jdktools\build\test_report
Run jdk/bin/jarsigner in C:\cruise_hdk\cc\projects\trunk\working_jdktools\build\test_report
Run jdk/bin/keytool -help in C:\cruise_hdk\cc\projects\trunk\working_jdktools\build\test_report
Compiling TOOLS tests
Since fork is false, ignoring memoryMaximumSize setting
----------
1. WARNING in C:\cruise_hdk\cc\projects\trunk\working_jdktools\modules\tools\src\test\java\org\apache\harmony\tests\tools\javah\Test\Test01.java
 (at line 23)
	private static final long xxx2 = 1;
	                          ^^^^
The field Test01.xxx2 is never read locally
----------
1 problem (1 warning)
TOOLS exclude list: C:\cruise_hdk\cc\projects\trunk\working_classlib\deploy\build\jdktools.tools.exclude
Running TOOLS tests
test.jre.home=C:\cruise_hdk\cc\projects\trunk\target\hdk\jdk\jre
The GC did not provide gc_add_weak_root_set_entry()
The test report is in C:\cruise_hdk\cc\projects\trunk\working_jdktools\build\test_report\html\index.html

***********************************************************
Unit Tests: (133)
        
error: testCurrentContendedMonitor001 org.apache.harmony.jpda.tests.jdwp.ThreadReference.CurrentContendedMonitorTest
Unit Test Error Details:	(1)
                
Test: testCurrentContendedMonitor001Class: org.apache.harmony.jpda.tests.jdwp.ThreadReference.CurrentContendedMonitorTestorg.apache.harmony.jpda.tests.framework.TestErrorException:
Debuggee process did not finish during timeout
	at org.apache.harmony.jpda.tests.jdwp.share.JDWPUnitDebuggeeWrapper.WaitForProcessExit(JDWPUnitDebuggeeWrapper.java:212)
	at org.apache.harmony.jpda.tests.jdwp.share.JDWPUnitDebuggeeWrapper.stop(JDWPUnitDebuggeeWrapper.java:131)
	at org.apache.harmony.jpda.tests.jdwp.share.JDWPTestCase.internalTearDown(JDWPTestCase.java:84)
	at org.apache.harmony.jpda.tests.jdwp.share.JDWPSyncTestCase.internalTearDown(JDWPSyncTestCase.java:75)
	at org.apache.harmony.jpda.tests.jdwp.share.JDWPRawTestCase.tearDown(JDWPRawTestCase.java:110)
Caused by: java.lang.IllegalThreadStateException: process has not exited
	at java.lang.Runtime$SubProcess.exitValue(Runtime.java:357)
	at org.apache.harmony.jpda.tests.jdwp.share.JDWPUnitDebuggeeWrapper.WaitForProcessExit(JDWPUnitDebuggeeWrapper.java:207)
	at org.apache.harmony.jpda.tests.jdwp.share.JDWPUnitDebuggeeWrapper.stop(JDWPUnitDebuggeeWrapper.java:131)
	... 13 more


***********************************************************
Modifications since last successful build:	(3)
            
modified odeakin  /harmony/enhanced/classlib/trunk/modules/security/src/main/java/common/java/security/BasicPermissionCollection.java
06/12/2007 17:44:44 Apply patch HARMONY-4092 ([classlib] [security] Javadoc update for java.security.BasicPermissionCollection)
modified odeakin  /harmony/enhanced/classlib/trunk/THIRD_PARTY_NOTICES.txt 06/12/2007 16:26:38
Apply patch HARMONY-4028 ([classlib] THIRD_PARTY_NOTICES.txt needs copyright statement for
RFC 2891 specification (and others))
modified odeakin  /harmony/enhanced/classlib/trunk/modules/security/src/main/java/common/java/security/Provider.java
06/12/2007 16:12:09 Apply patch HARMONY-4090 ([classlib] [security] Javadoc update for java.security.Provider)

Mime
View raw message