harmony-alerts mailing list archives

Site index · List index
Message view « Date » · « Thread »
Top « Date » · « Thread »
From nom...@intel.com
Subject [build-test alert] BUILD FAILED LINUX SUSE 9 x86_64: harmony_hdk
Date Sun, 10 Jun 2007 03:53:24 GMT
BUILD FAILED:
	Ant Error Message:
/export/users/tst/cc/projects/trunk/build.xml:366: exec returned: 1

Date of build:	06/10/2007 10:29:02
Time to build:	22 minutes 33 seconds
Last changed:	06/10/2007 09:56:01
Last log entry:	Harmony-4001, this patch provides the ability to set the size of a thread's
stack
"build test2" has been known to pass on most platforms



***********************************************************
Execution log (errors/warnings messages):	

                   Apache Harmony Federated Build
            ==========================================
            svn rev          :  r545833
            operating system :  linux
            architecture     :  x86_64-64
            ant os name/arch :  Linux/x86_64
            build mode       :  release
            output location  :  target.tst
            DRLVM classlib   :  ../../../working_classlib
        
/export/users/tst/cc/projects/trunk/working_classlib/modules/accessibility/bin/test not found.
/export/users/tst/cc/projects/trunk/working_classlib/modules/annotation/bin/test not found.
/export/users/tst/cc/projects/trunk/working_classlib/modules/applet/bin/test not found.
/export/users/tst/cc/projects/trunk/working_classlib/modules/archive/bin/test not found.
/export/users/tst/cc/projects/trunk/working_classlib/modules/auth/bin/test not found.
/export/users/tst/cc/projects/trunk/working_classlib/modules/awt/bin/test not found.
/export/users/tst/cc/projects/trunk/working_classlib/modules/beans/bin/test not found.
/export/users/tst/cc/projects/trunk/working_classlib/modules/concurrent/bin/test not found.
/export/users/tst/cc/projects/trunk/working_classlib/modules/crypto/bin/test not found.
/export/users/tst/cc/projects/trunk/working_classlib/modules/imageio/bin/test not found.
/export/users/tst/cc/projects/trunk/working_classlib/modules/instrument/bin/test not found.
/export/users/tst/cc/projects/trunk/working_classlib/modules/jndi/bin/test not found.
/export/users/tst/cc/projects/trunk/working_classlib/modules/lang-management/bin/api not found.
/export/users/tst/cc/projects/trunk/working_classlib/modules/lang-management/bin/impl not
found.
/export/users/tst/cc/projects/trunk/working_classlib/modules/logging/bin/test not found.
/export/users/tst/cc/projects/trunk/working_classlib/modules/luni/bin/test not found.
/export/users/tst/cc/projects/trunk/working_classlib/modules/math/bin/test not found.
/export/users/tst/cc/projects/trunk/working_classlib/modules/misc/bin/test not found.
/export/users/tst/cc/projects/trunk/working_classlib/modules/nio/bin/test not found.
/export/users/tst/cc/projects/trunk/working_classlib/modules/nio_char/bin/test not found.
/export/users/tst/cc/projects/trunk/working_classlib/modules/pack200/bin/test not found.
/export/users/tst/cc/projects/trunk/working_classlib/modules/prefs/bin/test not found.
/export/users/tst/cc/projects/trunk/working_classlib/modules/print/bin/test not found.
/export/users/tst/cc/projects/trunk/working_classlib/modules/regex/bin/test not found.
/export/users/tst/cc/projects/trunk/working_classlib/modules/rmi/bin/test not found.
/export/users/tst/cc/projects/trunk/working_classlib/modules/security/bin/test not found.
/export/users/tst/cc/projects/trunk/working_classlib/modules/sound/bin/test not found.
/export/users/tst/cc/projects/trunk/working_classlib/modules/sql/bin/test not found.
/export/users/tst/cc/projects/trunk/working_classlib/modules/suncompat/bin/test not found.
/export/users/tst/cc/projects/trunk/working_classlib/modules/swing/bin/test not found.
/export/users/tst/cc/projects/trunk/working_classlib/modules/text/bin/test not found.
/export/users/tst/cc/projects/trunk/working_classlib/modules/x-net/bin/test not found.
/export/users/tst/cc/projects/trunk/working_classlib/deploy/jdk/include not found.

========================================
Building Java component archives...
========================================
        
Checking for depends/jars/yoko_M2-20070130/yoko.jar
Checking for depends/jars/yoko_M2-20070130/yoko-core.jar
Checking for depends/jars/yoko_M2-20070130/yoko-rmi-impl.jar
Checking for depends/jars/yoko_M2-20070130/yoko-rmi-spec.jar
Checking for depends/jars/bcel-5.2/bcel-5.2.jar
Checking for depends/jars/xalan-j_2.7.0/xalan.jar
Checking for depends/jars/xerces_2.9.0/xerces.zip
Checking for depends/jars/junit_3.8.2/junit.jar
Checking for depends/jars/bcprov-jdk15-136/bcprov.jar
Checking for depends/jars/icu4j_3.4.4/icu4j_3_4_4.jar
Checking for depends/jars/mx4j_3.0.2/mx4j.zip
Checking for depends/jars/jetty/jetty-6.0.0.jar
Checking for depends/jars/jetty/jetty-util-6.0.0.jar
Checking for depends/jars/jetty/servlet-api-2.5-6.0.0.jar
Checking for depends/libs/build/lcms/icc34.h
Checking for depends/libs/build/lcms/lcms.h
Checking for depends/libs/build/png/pngconf.h
Checking for depends/libs/build/png/png.h
Checking for depends/libs/build/jpeg/jconfig.lnx
Checking for depends/libs/build/jpeg/jpeglib.h
Checking for depends/libs/build/jpeg/jmorecfg.h
Checking for depends/libs/build/jpeg/jerror.h
Checking for depends/libs/build/lcms/liblcms.linux.x86_64
Checking for depends/libs/build/png/libpng.linux.x86_64
Checking for depends/libs/build/jpeg/libjpeg.linux.x86_64
Compiling ACCESSIBILITY classes
Compiling ANNOTATION classes
Compiling APPLET classes
Compiling ARCHIVE classes
Compiling AUTH classes
Compiling AWT classes
Compiling BEANS classes
Compiling CONCURRENT classes
Compiling CRYPTO classes
Compiling ImageIO classes
Compiling INSTRUMENT classes
Compiling JNDI classes
Compiling LANG-MANAGEMENT classes
Compiling LOGGING classes
Compiling LUNI classes
Compiling MATH classes
Compiling MISC classes
Compiling NIO classes
Compiling NIO_CHAR classes
Compiling PACK200 classes
Since fork is false, ignoring memoryMaximumSize setting
Since fork is false, ignoring memoryMaximumSize setting
Compiling PREFS classes
Compiling PRINT classes
Compiling REGEX classes
Compiling RMI classes
Compiling SECURITY classes
Compiling SOUND classes
Since fork is false, ignoring memoryMaximumSize setting
Compiling SQL classes
Compiling Sun Compat classes
Compiling SWING classes
Compiling TEXT classes
Compiling X-NET classes

========================================
Building native libs and executables...
========================================
        
../shared/hyport.c: In function `initNLSCatalog':
../shared/hyport.c:616: warning: passing arg 2 of pointer to function from incompatible pointer
type
../shared/OSNetworkSystem.c: In function `Java_org_apache_harmony_luni_platform_OSNetworkSystem_writeSocketImpl':
../shared/OSNetworkSystem.c:496: warning: unused variable `sent'
../shared/OSNetworkSystem.c: In function `Java_org_apache_harmony_luni_platform_OSNetworkSystem_availableStreamImpl':
../shared/OSNetworkSystem.c:861: warning: unused variable `loopFlag'
OSNetworkSystemLinux.c: In function `selectRead':
OSNetworkSystemLinux.c:44: warning: unused variable `privatePortLibrary'
../shared/cmmio.c: In function `cmmOpenProfile':
../shared/cmmio.c:475: warning: assignment from incompatible pointer type
../shared/cmmio.c:477: warning: assignment from incompatible pointer type
../shared/cmmio.c:479: warning: assignment from incompatible pointer type
../shared/cmmio.c:481: warning: assignment from incompatible pointer type
../shared/cmmio.c:483: warning: assignment from incompatible pointer type
../shared/cmmxforms.c: In function `cmmCreateMultiprofileTransform':
../shared/cmmxforms.c:181: warning: passing arg 2 of `cmsSample3DGrid' from incompatible pointer
type
../shared/JpegEncoder.c: In function `Java_org_apache_harmony_x_imageio_plugins_jpeg_JPEGImageWriter_encode':
../shared/JpegEncoder.c:374: warning: passing arg 1 of pointer to function from incompatible
pointer type
Checking for depends/jars/yoko_M2-20070130/yoko.jar
Checking for depends/jars/yoko_M2-20070130/yoko-core.jar
Checking for depends/jars/yoko_M2-20070130/yoko-rmi-impl.jar
Checking for depends/jars/yoko_M2-20070130/yoko-rmi-spec.jar
Checking for depends/jars/bcel-5.2/bcel-5.2.jar
Checking for depends/jars/xalan-j_2.7.0/xalan.jar
Checking for depends/jars/xerces_2.9.0/xerces.zip
Checking for depends/jars/junit_3.8.2/junit.jar
Checking for depends/jars/bcprov-jdk15-136/bcprov.jar
Checking for depends/jars/icu4j_3.4.4/icu4j_3_4_4.jar
Checking for depends/jars/mx4j_3.0.2/mx4j.zip
Checking for depends/jars/jetty/jetty-6.0.0.jar
Checking for depends/jars/jetty/jetty-util-6.0.0.jar
Checking for depends/jars/jetty/servlet-api-2.5-6.0.0.jar
Checking for depends/libs/build/lcms/icc34.h
Checking for depends/libs/build/lcms/lcms.h
Checking for depends/libs/build/png/pngconf.h
Checking for depends/libs/build/png/png.h
Checking for depends/libs/build/jpeg/jconfig.lnx
Checking for depends/libs/build/jpeg/jpeglib.h
Checking for depends/libs/build/jpeg/jmorecfg.h
Checking for depends/libs/build/jpeg/jerror.h
Checking for depends/libs/build/lcms/liblcms.linux.x86_64
Checking for depends/libs/build/png/libpng.linux.x86_64
Checking for depends/libs/build/jpeg/libjpeg.linux.x86_64
The GC did not provide gc_add_weak_root_set_entry()
The GC did not provide gc_add_weak_root_set_entry()
[replaceregexp] The following file is missing: '/export/users/tst/cc/projects/trunk/working_vm/build/lnx_em64t_gcc_release/semis/extra/apr/src/include/apr.h'
[replaceregexp] The following file is missing: '/export/users/tst/cc/projects/trunk/working_vm/build/lnx_em64t_gcc_release/semis/extra/apr/src/include/apr.h'
[replaceregexp] The following file is missing: '/export/users/tst/cc/projects/trunk/working_vm/build/lnx_em64t_gcc_release/semis/extra/apr/src/include/apr.h'
[replaceregexp] The following file is missing: '/export/users/tst/cc/projects/trunk/working_vm/build/lnx_em64t_gcc_release/semis/extra/apr/src/build/apr_rules.mk'
BUILD FAILED
/export/users/tst/cc/projects/trunk/working_vm/build/make/build.xml:481: The following error
occurred while executing this line:
/export/users/tst/cc/projects/trunk/working_vm/build/make/build.xml:488: The following error
occurred while executing this line:
/export/users/tst/cc/projects/trunk/working_vm/build/make/build_component.xml:73: The following
error occurred while executing this line:
/export/users/tst/cc/projects/trunk/working_vm/build/lnx_em64t_gcc_release/semis/build/init_extra.apr.xml:52:
Warning: Could not find file /export/users/tst/cc/projects/trunk/working_vm/build/lnx_em64t_gcc_release/semis/extra/apr/src/.libs/libapr-1.a
to copy.
Total time: 4 minutes 11 seconds

***********************************************************
Unit Tests: (0)
        
No Tests Run: This project doesn't have any tests or tests were not run

***********************************************************
Modifications since last successful build:	(20)
            
modified wjwashburn  /harmony/enhanced/drlvm/trunk/vm/vmcore/src/init/parse_arguments.cpp
06/10/2007 09:56:01 Harmony-4001, this patch provides the ability to set the size of a thread'sstack"build
test2" has been known to pass on most platforms
modified wjwashburn  /harmony/enhanced/drlvm/trunk/vm/vmcore/src/util/win/ia32_em64t/nt_exception_filter_common.cpp
06/10/2007 09:56:01 Harmony-4001, this patch provides the ability to set the size of a thread'sstack"build
test2" has been known to pass on most platforms
modified wjwashburn  /harmony/enhanced/drlvm/trunk/vm/vmcore/src/class_support/C_Interface.cpp
06/10/2007 09:56:01 Harmony-4001, this patch provides the ability to set the size of a thread'sstack"build
test2" has been known to pass on most platforms
modified wjwashburn  /harmony/enhanced/drlvm/trunk/vm/vmcore/src/util/linux/signals_ipf.cpp
06/10/2007 09:56:01 Harmony-4001, this patch provides the ability to set the size of a thread'sstack"build
test2" has been known to pass on most platforms
modified wjwashburn  /harmony/enhanced/drlvm/trunk/vm/vmcore/src/thread/thread_generic.cpp
06/10/2007 09:56:01 Harmony-4001, this patch provides the ability to set the size of a thread'sstack"build
test2" has been known to pass on most platforms
modified wjwashburn  /harmony/enhanced/drlvm/trunk/vm/thread/src/win/os_thread.c 06/10/2007
09:56:01 Harmony-4001, this patch provides the ability to set the size of a thread'sstack"build
test2" has been known to pass on most platforms
modified wjwashburn  /harmony/enhanced/drlvm/trunk/vm/vmcore/include/exceptions.h 06/10/2007
09:56:01 Harmony-4001, this patch provides the ability to set the size of a thread'sstack"build
test2" has been known to pass on most platforms
modified wjwashburn  /harmony/enhanced/drlvm/trunk/vm/thread/src/thread_private.h 06/10/2007
09:56:01 Harmony-4001, this patch provides the ability to set the size of a thread'sstack"build
test2" has been known to pass on most platforms
modified wjwashburn  /harmony/enhanced/drlvm/trunk/vm/thread/src/linux/os_thread.c 06/10/2007
09:56:01 Harmony-4001, this patch provides the ability to set the size of a thread'sstack"build
test2" has been known to pass on most platforms
modified wjwashburn  /harmony/enhanced/drlvm/trunk/vm/thread/src/hythr.exp 06/10/2007 09:56:01
Harmony-4001, this patch provides the ability to set the size of a thread'sstack"build test2"
has been known to pass on most platforms
modified wjwashburn  /harmony/enhanced/drlvm/trunk/vm/thread/src/thread_java_basic.c 06/10/2007
09:56:01 Harmony-4001, this patch provides the ability to set the size of a thread'sstack"build
test2" has been known to pass on most platforms
modified wjwashburn  /harmony/enhanced/drlvm/trunk/vm/thread/src/hythr.def 06/10/2007 09:56:01
Harmony-4001, this patch provides the ability to set the size of a thread'sstack"build test2"
has been known to pass on most platforms
modified wjwashburn  /harmony/enhanced/drlvm/trunk/vm/include/open/vm.h 06/10/2007 09:56:01
Harmony-4001, this patch provides the ability to set the size of a thread'sstack"build test2"
has been known to pass on most platforms
modified wjwashburn  /harmony/enhanced/drlvm/trunk/vm/vmcore/src/init/harmony.properties 06/10/2007
09:56:01 Harmony-4001, this patch provides the ability to set the size of a thread'sstack"build
test2" has been known to pass on most platforms
modified wjwashburn  /harmony/enhanced/drlvm/trunk/vm/thread/src/thread_native_basic.c 06/10/2007
09:56:01 Harmony-4001, this patch provides the ability to set the size of a thread'sstack"build
test2" has been known to pass on most platforms
modified wjwashburn  /harmony/enhanced/drlvm/trunk/vm/vmcore/src/util/linux/signals_ia32.cpp
06/10/2007 09:56:01 Harmony-4001, this patch provides the ability to set the size of a thread'sstack"build
test2" has been known to pass on most platforms
modified wjwashburn  /harmony/enhanced/drlvm/trunk/vm/vmcore/src/util/linux/signals_em64t.cpp
06/10/2007 09:56:01 Harmony-4001, this patch provides the ability to set the size of a thread'sstack"build
test2" has been known to pass on most platforms
modified wjwashburn  /harmony/enhanced/drlvm/trunk/vm/vmcore/include/properties.h 06/10/2007
09:56:01 Harmony-4001, this patch provides the ability to set the size of a thread'sstack"build
test2" has been known to pass on most platforms
modified wjwashburn  /harmony/enhanced/drlvm/trunk/vm/vmcore/include/vm_threads.h 06/10/2007
09:56:01 Harmony-4001, this patch provides the ability to set the size of a thread'sstack"build
test2" has been known to pass on most platforms
modified wjwashburn  /harmony/enhanced/drlvm/trunk/vm/include/open/hythread_ext.h 06/10/2007
09:56:01 Harmony-4001, this patch provides the ability to set the size of a thread'sstack"build
test2" has been known to pass on most platforms

Mime
View raw message