harmony-alerts mailing list archives

Site index · List index
Message view « Date » · « Thread »
Top « Date » · « Thread »
From nom...@intel.com
Subject [build-test alert] BUILD FAILED LINUX SUSE 9 x86_64: jdktools_test
Date Thu, 07 Jun 2007 12:58:29 GMT
BUILD FAILED:
	Ant Error Message:
/export/users/tst/cc/projects/trunk/working_jdktools/build.xml:242: The following error occurred
while executing this line: /export/users/tst/cc/projects/trunk/working_jdktools/make/build-test.xml:97:
There were test errors.

Date of build:	06/07/2007 17:45:14
Time to build:	130 minutes 13 seconds
Last changed:	06/07/2007 17:24:57
Last log entry:	Updated x-lists:
#HARMONY-3617
org/apache/harmony/prefs/tests/java/util/prefs/AbstractPreferencesTest.java


***********************************************************
Execution log (errors/warnings messages):	
Tests FAILED
Result: 1

========================================
Testing jdktools binaries...
========================================
Compiling JPDA tests
Since fork is false, ignoring memoryMaximumSize setting
----------
1. WARNING in /export/users/tst/cc/projects/trunk/working_jdktools/modules/jpda/test/common/unit/org/apache/harmony/jpda/tests/framework/DebuggeeRegister.java
 (at line 57)
	registered.add(debuggee); 
	^^^^^^^^^^^^^^^^^^^^^^^^
Type safety: The method add(Object) belongs to the raw type LinkedList. References to generic
type LinkedList<E> should be parameterized
----------
----------
2. WARNING in /export/users/tst/cc/projects/trunk/working_jdktools/modules/jpda/test/common/unit/org/apache/harmony/jpda/tests/framework/TestOptions.java
 (at line 28)
	import java.io.File;
	       ^^^^^^^^^^^^
The import java.io.File is never used
----------
----------
3. WARNING in /export/users/tst/cc/projects/trunk/working_jdktools/modules/jpda/test/common/unit/org/apache/harmony/jpda/tests/framework/jdwp/PacketDispatcher.java
 (at line 113)
	eventQueue.add(eventPacket);
	^^^^^^^^^^^^^^^^^^^^^^^^^^^
Type safety: The method add(Object) belongs to the raw type List. References to generic type
List<E> should be parameterized
----------
4. WARNING in /export/users/tst/cc/projects/trunk/working_jdktools/modules/jpda/test/common/unit/org/apache/harmony/jpda/tests/framework/jdwp/PacketDispatcher.java
 (at line 248)
	replies.put(new Integer(replyPacket.getId()),
                                replyPacket);
	^^^^^^^^^^^^^^^^^^^^^^^^^^^^^^^^^^^^^^^^^^^^^^^^^^^^^^^^^^^^^^^^^^^^^^^^^^^^^^^^^^^^^^^^^^
Type safety: The method put(Object, Object) belongs to the raw type Hashtable. References
to generic type Hashtable<K,V> should be parameterized
----------
5. WARNING in /export/users/tst/cc/projects/trunk/working_jdktools/modules/jpda/test/common/unit/org/apache/harmony/jpda/tests/framework/jdwp/PacketDispatcher.java
 (at line 283)
	commands.put(Id, command);
	^^^^^^^^^^^^^^^^^^^^^^^^^
Type safety: The method put(Object, Object) belongs to the raw type Hashtable. References
to generic type Hashtable<K,V> should be parameterized
----------
6. WARNING in /export/users/tst/cc/projects/trunk/working_jdktools/modules/jpda/test/common/unit/org/apache/harmony/jpda/tests/framework/jdwp/PacketDispatcher.java
 (at line 354)
	commands.put(Id, command);
	^^^^^^^^^^^^^^^^^^^^^^^^^
Type safety: The method put(Object, Object) belongs to the raw type Hashtable. References
to generic type Hashtable<K,V> should be parameterized
----------
----------
7. WARNING in /export/users/tst/cc/projects/trunk/working_jdktools/modules/jpda/test/common/unit/org/apache/harmony/jpda/tests/framework/jdwp/VmMirror.java
 (at line 1829)
	frames.add(frame);
	^^^^^^^^^^^^^^^^^
Type safety: The method add(Object) belongs to the raw type ArrayList. References to generic
type ArrayList<E> should be parameterized
----------
8. WARNING in /export/users/tst/cc/projects/trunk/working_jdktools/modules/jpda/test/common/unit/org/apache/harmony/jpda/tests/framework/jdwp/VmMirror.java
 (at line 1897)
	vars.add(var);
	^^^^^^^^^^^^^
Type safety: The method add(Object) belongs to the raw type ArrayList. References to generic
type ArrayList<E> should be parameterized
----------
9. WARNING in /export/users/tst/cc/projects/trunk/working_jdktools/modules/jpda/test/common/unit/org/apache/harmony/jpda/tests/framework/jdwp/VmMirror.java
 (at line 2117)
	fields.add(superClassFields.toArray()[i]);
	^^^^^^^^^^^^^^^^^^^^^^^^^^^^^^^^^^^^^^^^^
Type safety: The method add(Object) belongs to the raw type ArrayList. References to generic
type ArrayList<E> should be parameterized
----------
10. WARNING in /export/users/tst/cc/projects/trunk/working_jdktools/modules/jpda/test/common/unit/org/apache/harmony/jpda/tests/framework/jdwp/VmMirror.java
 (at line 2127)
	fields.add(field);
	^^^^^^^^^^^^^^^^^
Type safety: The method add(Object) belongs to the raw type ArrayList. References to generic
type ArrayList<E> should be parameterized
----------
----------
11. WARNING in /export/users/tst/cc/projects/trunk/working_jdktools/modules/jpda/test/common/unit/org/apache/harmony/jpda/tests/jdwp/Events/ExceptionTest.java
 (at line 187)
	long frameID = reply.getNextValueAsFrameID();
	     ^^^^^^^
The local variable frameID is never read
----------
----------
12. WARNING in /export/users/tst/cc/projects/trunk/working_jdktools/modules/jpda/test/common/unit/org/apache/harmony/jpda/tests/jdwp/ThreadReference/FramesTest.java
 (at line 449)
	frames.add(new FrameStruct(frameID, loc));
	^^^^^^^^^^^^^^^^^^^^^^^^^^^^^^^^^^^^^^^^^
Type safety: The method add(Object) belongs to the raw type Vector. References to generic
type Vector<E> should be parameterized
----------
12 problems (12 warnings)
JPDA exclude list: /export/users/tst/cc/projects/trunk/working_classlib/deploy/build/jdktools.jpda.exclude
Running JPDA tests
  Debugger JVM=/export/users/tst/cc/projects/trunk/target/hdk/jdk/jre/bin/java
  Debuggee JVM=/export/users/tst/cc/projects/trunk/target/hdk/jdk/jre/bin/java
The GC did not provide gc_add_weak_root_set_entry()
SAMSA exclude list: /export/users/tst/cc/projects/trunk/working_classlib/deploy/build/jdktools.samsa.exclude
Running SAMSA tests
test.jre.home=/export/users/tst/cc/projects/trunk/target/hdk/jdk/jre
Run jdk/bin/java -version in /export/users/tst/cc/projects/trunk/working_jdktools/build/test_report
java version "1.5.0" 
pre-alpha : not complete or compatible
svn = r544791, (Jun  6 2007), Linux/em64t/gcc 3.3.3, release build
http://harmony.apache.org
Run jdk/bin/javac -version in /export/users/tst/cc/projects/trunk/working_jdktools/build/test_report
Run jdk/bin/javah in /export/users/tst/cc/projects/trunk/working_jdktools/build/test_report
Run jdk/bin/jarsigner in /export/users/tst/cc/projects/trunk/working_jdktools/build/test_report
Run jdk/bin/keytool -help in /export/users/tst/cc/projects/trunk/working_jdktools/build/test_report
Compiling TOOLS tests
Since fork is false, ignoring memoryMaximumSize setting
----------
1. WARNING in /export/users/tst/cc/projects/trunk/working_jdktools/modules/tools/src/test/java/org/apache/harmony/tests/tools/javah/Test/Test01.java
 (at line 23)
	private static final long xxx2 = 1;
	                          ^^^^
The field Test01.xxx2 is never read locally
----------
1 problem (1 warning)
TOOLS exclude list: /export/users/tst/cc/projects/trunk/working_classlib/deploy/build/jdktools.tools.exclude
Running TOOLS tests
test.jre.home=/export/users/tst/cc/projects/trunk/target/hdk/jdk/jre
The GC did not provide gc_add_weak_root_set_entry()
The test report is in /export/users/tst/cc/projects/trunk/working_jdktools/build/test_report/html/index.html

***********************************************************
Unit Tests: (136)
        
error: testAttachConnector001 org.apache.harmony.jpda.tests.jdwp.MultiSession.AttachConnectorTest
error: testClassObjectID001 org.apache.harmony.jpda.tests.jdwp.MultiSession.ClassObjectIDTest
error: testListenConnector org.apache.harmony.jpda.tests.jdwp.MultiSession.ListenConnectorTest
error: testRefTypeID001 org.apache.harmony.jpda.tests.jdwp.MultiSession.RefTypeIDTest
error: testResume org.apache.harmony.jpda.tests.jdwp.MultiSession.ResumeTest
error: testFrames002 org.apache.harmony.jpda.tests.jdwp.ThreadReference.FramesTest
error: testName001 org.apache.harmony.jpda.tests.jdwp.ThreadReference.NameTest
error: testResume001 org.apache.harmony.jpda.tests.jdwp.ThreadReference.ResumeTest
error: testHoldEvents001 org.apache.harmony.jpda.tests.jdwp.VirtualMachine.HoldEventsTest
error: testIDSizes001 org.apache.harmony.jpda.tests.jdwp.VirtualMachine.IDSizesTest
error: testRedefineClasses001 org.apache.harmony.jpda.tests.jdwp.VirtualMachine.RedefineClassesTest
error: testResume001 org.apache.harmony.jpda.tests.jdwp.VirtualMachine.ResumeTest
error: testSetDefaultStratum001 org.apache.harmony.jpda.tests.jdwp.VirtualMachine.SetDefaultStratumTest
error: testSuspend001 org.apache.harmony.jpda.tests.jdwp.VirtualMachine.SuspendTest
error: testTopLevelThreadGroups001 org.apache.harmony.jpda.tests.jdwp.VirtualMachine.TopLevelThreadGroupsTest
Unit Test Error Details:	(15)
                
Test: testAttachConnector001Class: org.apache.harmony.jpda.tests.jdwp.MultiSession.AttachConnectorTestorg.apache.harmony.jpda.tests.framework.TestErrorException:
Debuggee process did not finish during timeout
	at org.apache.harmony.jpda.tests.jdwp.share.JDWPUnitDebuggeeWrapper.WaitForProcessExit(JDWPUnitDebuggeeWrapper.java:212)
	at org.apache.harmony.jpda.tests.jdwp.share.JDWPUnitDebuggeeWrapper.stop(JDWPUnitDebuggeeWrapper.java:131)
	at org.apache.harmony.jpda.tests.jdwp.share.JDWPTestCase.internalTearDown(JDWPTestCase.java:84)
	at org.apache.harmony.jpda.tests.jdwp.share.JDWPSyncTestCase.internalTearDown(JDWPSyncTestCase.java:75)
	at org.apache.harmony.jpda.tests.jdwp.share.JDWPRawTestCase.setUp(JDWPRawTestCase.java:99)
Caused by: java.lang.IllegalThreadStateException: process has not exited
	at java.lang.Runtime$SubProcess.exitValue(Runtime.java:357)
	at org.apache.harmony.jpda.tests.jdwp.share.JDWPUnitDebuggeeWrapper.WaitForProcessExit(JDWPUnitDebuggeeWrapper.java:207)
	at org.apache.harmony.jpda.tests.jdwp.share.JDWPUnitDebuggeeWrapper.stop(JDWPUnitDebuggeeWrapper.java:131)
	... 13 more

Test: testClassObjectID001Class: org.apache.harmony.jpda.tests.jdwp.MultiSession.ClassObjectIDTestorg.apache.harmony.jpda.tests.framework.TestErrorException:
Debuggee process did not finish during timeout
	at org.apache.harmony.jpda.tests.jdwp.share.JDWPUnitDebuggeeWrapper.WaitForProcessExit(JDWPUnitDebuggeeWrapper.java:212)
	at org.apache.harmony.jpda.tests.jdwp.share.JDWPUnitDebuggeeWrapper.stop(JDWPUnitDebuggeeWrapper.java:131)
	at org.apache.harmony.jpda.tests.jdwp.share.JDWPTestCase.internalTearDown(JDWPTestCase.java:84)
	at org.apache.harmony.jpda.tests.jdwp.share.JDWPSyncTestCase.internalTearDown(JDWPSyncTestCase.java:75)
	at org.apache.harmony.jpda.tests.jdwp.share.JDWPRawTestCase.setUp(JDWPRawTestCase.java:99)
Caused by: java.lang.IllegalThreadStateException: process has not exited
	at java.lang.Runtime$SubProcess.exitValue(Runtime.java:357)
	at org.apache.harmony.jpda.tests.jdwp.share.JDWPUnitDebuggeeWrapper.WaitForProcessExit(JDWPUnitDebuggeeWrapper.java:207)
	at org.apache.harmony.jpda.tests.jdwp.share.JDWPUnitDebuggeeWrapper.stop(JDWPUnitDebuggeeWrapper.java:131)
	... 13 more

Test: testListenConnectorClass: org.apache.harmony.jpda.tests.jdwp.MultiSession.ListenConnectorTestorg.apache.harmony.jpda.tests.framework.TestErrorException:
Debuggee process did not finish during timeout
	at org.apache.harmony.jpda.tests.jdwp.share.JDWPUnitDebuggeeWrapper.WaitForProcessExit(JDWPUnitDebuggeeWrapper.java:212)
	at org.apache.harmony.jpda.tests.jdwp.share.JDWPUnitDebuggeeWrapper.stop(JDWPUnitDebuggeeWrapper.java:131)
	at org.apache.harmony.jpda.tests.jdwp.share.JDWPTestCase.internalTearDown(JDWPTestCase.java:84)
	at org.apache.harmony.jpda.tests.jdwp.share.JDWPSyncTestCase.internalTearDown(JDWPSyncTestCase.java:75)
	at org.apache.harmony.jpda.tests.jdwp.share.JDWPRawTestCase.setUp(JDWPRawTestCase.java:99)
Caused by: java.lang.IllegalThreadStateException: process has not exited
	at java.lang.Runtime$SubProcess.exitValue(Runtime.java:357)
	at org.apache.harmony.jpda.tests.jdwp.share.JDWPUnitDebuggeeWrapper.WaitForProcessExit(JDWPUnitDebuggeeWrapper.java:207)
	at org.apache.harmony.jpda.tests.jdwp.share.JDWPUnitDebuggeeWrapper.stop(JDWPUnitDebuggeeWrapper.java:131)
	... 13 more

Test: testRefTypeID001Class: org.apache.harmony.jpda.tests.jdwp.MultiSession.RefTypeIDTestorg.apache.harmony.jpda.tests.framework.TestErrorException:
org.apache.harmony.jpda.tests.framework.TestErrorException: org.apache.harmony.jpda.tests.framework.TestErrorException:
java.net.SocketTimeoutException: The operation timed out
	at org.apache.harmony.jpda.tests.jdwp.share.JDWPRawTestCase.setUp(JDWPRawTestCase.java:100)
Caused by: org.apache.harmony.jpda.tests.framework.TestErrorException: org.apache.harmony.jpda.tests.framework.TestErrorException:
java.net.SocketTimeoutException: The operation timed out
	at org.apache.harmony.jpda.tests.jdwp.share.JDWPUnitDebuggeeWrapper.start(JDWPUnitDebuggeeWrapper.java:117)
	at org.apache.harmony.jpda.tests.jdwp.share.JDWPTestCase.internalSetUp(JDWPTestCase.java:66)
	at org.apache.harmony.jpda.tests.jdwp.share.JDWPSyncTestCase.internalSetUp(JDWPSyncTestCase.java:55)
	at org.apache.harmony.jpda.tests.jdwp.share.JDWPRawTestCase.setUp(JDWPRawTestCase.java:94)
	... 9 more
Caused by: org.apache.harmony.jpda.tests.framework.TestErrorException: java.net.SocketTimeoutException:
The operation timed out
	at org.apache.harmony.jpda.tests.jdwp.share.JDWPUnitDebuggeeWrapper.openConnection(JDWPUnitDebuggeeWrapper.java:236)
	at org.apache.harmony.jpda.tests.jdwp.share.JDWPUnitDebuggeeWrapper.start(JDWPUnitDebuggeeWrapper.java:112)
	at org.apache.harmony.jpda.tests.jdwp.share.JDWPTestCase.internalSetUp(JDWPTestCase.java:66)
	... 12 more
Caused by: java.net.SocketTimeoutException: The operation timed out
	at org.apache.harmony.luni.net.PlainSocketImpl.read(PlainSocketImpl.java:545)
	at org.apache.harmony.luni.net.SocketInputStream.read(SocketInputStream.java:87)
	at org.apache.harmony.jpda.tests.framework.jdwp.SocketTransportWrapper.handshake(SocketTransportWrapper.java:298)
	at org.apache.harmony.jpda.tests.framework.jdwp.SocketTransportWrapper.attach(SocketTransportWrapper.java:183)
	at org.apache.harmony.jpda.tests.jdwp.share.JDWPUnitDebuggeeWrapper.openConnection(JDWPUnitDebuggeeWrapper.java:230)
	at org.apache.harmony.jpda.tests.jdwp.share.JDWPUnitDebuggeeWrapper.start(JDWPUnitDebuggeeWrapper.java:112)
	... 13 more

Test: testResumeClass: org.apache.harmony.jpda.tests.jdwp.MultiSession.ResumeTestorg.apache.harmony.jpda.tests.framework.TestErrorException:
org.apache.harmony.jpda.tests.framework.TestErrorException: org.apache.harmony.jpda.tests.framework.TestErrorException:
java.net.SocketTimeoutException: The operation timed out
	at org.apache.harmony.jpda.tests.jdwp.share.JDWPRawTestCase.setUp(JDWPRawTestCase.java:100)
Caused by: org.apache.harmony.jpda.tests.framework.TestErrorException: org.apache.harmony.jpda.tests.framework.TestErrorException:
java.net.SocketTimeoutException: The operation timed out
	at org.apache.harmony.jpda.tests.jdwp.share.JDWPUnitDebuggeeWrapper.start(JDWPUnitDebuggeeWrapper.java:117)
	at org.apache.harmony.jpda.tests.jdwp.share.JDWPTestCase.internalSetUp(JDWPTestCase.java:66)
	at org.apache.harmony.jpda.tests.jdwp.share.JDWPSyncTestCase.internalSetUp(JDWPSyncTestCase.java:55)
	at org.apache.harmony.jpda.tests.jdwp.share.JDWPRawTestCase.setUp(JDWPRawTestCase.java:94)
	... 9 more
Caused by: org.apache.harmony.jpda.tests.framework.TestErrorException: java.net.SocketTimeoutException:
The operation timed out
	at org.apache.harmony.jpda.tests.jdwp.share.JDWPUnitDebuggeeWrapper.openConnection(JDWPUnitDebuggeeWrapper.java:236)
	at org.apache.harmony.jpda.tests.jdwp.share.JDWPUnitDebuggeeWrapper.start(JDWPUnitDebuggeeWrapper.java:112)
	at org.apache.harmony.jpda.tests.jdwp.share.JDWPTestCase.internalSetUp(JDWPTestCase.java:66)
	... 12 more
Caused by: java.net.SocketTimeoutException: The operation timed out
	at org.apache.harmony.luni.net.PlainSocketImpl.read(PlainSocketImpl.java:545)
	at org.apache.harmony.luni.net.SocketInputStream.read(SocketInputStream.java:87)
	at org.apache.harmony.jpda.tests.framework.jdwp.SocketTransportWrapper.handshake(SocketTransportWrapper.java:298)
	at org.apache.harmony.jpda.tests.framework.jdwp.SocketTransportWrapper.attach(SocketTransportWrapper.java:183)
	at org.apache.harmony.jpda.tests.jdwp.share.JDWPUnitDebuggeeWrapper.openConnection(JDWPUnitDebuggeeWrapper.java:230)
	at org.apache.harmony.jpda.tests.jdwp.share.JDWPUnitDebuggeeWrapper.start(JDWPUnitDebuggeeWrapper.java:112)
	... 13 more

Test: testFrames002Class: org.apache.harmony.jpda.tests.jdwp.ThreadReference.FramesTestorg.apache.harmony.jpda.tests.framework.TestErrorException:
Debuggee process did not finish during timeout
	at org.apache.harmony.jpda.tests.jdwp.share.JDWPUnitDebuggeeWrapper.WaitForProcessExit(JDWPUnitDebuggeeWrapper.java:212)
	at org.apache.harmony.jpda.tests.jdwp.share.JDWPUnitDebuggeeWrapper.stop(JDWPUnitDebuggeeWrapper.java:131)
	at org.apache.harmony.jpda.tests.jdwp.share.JDWPTestCase.internalTearDown(JDWPTestCase.java:84)
	at org.apache.harmony.jpda.tests.jdwp.share.JDWPSyncTestCase.internalTearDown(JDWPSyncTestCase.java:75)
	at org.apache.harmony.jpda.tests.jdwp.share.JDWPRawTestCase.setUp(JDWPRawTestCase.java:99)
Caused by: java.lang.IllegalThreadStateException: process has not exited
	at java.lang.Runtime$SubProcess.exitValue(Runtime.java:357)
	at org.apache.harmony.jpda.tests.jdwp.share.JDWPUnitDebuggeeWrapper.WaitForProcessExit(JDWPUnitDebuggeeWrapper.java:207)
	at org.apache.harmony.jpda.tests.jdwp.share.JDWPUnitDebuggeeWrapper.stop(JDWPUnitDebuggeeWrapper.java:131)
	... 13 more

Test: testName001Class: org.apache.harmony.jpda.tests.jdwp.ThreadReference.NameTestorg.apache.harmony.jpda.tests.framework.TestErrorException:
Debuggee process did not finish during timeout
	at org.apache.harmony.jpda.tests.jdwp.share.JDWPUnitDebuggeeWrapper.WaitForProcessExit(JDWPUnitDebuggeeWrapper.java:212)
	at org.apache.harmony.jpda.tests.jdwp.share.JDWPUnitDebuggeeWrapper.stop(JDWPUnitDebuggeeWrapper.java:131)
	at org.apache.harmony.jpda.tests.jdwp.share.JDWPTestCase.internalTearDown(JDWPTestCase.java:84)
	at org.apache.harmony.jpda.tests.jdwp.share.JDWPSyncTestCase.internalTearDown(JDWPSyncTestCase.java:75)
	at org.apache.harmony.jpda.tests.jdwp.share.JDWPRawTestCase.setUp(JDWPRawTestCase.java:99)
Caused by: java.lang.IllegalThreadStateException: process has not exited
	at java.lang.Runtime$SubProcess.exitValue(Runtime.java:357)
	at org.apache.harmony.jpda.tests.jdwp.share.JDWPUnitDebuggeeWrapper.WaitForProcessExit(JDWPUnitDebuggeeWrapper.java:207)
	at org.apache.harmony.jpda.tests.jdwp.share.JDWPUnitDebuggeeWrapper.stop(JDWPUnitDebuggeeWrapper.java:131)
	... 13 more

Test: testResume001Class: org.apache.harmony.jpda.tests.jdwp.ThreadReference.ResumeTestorg.apache.harmony.jpda.tests.framework.TestErrorException:
Debuggee process did not finish during timeout
	at org.apache.harmony.jpda.tests.jdwp.share.JDWPUnitDebuggeeWrapper.WaitForProcessExit(JDWPUnitDebuggeeWrapper.java:212)
	at org.apache.harmony.jpda.tests.jdwp.share.JDWPUnitDebuggeeWrapper.stop(JDWPUnitDebuggeeWrapper.java:131)
	at org.apache.harmony.jpda.tests.jdwp.share.JDWPTestCase.internalTearDown(JDWPTestCase.java:84)
	at org.apache.harmony.jpda.tests.jdwp.share.JDWPSyncTestCase.internalTearDown(JDWPSyncTestCase.java:75)
	at org.apache.harmony.jpda.tests.jdwp.share.JDWPRawTestCase.setUp(JDWPRawTestCase.java:99)
Caused by: java.lang.IllegalThreadStateException: process has not exited
	at java.lang.Runtime$SubProcess.exitValue(Runtime.java:357)
	at org.apache.harmony.jpda.tests.jdwp.share.JDWPUnitDebuggeeWrapper.WaitForProcessExit(JDWPUnitDebuggeeWrapper.java:207)
	at org.apache.harmony.jpda.tests.jdwp.share.JDWPUnitDebuggeeWrapper.stop(JDWPUnitDebuggeeWrapper.java:131)
	... 13 more

Test: testHoldEvents001Class: org.apache.harmony.jpda.tests.jdwp.VirtualMachine.HoldEventsTestorg.apache.harmony.jpda.tests.framework.TestErrorException:
org.apache.harmony.jpda.tests.framework.TestErrorException: org.apache.harmony.jpda.tests.framework.TestErrorException:
java.net.SocketTimeoutException: The operation timed out
	at org.apache.harmony.jpda.tests.jdwp.share.JDWPRawTestCase.setUp(JDWPRawTestCase.java:100)
Caused by: org.apache.harmony.jpda.tests.framework.TestErrorException: org.apache.harmony.jpda.tests.framework.TestErrorException:
java.net.SocketTimeoutException: The operation timed out
	at org.apache.harmony.jpda.tests.jdwp.share.JDWPUnitDebuggeeWrapper.start(JDWPUnitDebuggeeWrapper.java:117)
	at org.apache.harmony.jpda.tests.jdwp.share.JDWPTestCase.internalSetUp(JDWPTestCase.java:66)
	at org.apache.harmony.jpda.tests.jdwp.share.JDWPSyncTestCase.internalSetUp(JDWPSyncTestCase.java:55)
	at org.apache.harmony.jpda.tests.jdwp.share.JDWPRawTestCase.setUp(JDWPRawTestCase.java:94)
	... 9 more
Caused by: org.apache.harmony.jpda.tests.framework.TestErrorException: java.net.SocketTimeoutException:
The operation timed out
	at org.apache.harmony.jpda.tests.jdwp.share.JDWPUnitDebuggeeWrapper.openConnection(JDWPUnitDebuggeeWrapper.java:236)
	at org.apache.harmony.jpda.tests.jdwp.share.JDWPUnitDebuggeeWrapper.start(JDWPUnitDebuggeeWrapper.java:112)
	at org.apache.harmony.jpda.tests.jdwp.share.JDWPTestCase.internalSetUp(JDWPTestCase.java:66)
	... 12 more
Caused by: java.net.SocketTimeoutException: The operation timed out
	at org.apache.harmony.luni.net.PlainSocketImpl.read(PlainSocketImpl.java:545)
	at org.apache.harmony.luni.net.SocketInputStream.read(SocketInputStream.java:87)
	at org.apache.harmony.jpda.tests.framework.jdwp.SocketTransportWrapper.handshake(SocketTransportWrapper.java:298)
	at org.apache.harmony.jpda.tests.framework.jdwp.SocketTransportWrapper.attach(SocketTransportWrapper.java:183)
	at org.apache.harmony.jpda.tests.jdwp.share.JDWPUnitDebuggeeWrapper.openConnection(JDWPUnitDebuggeeWrapper.java:230)
	at org.apache.harmony.jpda.tests.jdwp.share.JDWPUnitDebuggeeWrapper.start(JDWPUnitDebuggeeWrapper.java:112)
	... 13 more

Test: testIDSizes001Class: org.apache.harmony.jpda.tests.jdwp.VirtualMachine.IDSizesTestorg.apache.harmony.jpda.tests.framework.TestErrorException:
Debuggee process did not finish during timeout
	at org.apache.harmony.jpda.tests.jdwp.share.JDWPUnitDebuggeeWrapper.WaitForProcessExit(JDWPUnitDebuggeeWrapper.java:212)
	at org.apache.harmony.jpda.tests.jdwp.share.JDWPUnitDebuggeeWrapper.stop(JDWPUnitDebuggeeWrapper.java:131)
	at org.apache.harmony.jpda.tests.jdwp.share.JDWPTestCase.internalTearDown(JDWPTestCase.java:84)
	at org.apache.harmony.jpda.tests.jdwp.share.JDWPRawTestCase.setUp(JDWPRawTestCase.java:99)
Caused by: java.lang.IllegalThreadStateException: process has not exited
	at java.lang.Runtime$SubProcess.exitValue(Runtime.java:357)
	at org.apache.harmony.jpda.tests.jdwp.share.JDWPUnitDebuggeeWrapper.WaitForProcessExit(JDWPUnitDebuggeeWrapper.java:207)
	at org.apache.harmony.jpda.tests.jdwp.share.JDWPUnitDebuggeeWrapper.stop(JDWPUnitDebuggeeWrapper.java:131)
	... 12 more

Test: testRedefineClasses001Class: org.apache.harmony.jpda.tests.jdwp.VirtualMachine.RedefineClassesTestorg.apache.harmony.jpda.tests.framework.TestErrorException:
Debuggee process did not finish during timeout
	at org.apache.harmony.jpda.tests.jdwp.share.JDWPUnitDebuggeeWrapper.WaitForProcessExit(JDWPUnitDebuggeeWrapper.java:212)
	at org.apache.harmony.jpda.tests.jdwp.share.JDWPUnitDebuggeeWrapper.stop(JDWPUnitDebuggeeWrapper.java:131)
	at org.apache.harmony.jpda.tests.jdwp.share.JDWPTestCase.internalTearDown(JDWPTestCase.java:84)
	at org.apache.harmony.jpda.tests.jdwp.share.JDWPSyncTestCase.internalTearDown(JDWPSyncTestCase.java:75)
	at org.apache.harmony.jpda.tests.jdwp.share.JDWPRawTestCase.setUp(JDWPRawTestCase.java:99)
Caused by: java.lang.IllegalThreadStateException: process has not exited
	at java.lang.Runtime$SubProcess.exitValue(Runtime.java:357)
	at org.apache.harmony.jpda.tests.jdwp.share.JDWPUnitDebuggeeWrapper.WaitForProcessExit(JDWPUnitDebuggeeWrapper.java:207)
	at org.apache.harmony.jpda.tests.jdwp.share.JDWPUnitDebuggeeWrapper.stop(JDWPUnitDebuggeeWrapper.java:131)
	... 13 more

Test: testResume001Class: org.apache.harmony.jpda.tests.jdwp.VirtualMachine.ResumeTestorg.apache.harmony.jpda.tests.framework.TestErrorException:
Debuggee process did not finish during timeout
	at org.apache.harmony.jpda.tests.jdwp.share.JDWPUnitDebuggeeWrapper.WaitForProcessExit(JDWPUnitDebuggeeWrapper.java:212)
	at org.apache.harmony.jpda.tests.jdwp.share.JDWPUnitDebuggeeWrapper.stop(JDWPUnitDebuggeeWrapper.java:131)
	at org.apache.harmony.jpda.tests.jdwp.share.JDWPTestCase.internalTearDown(JDWPTestCase.java:84)
	at org.apache.harmony.jpda.tests.jdwp.share.JDWPSyncTestCase.internalTearDown(JDWPSyncTestCase.java:75)
	at org.apache.harmony.jpda.tests.jdwp.share.JDWPRawTestCase.setUp(JDWPRawTestCase.java:99)
Caused by: java.lang.IllegalThreadStateException: process has not exited
	at java.lang.Runtime$SubProcess.exitValue(Runtime.java:357)
	at org.apache.harmony.jpda.tests.jdwp.share.JDWPUnitDebuggeeWrapper.WaitForProcessExit(JDWPUnitDebuggeeWrapper.java:207)
	at org.apache.harmony.jpda.tests.jdwp.share.JDWPUnitDebuggeeWrapper.stop(JDWPUnitDebuggeeWrapper.java:131)
	... 13 more

Test: testSetDefaultStratum001Class: org.apache.harmony.jpda.tests.jdwp.VirtualMachine.SetDefaultStratumTestorg.apache.harmony.jpda.tests.framework.TestErrorException:
Debuggee process did not finish during timeout
	at org.apache.harmony.jpda.tests.jdwp.share.JDWPUnitDebuggeeWrapper.WaitForProcessExit(JDWPUnitDebuggeeWrapper.java:212)
	at org.apache.harmony.jpda.tests.jdwp.share.JDWPUnitDebuggeeWrapper.stop(JDWPUnitDebuggeeWrapper.java:131)
	at org.apache.harmony.jpda.tests.jdwp.share.JDWPTestCase.internalTearDown(JDWPTestCase.java:84)
	at org.apache.harmony.jpda.tests.jdwp.share.JDWPSyncTestCase.internalTearDown(JDWPSyncTestCase.java:75)
	at org.apache.harmony.jpda.tests.jdwp.share.JDWPRawTestCase.setUp(JDWPRawTestCase.java:99)
Caused by: java.lang.IllegalThreadStateException: process has not exited
	at java.lang.Runtime$SubProcess.exitValue(Runtime.java:357)
	at org.apache.harmony.jpda.tests.jdwp.share.JDWPUnitDebuggeeWrapper.WaitForProcessExit(JDWPUnitDebuggeeWrapper.java:207)
	at org.apache.harmony.jpda.tests.jdwp.share.JDWPUnitDebuggeeWrapper.stop(JDWPUnitDebuggeeWrapper.java:131)
	... 13 more

Test: testSuspend001Class: org.apache.harmony.jpda.tests.jdwp.VirtualMachine.SuspendTestorg.apache.harmony.jpda.tests.framework.TestErrorException:
Debuggee process did not finish during timeout
	at org.apache.harmony.jpda.tests.jdwp.share.JDWPUnitDebuggeeWrapper.WaitForProcessExit(JDWPUnitDebuggeeWrapper.java:212)
	at org.apache.harmony.jpda.tests.jdwp.share.JDWPUnitDebuggeeWrapper.stop(JDWPUnitDebuggeeWrapper.java:131)
	at org.apache.harmony.jpda.tests.jdwp.share.JDWPTestCase.internalTearDown(JDWPTestCase.java:84)
	at org.apache.harmony.jpda.tests.jdwp.share.JDWPSyncTestCase.internalTearDown(JDWPSyncTestCase.java:75)
	at org.apache.harmony.jpda.tests.jdwp.share.JDWPRawTestCase.setUp(JDWPRawTestCase.java:99)
Caused by: java.lang.IllegalThreadStateException: process has not exited
	at java.lang.Runtime$SubProcess.exitValue(Runtime.java:357)
	at org.apache.harmony.jpda.tests.jdwp.share.JDWPUnitDebuggeeWrapper.WaitForProcessExit(JDWPUnitDebuggeeWrapper.java:207)
	at org.apache.harmony.jpda.tests.jdwp.share.JDWPUnitDebuggeeWrapper.stop(JDWPUnitDebuggeeWrapper.java:131)
	... 13 more

Test: testTopLevelThreadGroups001Class: org.apache.harmony.jpda.tests.jdwp.VirtualMachine.TopLevelThreadGroupsTestorg.apache.harmony.jpda.tests.framework.TestErrorException:
Debuggee process did not finish during timeout
	at org.apache.harmony.jpda.tests.jdwp.share.JDWPUnitDebuggeeWrapper.WaitForProcessExit(JDWPUnitDebuggeeWrapper.java:212)
	at org.apache.harmony.jpda.tests.jdwp.share.JDWPUnitDebuggeeWrapper.stop(JDWPUnitDebuggeeWrapper.java:131)
	at org.apache.harmony.jpda.tests.jdwp.share.JDWPTestCase.internalTearDown(JDWPTestCase.java:84)
	at org.apache.harmony.jpda.tests.jdwp.share.JDWPSyncTestCase.internalTearDown(JDWPSyncTestCase.java:75)
	at org.apache.harmony.jpda.tests.jdwp.share.JDWPRawTestCase.setUp(JDWPRawTestCase.java:99)
Caused by: java.lang.IllegalThreadStateException: process has not exited
	at java.lang.Runtime$SubProcess.exitValue(Runtime.java:357)
	at org.apache.harmony.jpda.tests.jdwp.share.JDWPUnitDebuggeeWrapper.WaitForProcessExit(JDWPUnitDebuggeeWrapper.java:207)
	at org.apache.harmony.jpda.tests.jdwp.share.JDWPUnitDebuggeeWrapper.stop(JDWPUnitDebuggeeWrapper.java:131)
	... 13 more


***********************************************************
Modifications since last successful build:	(24)
            
modified varlax  /harmony/enhanced/classlib/trunk/modules/prefs/make/exclude.windows.x86_64.drl
06/07/2007 17:24:57 Updated x-lists:#HARMONY-3617org/apache/harmony/prefs/tests/java/util/prefs/AbstractPreferencesTest.java
modified varlax  /harmony/enhanced/classlib/trunk/modules/prefs/make/exclude.windows.x86.drl
06/07/2007 17:24:57 Updated x-lists:#HARMONY-3617org/apache/harmony/prefs/tests/java/util/prefs/AbstractPreferencesTest.java
modified ayza  /harmony/enhanced/classlib/trunk/modules/luni/src/main/native/launcher/shared/main.c
06/07/2007 17:16:25 Applying patch from HARMONY-3981 ([classlib][launcher] command line options
order should not matter)
modified varlax  /harmony/enhanced/classlib/trunk/modules/swing/make/exclude.windows.x86.drl
06/07/2007 11:54:36 Excluded tests:#HARMONY-3968javax/swing/text/html/FormViewTest.java#HARMONY-3969javax/swing/text/html/HTMLEditorKitTest.java
modified varlax  /harmony/enhanced/classlib/trunk/modules/swing/make/exclude.windows.x86.ibm
06/07/2007 11:54:36 Excluded tests:#HARMONY-3968javax/swing/text/html/FormViewTest.java#HARMONY-3969javax/swing/text/html/HTMLEditorKitTest.java
modified varlax  /harmony/enhanced/classlib/trunk/modules/swing/make/exclude.windows.x86_64.drl
06/07/2007 11:54:36 Excluded tests:#HARMONY-3968javax/swing/text/html/FormViewTest.java#HARMONY-3969javax/swing/text/html/HTMLEditorKitTest.java
added wjwashburn  /harmony/enhanced/drlvm/trunk/vm/tests/smoke/thread/InterruptWait.java 06/07/2007
00:40:15 harmony-3641 bug is fixed.  This patch substantially reducesthe rate of spurious
interrupts.  "build test2" passes for the most part
modified wjwashburn  /harmony/enhanced/drlvm/trunk/vm/thread/src/thread_native_interrupt.c
06/07/2007 00:40:15 harmony-3641 bug is fixed.  This patch substantially reducesthe rate of
spurious interrupts.  "build test2" passes for the most part
modified wjwashburn  /harmony/enhanced/drlvm/trunk/vm/thread/src/thread_native_fat_monitor.c
06/07/2007 00:40:15 harmony-3641 bug is fixed.  This patch substantially reducesthe rate of
spurious interrupts.  "build test2" passes for the most part
modified wjwashburn  /harmony/enhanced/drlvm/trunk/vm/include/open/hythread_ext.h 06/07/2007
00:40:15 harmony-3641 bug is fixed.  This patch substantially reducesthe rate of spurious
interrupts.  "build test2" passes for the most part
modified tellison  /harmony/enhanced/classlib/trunk/modules/jndi/src/main/java/org/apache/harmony/jndi/provider/rmi/registry/RegistryContext.java
06/06/2007 19:41:20 Apply patch HARMONY-4065 ([classlib] [jndi] Javadoc updates in org.apache.harmony.jndi.provider.rmi.registry.RegistryContext)
modified tellison  /harmony/enhanced/classlib/trunk/modules/beans/src/test/java/org/apache/harmony/beans/tests/java/beans/PropertyEditorManagerRegressionTest.java
06/06/2007 19:35:15 Apply patch HARMONY-4062 ([classlib][beans]org.apache.harmony.beans.editors.ColorEditor
lacks support for setAsText)
modified tellison  /harmony/enhanced/classlib/trunk/modules/beans/src/main/java/org/apache/harmony/beans/editors/ColorEditor.java
06/06/2007 19:35:15 Apply patch HARMONY-4062 ([classlib][beans]org.apache.harmony.beans.editors.ColorEditor
lacks support for setAsText)
modified tellison  /harmony/enhanced/classlib/trunk/modules/portlib/src/main/native/port/windows/hyfile.c
06/06/2007 19:27:18 Apply patch HARMONY-4012 ([classlib][luni] OSFileSystem.open can't open
system special files(nul))
modified tellison  /harmony/enhanced/classlib/trunk/modules/luni/src/test/java/tests/api/java/io/FileOutputStreamTest.java
06/06/2007 19:27:18 Apply patch HARMONY-4012 ([classlib][luni] OSFileSystem.open can't open
system special files(nul))
modified gshimansky  /harmony/enhanced/jdktools/trunk/modules/jpda/make/exclude.windows.x86.drl
06/06/2007 18:41:41 Applied HARMONY-4046 [jdktools][jpda] JDWP test fails on Windows: org.apache.harmony.jpda.tests.jdwp.ThreadReference.InterruptTest
modified tellison  /harmony/enhanced/classlib/trunk/modules/luni/src/main/java/java/util/Hashtable.java
06/06/2007 18:16:45 Apply patch HARMONY-4067 ([classlib][luni] java.util.Hashtable has a problem
with contains)
modified tellison  /harmony/enhanced/classlib/trunk/modules/luni/src/main/java/java/util/ArrayList.java
06/06/2007 18:08:59 Apply patch for HARMONY-4060 ([classlib][luni] Performance improvement
of java.util.ArrayList)
modified tellison  /harmony/enhanced/classlib/trunk/modules/luni/META-INF/MANIFEST.MF 06/06/2007
17:57:16 Add dependency on URLDecodingImageSource for LUNI.
modified tellison  /harmony/enhanced/classlib/trunk/modules/nio/src/main/java/org/apache/harmony/nio/internal/SocketChannelImpl.java
06/06/2007 17:13:53 Fix some minor compile warnings.
modified tellison  /harmony/enhanced/classlib/trunk/modules/nio/src/main/java/java/nio/MappedByteBufferAdapter.java
06/06/2007 17:13:53 Fix some minor compile warnings.
modified tellison  /harmony/enhanced/classlib/trunk/modules/nio/src/main/java/org/apache/harmony/nio/internal/ServerSocketChannelImpl.java
06/06/2007 17:13:53 Fix some minor compile warnings.
modified tellison  /harmony/enhanced/classlib/trunk/modules/nio/src/main/java/org/apache/harmony/nio/internal/DatagramChannelImpl.java
06/06/2007 17:13:53 Fix some minor compile warnings.
modified tellison  /harmony/enhanced/classlib/trunk/modules/luni/src/main/java/java/util/Collections.java
06/06/2007 17:04:23 Apply patch HARMONY-4061 ([classlib][luni] Performance improvement of
java.util.Collections)

Mime
View raw message