harmony-alerts mailing list archives

Site index · List index
Message view « Date » · « Thread »
Top « Date » · « Thread »
From nom...@intel.com
Subject [build-test alert] BUILD FAILED LINUX SUSE 9 x86_64: jdktools_test
Date Mon, 04 Jun 2007 12:25:57 GMT
BUILD FAILED:
	Ant Error Message:
/export/users/tst/cc/projects/trunk/working_jdktools/build.xml:242: The following error occurred
while executing this line: /export/users/tst/cc/projects/trunk/working_jdktools/make/build-test.xml:97:
There were test errors.

Date of build:	06/04/2007 19:09:01
Time to build:	16 minutes 31 seconds
Last changed:	06/04/2007 18:25:04
Last log entry:	Applied workaround from HARMONY-3314 [jdktools][jpda] DRLVM hangs on exit
while detaching thread



***********************************************************
Execution log (errors/warnings messages):	
Result: 1

========================================
Testing jdktools binaries...
========================================
Compiling JPDA tests
Since fork is false, ignoring memoryMaximumSize setting
----------
1. WARNING in /export/users/tst/cc/projects/trunk/working_jdktools/modules/jpda/test/common/unit/org/apache/harmony/jpda/tests/framework/DebuggeeRegister.java
 (at line 57)
	registered.add(debuggee); 
	^^^^^^^^^^^^^^^^^^^^^^^^
Type safety: The method add(Object) belongs to the raw type LinkedList. References to generic
type LinkedList<E> should be parameterized
----------
----------
2. WARNING in /export/users/tst/cc/projects/trunk/working_jdktools/modules/jpda/test/common/unit/org/apache/harmony/jpda/tests/framework/TestOptions.java
 (at line 28)
	import java.io.File;
	       ^^^^^^^^^^^^
The import java.io.File is never used
----------
----------
3. WARNING in /export/users/tst/cc/projects/trunk/working_jdktools/modules/jpda/test/common/unit/org/apache/harmony/jpda/tests/framework/jdwp/PacketDispatcher.java
 (at line 113)
	eventQueue.add(eventPacket);
	^^^^^^^^^^^^^^^^^^^^^^^^^^^
Type safety: The method add(Object) belongs to the raw type List. References to generic type
List<E> should be parameterized
----------
4. WARNING in /export/users/tst/cc/projects/trunk/working_jdktools/modules/jpda/test/common/unit/org/apache/harmony/jpda/tests/framework/jdwp/PacketDispatcher.java
 (at line 248)
	replies.put(new Integer(replyPacket.getId()),
                                replyPacket);
	^^^^^^^^^^^^^^^^^^^^^^^^^^^^^^^^^^^^^^^^^^^^^^^^^^^^^^^^^^^^^^^^^^^^^^^^^^^^^^^^^^^^^^^^^^
Type safety: The method put(Object, Object) belongs to the raw type Hashtable. References
to generic type Hashtable<K,V> should be parameterized
----------
5. WARNING in /export/users/tst/cc/projects/trunk/working_jdktools/modules/jpda/test/common/unit/org/apache/harmony/jpda/tests/framework/jdwp/PacketDispatcher.java
 (at line 283)
	commands.put(Id, command);
	^^^^^^^^^^^^^^^^^^^^^^^^^
Type safety: The method put(Object, Object) belongs to the raw type Hashtable. References
to generic type Hashtable<K,V> should be parameterized
----------
6. WARNING in /export/users/tst/cc/projects/trunk/working_jdktools/modules/jpda/test/common/unit/org/apache/harmony/jpda/tests/framework/jdwp/PacketDispatcher.java
 (at line 354)
	commands.put(Id, command);
	^^^^^^^^^^^^^^^^^^^^^^^^^
Type safety: The method put(Object, Object) belongs to the raw type Hashtable. References
to generic type Hashtable<K,V> should be parameterized
----------
----------
7. WARNING in /export/users/tst/cc/projects/trunk/working_jdktools/modules/jpda/test/common/unit/org/apache/harmony/jpda/tests/framework/jdwp/VmMirror.java
 (at line 1829)
	frames.add(frame);
	^^^^^^^^^^^^^^^^^
Type safety: The method add(Object) belongs to the raw type ArrayList. References to generic
type ArrayList<E> should be parameterized
----------
8. WARNING in /export/users/tst/cc/projects/trunk/working_jdktools/modules/jpda/test/common/unit/org/apache/harmony/jpda/tests/framework/jdwp/VmMirror.java
 (at line 1897)
	vars.add(var);
	^^^^^^^^^^^^^
Type safety: The method add(Object) belongs to the raw type ArrayList. References to generic
type ArrayList<E> should be parameterized
----------
9. WARNING in /export/users/tst/cc/projects/trunk/working_jdktools/modules/jpda/test/common/unit/org/apache/harmony/jpda/tests/framework/jdwp/VmMirror.java
 (at line 2117)
	fields.add(superClassFields.toArray()[i]);
	^^^^^^^^^^^^^^^^^^^^^^^^^^^^^^^^^^^^^^^^^
Type safety: The method add(Object) belongs to the raw type ArrayList. References to generic
type ArrayList<E> should be parameterized
----------
10. WARNING in /export/users/tst/cc/projects/trunk/working_jdktools/modules/jpda/test/common/unit/org/apache/harmony/jpda/tests/framework/jdwp/VmMirror.java
 (at line 2127)
	fields.add(field);
	^^^^^^^^^^^^^^^^^
Type safety: The method add(Object) belongs to the raw type ArrayList. References to generic
type ArrayList<E> should be parameterized
----------
----------
11. WARNING in /export/users/tst/cc/projects/trunk/working_jdktools/modules/jpda/test/common/unit/org/apache/harmony/jpda/tests/jdwp/Events/ExceptionTest.java
 (at line 187)
	long frameID = reply.getNextValueAsFrameID();
	     ^^^^^^^
The local variable frameID is never read
----------
----------
12. WARNING in /export/users/tst/cc/projects/trunk/working_jdktools/modules/jpda/test/common/unit/org/apache/harmony/jpda/tests/jdwp/ThreadReference/FramesTest.java
 (at line 449)
	frames.add(new FrameStruct(frameID, loc));
	^^^^^^^^^^^^^^^^^^^^^^^^^^^^^^^^^^^^^^^^^
Type safety: The method add(Object) belongs to the raw type Vector. References to generic
type Vector<E> should be parameterized
----------
12 problems (12 warnings)
JPDA exclude list: /export/users/tst/cc/projects/trunk/working_classlib/deploy/build/jdktools.jpda.exclude
Running JPDA tests
  Debugger JVM=/export/users/tst/cc/projects/trunk/target/hdk/jdk/jre/bin/java
  Debuggee JVM=/export/users/tst/cc/projects/trunk/target/hdk/jdk/jre/bin/java
The GC did not provide gc_add_weak_root_set_entry()
SAMSA exclude list: /export/users/tst/cc/projects/trunk/working_classlib/deploy/build/jdktools.samsa.exclude
Running SAMSA tests
test.jre.home=/export/users/tst/cc/projects/trunk/target/hdk/jdk/jre
Run jdk/bin/java -version in /export/users/tst/cc/projects/trunk/working_jdktools/build/test_report
java version "1.5.0" 
pre-alpha : not complete or compatible
svn = r544123, (Jun  4 2007), Linux/em64t/gcc 3.3.3, release build
http://harmony.apache.org
Run jdk/bin/javac -version in /export/users/tst/cc/projects/trunk/working_jdktools/build/test_report
Run jdk/bin/javah in /export/users/tst/cc/projects/trunk/working_jdktools/build/test_report
Run jdk/bin/jarsigner in /export/users/tst/cc/projects/trunk/working_jdktools/build/test_report
Run jdk/bin/keytool -help in /export/users/tst/cc/projects/trunk/working_jdktools/build/test_report
Compiling TOOLS tests
Since fork is false, ignoring memoryMaximumSize setting
----------
1. WARNING in /export/users/tst/cc/projects/trunk/working_jdktools/modules/tools/src/test/java/org/apache/harmony/tests/tools/javah/Test/Test01.java
 (at line 23)
	private static final long xxx2 = 1;
	                          ^^^^
The field Test01.xxx2 is never read locally
----------
1 problem (1 warning)
TOOLS exclude list: /export/users/tst/cc/projects/trunk/working_classlib/deploy/build/jdktools.tools.exclude
Running TOOLS tests
test.jre.home=/export/users/tst/cc/projects/trunk/target/hdk/jdk/jre
The GC did not provide gc_add_weak_root_set_entry()
The test report is in /export/users/tst/cc/projects/trunk/working_jdktools/build/test_report/html/index.html

***********************************************************
Unit Tests: (136)
        
error: testClassesBySignature001 org.apache.harmony.jpda.tests.jdwp.VirtualMachine.ClassesBySignatureTest
Unit Test Error Details:	(1)
                
Test: testClassesBySignature001Class: org.apache.harmony.jpda.tests.jdwp.VirtualMachine.ClassesBySignatureTestorg.apache.harmony.jpda.tests.framework.TestErrorException:
Debuggee process did not finish during timeout
	at org.apache.harmony.jpda.tests.jdwp.share.JDWPUnitDebuggeeWrapper.WaitForProcessExit(JDWPUnitDebuggeeWrapper.java:212)
	at org.apache.harmony.jpda.tests.jdwp.share.JDWPUnitDebuggeeWrapper.stop(JDWPUnitDebuggeeWrapper.java:131)
	at org.apache.harmony.jpda.tests.jdwp.share.JDWPTestCase.internalTearDown(JDWPTestCase.java:84)
	at org.apache.harmony.jpda.tests.jdwp.share.JDWPSyncTestCase.internalTearDown(JDWPSyncTestCase.java:75)
	at org.apache.harmony.jpda.tests.jdwp.share.JDWPRawTestCase.tearDown(JDWPRawTestCase.java:110)
Caused by: java.lang.IllegalThreadStateException: process has not exited
	at java.lang.Runtime$SubProcess.exitValue(Runtime.java:357)
	at org.apache.harmony.jpda.tests.jdwp.share.JDWPUnitDebuggeeWrapper.WaitForProcessExit(JDWPUnitDebuggeeWrapper.java:207)
	at org.apache.harmony.jpda.tests.jdwp.share.JDWPUnitDebuggeeWrapper.stop(JDWPUnitDebuggeeWrapper.java:131)
	... 13 more


***********************************************************
Modifications since last successful build:	(22)
            
modified gshimansky  /harmony/enhanced/jdktools/trunk/modules/jpda/src/main/native/jdwp/common/agent/core/EventDispatcher.cpp
06/04/2007 18:25:04 Applied workaround from HARMONY-3314 [jdktools][jpda] DRLVM hangs on exit
while detaching thread
modified gshimansky  /harmony/enhanced/jdktools/trunk/modules/jpda/test/common/unit/org/apache/harmony/jpda/tests/jdwp/share/JDWPUnitDebuggeeWrapper.java
06/04/2007 18:25:04 Applied workaround from HARMONY-3314 [jdktools][jpda] DRLVM hangs on exit
while detaching thread
modified gshimansky  /harmony/enhanced/jdktools/trunk/modules/jpda/src/main/native/jdwp/common/agent/core/EventDispatcher.h
06/04/2007 18:25:04 Applied workaround from HARMONY-3314 [jdktools][jpda] DRLVM hangs on exit
while detaching thread
modified gshimansky  /harmony/enhanced/jdktools/trunk/modules/jpda/src/main/native/jdwp/common/agent/core/PacketDispatcher.cpp
06/04/2007 18:25:04 Applied workaround from HARMONY-3314 [jdktools][jpda] DRLVM hangs on exit
while detaching thread
modified gshimansky  /harmony/enhanced/jdktools/trunk/modules/jpda/src/main/native/jdwp/common/agent/core/ThreadManager.cpp
06/04/2007 18:25:04 Applied workaround from HARMONY-3314 [jdktools][jpda] DRLVM hangs on exit
while detaching thread
modified gshimansky  /harmony/enhanced/jdktools/trunk/modules/jpda/src/main/native/jdwp/common/agent/core/PacketDispatcher.h
06/04/2007 18:25:04 Applied workaround from HARMONY-3314 [jdktools][jpda] DRLVM hangs on exit
while detaching thread
modified gshimansky  /harmony/enhanced/jdktools/trunk/modules/jpda/src/main/native/jdwp/common/agent/core/ThreadManager.h
06/04/2007 18:25:04 Applied workaround from HARMONY-3314 [jdktools][jpda] DRLVM hangs on exit
while detaching thread
modified gshimansky  /harmony/enhanced/jdktools/trunk/modules/jpda/src/main/native/jdwp/common/agent/core/TransportManager.cpp
06/04/2007 18:25:04 Applied workaround from HARMONY-3314 [jdktools][jpda] DRLVM hangs on exit
while detaching thread
modified varlax  /harmony/enhanced/drlvm/trunk/vm/jitrino/src/jet/jet.cpp 06/04/2007 17:33:21
Postfix to HARMONY-4010.
modified tellison  /harmony/enhanced/jdktools/trunk/modules/jpda/test/common/unit/org/apache/harmony/jpda/tests/jdwp/ThreadReference/OwnedMonitorsTest.java
06/04/2007 16:48:16 Apply patch HARMOMY-4002 ([jdktools][jpda] JDWP test org.apache.harmony.jpda.tests.jdwp.ThreadReference.OwnedMonitorsTest
is ambigous)
modified tellison  /harmony/enhanced/jdktools/trunk/modules/jpda/make/exclude.common 06/04/2007
16:48:16 Apply patch HARMOMY-4002 ([jdktools][jpda] JDWP test org.apache.harmony.jpda.tests.jdwp.ThreadReference.OwnedMonitorsTest
is ambigous)
modified varlax  /harmony/enhanced/drlvm/trunk/vm/jitrino/src/codegenerator/ipf/IpfCodeGenerator.cpp
06/04/2007 16:29:18 Fixed IPF compilation
modified varlax  /harmony/enhanced/drlvm/trunk/vm/jitrino/src/codegenerator/ipf/IpfIrPrinter.cpp
06/04/2007 16:29:18 Fixed IPF compilation
added ayza  /harmony/enhanced/classlib/trunk/support/src/test/java/tests/resources/Harmony.png
06/04/2007 16:07:19 Applying patch and test for HARMONY-1718 ([classlib][luni] Junit AWTRunner
there is no JU icon on the window title)
added ayza  /harmony/enhanced/classlib/trunk/modules/luni/src/main/java/org/apache/harmony/luni/internal/net/www/content
06/04/2007 16:07:19 Applying patch and test for HARMONY-1718 ([classlib][luni] Junit AWTRunner
there is no JU icon on the window title)
added ayza  /harmony/enhanced/classlib/trunk/modules/luni/src/main/java/org/apache/harmony/luni/internal/net/www/content/image
06/04/2007 16:07:19 Applying patch and test for HARMONY-1718 ([classlib][luni] Junit AWTRunner
there is no JU icon on the window title)
modified ayza  /harmony/enhanced/classlib/trunk/modules/luni/src/test/java/tests/api/java/net/URLTest.java
06/04/2007 16:07:19 Applying patch and test for HARMONY-1718 ([classlib][luni] Junit AWTRunner
there is no JU icon on the window title)
added ayza  /harmony/enhanced/classlib/trunk/support/src/test/java/tests/resources/Harmony.jpg
06/04/2007 16:07:19 Applying patch and test for HARMONY-1718 ([classlib][luni] Junit AWTRunner
there is no JU icon on the window title)
added ayza  /harmony/enhanced/classlib/trunk/modules/luni/src/main/java/org/apache/harmony/luni/internal/net/www/content/image/png.java
06/04/2007 16:07:19 Applying patch and test for HARMONY-1718 ([classlib][luni] Junit AWTRunner
there is no JU icon on the window title)
added ayza  /harmony/enhanced/classlib/trunk/modules/luni/src/main/java/org/apache/harmony/luni/internal/net/www/content/image/gif.java
06/04/2007 16:07:19 Applying patch and test for HARMONY-1718 ([classlib][luni] Junit AWTRunner
there is no JU icon on the window title)
added ayza  /harmony/enhanced/classlib/trunk/modules/luni/src/main/java/org/apache/harmony/luni/internal/net/www/content/image/jpeg.java
06/04/2007 16:07:19 Applying patch and test for HARMONY-1718 ([classlib][luni] Junit AWTRunner
there is no JU icon on the window title)
modified tellison  /harmony/enhanced/classlib/trunk/THIRD_PARTY_NOTICES.txt 06/04/2007 15:14:50
Update MX4J version number, and remove duplication.

Mime
View raw message