harmony-alerts mailing list archives: May 2007

Site index · List index
Message list1 · 2 · Next »Thread · Author · Date
[build-test alert] BUILD FAILED Linux SUSE 9 64bit gcc debug: classlib over drlvm
nom...@intel.com   [build-test alert] BUILD FAILED Linux SUSE 9 64bit gcc debug: classlib over drlvm Tue, 01 May, 09:02
nom...@intel.com   [build-test alert] BUILD FAILED Linux SUSE 9 64bit gcc debug: classlib over drlvm Wed, 02 May, 12:08
nom...@intel.com   [build-test alert] BUILD FAILED Linux SUSE 9 64bit gcc debug: classlib over drlvm Fri, 11 May, 10:38
nom...@intel.com   [build-test alert] BUILD FAILED Linux SUSE 9 64bit gcc debug: classlib over drlvm Tue, 15 May, 10:41
nom...@intel.com   [build-test alert] BUILD FAILED Linux SUSE 9 64bit gcc debug: classlib over drlvm Wed, 16 May, 14:23
nom...@intel.com   [build-test alert] BUILD FAILED Linux SUSE 9 64bit gcc debug: classlib over drlvm Thu, 17 May, 14:32
nom...@intel.com   [build-test alert] BUILD FAILED Linux SUSE 9 64bit gcc debug: classlib over drlvm Wed, 23 May, 14:56
nom...@intel.com   [build-test alert] BUILD FAILED Linux SUSE 9 64bit gcc debug: classlib over drlvm Wed, 23 May, 22:49
nom...@intel.com   [build-test alert] BUILD FAILED Linux SUSE 9 64bit gcc debug: classlib over drlvm Fri, 25 May, 08:22
nom...@intel.com   [build-test alert] BUILD FAILED Linux SUSE 9 64bit gcc debug: classlib over drlvm Mon, 28 May, 04:37
nom...@intel.com   [build-test alert] BUILD FAILED Linux SUSE 9 64bit gcc debug: classlib over drlvm Tue, 29 May, 16:47
[build-test alert] BUILD FAILED Windows 2003 x86_64 msvc debug: classlib tests
nom...@intel.com   [build-test alert] BUILD FAILED Windows 2003 x86_64 msvc debug: classlib tests Tue, 01 May, 09:33
nom...@intel.com   [build-test alert] BUILD FAILED Windows 2003 x86_64 msvc debug: classlib tests Thu, 03 May, 01:59
nom...@intel.com   [build-test alert] BUILD FAILED Windows 2003 x86_64 msvc debug: classlib tests Mon, 07 May, 13:30
nom...@intel.com   [build-test alert] BUILD FAILED Windows 2003 x86_64 msvc debug: classlib tests Wed, 09 May, 01:40
nom...@intel.com   [build-test alert] BUILD FAILED Windows 2003 x86_64 msvc debug: classlib tests Thu, 10 May, 07:17
nom...@intel.com   [build-test alert] BUILD FAILED Windows 2003 x86_64 msvc debug: classlib tests Tue, 15 May, 10:53
nom...@intel.com   [build-test alert] BUILD FAILED Windows 2003 x86_64 msvc debug: classlib tests Thu, 17 May, 17:46
nom...@intel.com   [build-test alert] BUILD FAILED Windows 2003 x86_64 msvc debug: classlib tests Tue, 29 May, 14:03
[build-test alert] BUILD FAILED Linux SUSE 9 64bit gcc debug: drlvm tests
nom...@intel.com   [build-test alert] BUILD FAILED Linux SUSE 9 64bit gcc debug: drlvm tests Tue, 01 May, 10:32
nom...@intel.com   [build-test alert] BUILD FAILED Linux SUSE 9 64bit gcc debug: drlvm tests Wed, 02 May, 08:10
nom...@intel.com   [build-test alert] BUILD FAILED Linux SUSE 9 64bit gcc debug: drlvm tests Thu, 03 May, 01:46
nom...@intel.com   [build-test alert] BUILD FAILED Linux SUSE 9 64bit gcc debug: drlvm tests Fri, 04 May, 04:29
nom...@intel.com   [build-test alert] BUILD FAILED Linux SUSE 9 64bit gcc debug: drlvm tests Fri, 04 May, 12:30
nom...@intel.com   [build-test alert] BUILD FAILED Linux SUSE 9 64bit gcc debug: drlvm tests Sat, 05 May, 00:50
nom...@intel.com   [build-test alert] BUILD FAILED Linux SUSE 9 64bit gcc debug: drlvm tests Sat, 05 May, 13:49
nom...@intel.com   [build-test alert] BUILD FAILED Linux SUSE 9 64bit gcc debug: drlvm tests Sat, 05 May, 22:38
nom...@intel.com   [build-test alert] BUILD FAILED Linux SUSE 9 64bit gcc debug: drlvm tests Sun, 06 May, 05:31
nom...@intel.com   [build-test alert] BUILD FAILED Linux SUSE 9 64bit gcc debug: drlvm tests Sun, 06 May, 14:19
nom...@intel.com   [build-test alert] BUILD FAILED Linux SUSE 9 64bit gcc debug: drlvm tests Mon, 07 May, 12:47
nom...@intel.com   [build-test alert] BUILD FAILED Linux SUSE 9 64bit gcc debug: drlvm tests Tue, 08 May, 03:13
nom...@intel.com   [build-test alert] BUILD FAILED Linux SUSE 9 64bit gcc debug: drlvm tests Tue, 08 May, 09:04
nom...@intel.com   [build-test alert] BUILD FAILED Linux SUSE 9 64bit gcc debug: drlvm tests Wed, 09 May, 12:11
nom...@intel.com   [build-test alert] BUILD FAILED Linux SUSE 9 64bit gcc debug: drlvm tests Thu, 10 May, 09:08
nom...@intel.com   [build-test alert] BUILD FAILED Linux SUSE 9 64bit gcc debug: drlvm tests Thu, 10 May, 16:11
nom...@intel.com   [build-test alert] BUILD FAILED Linux SUSE 9 64bit gcc debug: drlvm tests Fri, 11 May, 04:15
nom...@intel.com   [build-test alert] BUILD FAILED Linux SUSE 9 64bit gcc debug: drlvm tests Fri, 11 May, 11:51
nom...@intel.com   [build-test alert] BUILD FAILED Linux SUSE 9 64bit gcc debug: drlvm tests Mon, 14 May, 13:11
nom...@intel.com   [build-test alert] BUILD FAILED Linux SUSE 9 64bit gcc debug: drlvm tests Mon, 14 May, 18:01
nom...@intel.com   [build-test alert] BUILD FAILED Linux SUSE 9 64bit gcc debug: drlvm tests Tue, 15 May, 04:26
nom...@intel.com   [build-test alert] BUILD FAILED Linux SUSE 9 64bit gcc debug: drlvm tests Tue, 15 May, 09:30
nom...@intel.com   [build-test alert] BUILD FAILED Linux SUSE 9 64bit gcc debug: drlvm tests Tue, 15 May, 14:19
nom...@intel.com   [build-test alert] BUILD FAILED Linux SUSE 9 64bit gcc debug: drlvm tests Tue, 15 May, 18:58
nom...@intel.com   [build-test alert] BUILD FAILED Linux SUSE 9 64bit gcc debug: drlvm tests Wed, 16 May, 11:48
nom...@intel.com   [build-test alert] BUILD FAILED Linux SUSE 9 64bit gcc debug: drlvm tests Wed, 16 May, 14:24
nom...@intel.com   [build-test alert] BUILD FAILED Linux SUSE 9 64bit gcc debug: drlvm tests Wed, 16 May, 20:50
nom...@intel.com   [build-test alert] BUILD FAILED Linux SUSE 9 64bit gcc debug: drlvm tests Thu, 17 May, 11:05
nom...@intel.com   [build-test alert] BUILD FAILED Linux SUSE 9 64bit gcc debug: drlvm tests Fri, 18 May, 06:15
nom...@intel.com   [build-test alert] BUILD FAILED Linux SUSE 9 64bit gcc debug: drlvm tests Fri, 18 May, 18:47
nom...@intel.com   [build-test alert] BUILD FAILED Linux SUSE 9 64bit gcc debug: drlvm tests Sat, 19 May, 00:30
nom...@intel.com   [build-test alert] BUILD FAILED Linux SUSE 9 64bit gcc debug: drlvm tests Sat, 19 May, 09:37
nom...@intel.com   [build-test alert] BUILD FAILED Linux SUSE 9 64bit gcc debug: drlvm tests Sat, 19 May, 20:45
nom...@intel.com   [build-test alert] BUILD FAILED Linux SUSE 9 64bit gcc debug: drlvm tests Mon, 21 May, 04:56
nom...@intel.com   [build-test alert] BUILD FAILED Linux SUSE 9 64bit gcc debug: drlvm tests Mon, 21 May, 12:37
nom...@intel.com   [build-test alert] BUILD FAILED Linux SUSE 9 64bit gcc debug: drlvm tests Mon, 21 May, 22:10
nom...@intel.com   [build-test alert] BUILD FAILED Linux SUSE 9 64bit gcc debug: drlvm tests Tue, 22 May, 08:32
nom...@intel.com   [build-test alert] BUILD FAILED Linux SUSE 9 64bit gcc debug: drlvm tests Tue, 22 May, 19:13
nom...@intel.com   [build-test alert] BUILD FAILED Linux SUSE 9 64bit gcc debug: drlvm tests Wed, 23 May, 00:52
nom...@intel.com   [build-test alert] BUILD FAILED Linux SUSE 9 64bit gcc debug: drlvm tests Wed, 23 May, 08:35
nom...@intel.com   [build-test alert] BUILD FAILED Linux SUSE 9 64bit gcc debug: drlvm tests Wed, 23 May, 16:04
nom...@intel.com   [build-test alert] BUILD FAILED Linux SUSE 9 64bit gcc debug: drlvm tests Thu, 24 May, 04:23
nom...@intel.com   [build-test alert] BUILD FAILED Linux SUSE 9 64bit gcc debug: drlvm tests Thu, 24 May, 09:32
nom...@intel.com   [build-test alert] BUILD FAILED Linux SUSE 9 64bit gcc debug: drlvm tests Thu, 24 May, 18:32
nom...@intel.com   [build-test alert] BUILD FAILED Linux SUSE 9 64bit gcc debug: drlvm tests Fri, 25 May, 07:35
nom...@intel.com   [build-test alert] BUILD FAILED Linux SUSE 9 64bit gcc debug: drlvm tests Mon, 28 May, 08:24
nom...@intel.com   [build-test alert] BUILD FAILED Linux SUSE 9 64bit gcc debug: drlvm tests Mon, 28 May, 21:32
nom...@intel.com   [build-test alert] BUILD FAILED Linux SUSE 9 64bit gcc debug: drlvm tests Wed, 30 May, 06:19
nom...@intel.com   [build-test alert] BUILD FAILED Linux SUSE 9 64bit gcc debug: drlvm tests Wed, 30 May, 12:51
[continuum] BUILD FAILURE: Classlib/linux.ia32 Build/Test
nom...@hursley.ibm.com   [continuum] BUILD FAILURE: Classlib/linux.ia32 Build/Test Tue, 01 May, 10:38
nom...@hursley.ibm.com   [continuum] BUILD FAILURE: Classlib/linux.ia32 Build/Test Tue, 01 May, 12:17
nom...@hursley.ibm.com   [continuum] BUILD FAILURE: Classlib/linux.ia32 Build/Test Tue, 01 May, 13:58
nom...@hursley.ibm.com   [continuum] BUILD FAILURE: Classlib/linux.ia32 Build/Test Wed, 02 May, 07:24
nom...@hursley.ibm.com   [continuum] BUILD FAILURE: Classlib/linux.ia32 Build/Test Wed, 02 May, 10:40
nom...@hursley.ibm.com   [continuum] BUILD FAILURE: Classlib/linux.ia32 Build/Test Wed, 02 May, 12:24
nom...@hursley.ibm.com   [continuum] BUILD FAILURE: Classlib/linux.ia32 Build/Test Wed, 02 May, 13:59
nom...@hursley.ibm.com   [continuum] BUILD FAILURE: Classlib/linux.ia32 Build/Test Wed, 02 May, 15:07
nom...@hursley.ibm.com   [continuum] BUILD FAILURE: Classlib/linux.ia32 Build/Test Wed, 02 May, 17:08
nom...@hursley.ibm.com   [continuum] BUILD FAILURE: Classlib/linux.ia32 Build/Test Wed, 02 May, 18:43
nom...@hursley.ibm.com   [continuum] BUILD FAILURE: Classlib/linux.ia32 Build/Test Wed, 02 May, 18:52
nom...@hursley.ibm.com   [continuum] BUILD FAILURE: Classlib/linux.ia32 Build/Test Thu, 03 May, 08:18
nom...@hursley.ibm.com   [continuum] BUILD FAILURE: Classlib/linux.ia32 Build/Test Thu, 03 May, 11:25
nom...@hursley.ibm.com   [continuum] BUILD FAILURE: Classlib/linux.ia32 Build/Test Sat, 05 May, 22:32
nom...@hursley.ibm.com   [continuum] BUILD FAILURE: Classlib/linux.ia32 Build/Test Tue, 08 May, 14:14
nom...@hursley.ibm.com   [continuum] BUILD FAILURE: Classlib/linux.ia32 Build/Test Thu, 10 May, 14:02
nom...@hursley.ibm.com   [continuum] BUILD FAILURE: Classlib/linux.ia32 Build/Test Fri, 11 May, 22:20
nom...@hursley.ibm.com   [continuum] BUILD FAILURE: Classlib/linux.ia32 Build/Test Tue, 15 May, 12:14
nom...@hursley.ibm.com   [continuum] BUILD FAILURE: Classlib/linux.ia32 Build/Test Tue, 15 May, 17:24
nom...@hursley.ibm.com   [continuum] BUILD FAILURE: Classlib/linux.ia32 Build/Test Sat, 19 May, 13:23
nom...@hursley.ibm.com   [continuum] BUILD FAILURE: Classlib/linux.ia32 Build/Test Mon, 21 May, 15:11
nom...@hursley.ibm.com   [continuum] BUILD FAILURE: Classlib/linux.ia32 Build/Test Tue, 22 May, 00:04
nom...@hursley.ibm.com   [continuum] BUILD FAILURE: Classlib/linux.ia32 Build/Test Wed, 23 May, 08:24
nom...@hursley.ibm.com   [continuum] BUILD FAILURE: Classlib/linux.ia32 Build/Test Fri, 25 May, 01:23
nom...@hursley.ibm.com   [continuum] BUILD FAILURE: Classlib/linux.ia32 Build/Test Tue, 29 May, 21:27
nom...@hursley.ibm.com   [continuum] BUILD FAILURE: Classlib/linux.ia32 Build/Test Thu, 31 May, 00:24
nom...@hursley.ibm.com   [continuum] BUILD FAILURE: Classlib/linux.ia32 Build/Test Thu, 31 May, 09:47
[build-test alert] BUILD FAILED Windows XP SP2 msvc debug: classlib over drlvm
nom...@intel.com   [build-test alert] BUILD FAILED Windows XP SP2 msvc debug: classlib over drlvm Tue, 01 May, 11:44
nom...@intel.com   [build-test alert] BUILD FAILED Windows XP SP2 msvc debug: classlib over drlvm Wed, 02 May, 13:08
nom...@intel.com   [build-test alert] BUILD FAILED Windows XP SP2 msvc debug: classlib over drlvm Fri, 11 May, 12:02
nom...@intel.com   [build-test alert] BUILD FAILED Windows XP SP2 msvc debug: classlib over drlvm Tue, 15 May, 13:12
nom...@intel.com   [build-test alert] BUILD FAILED Windows XP SP2 msvc debug: classlib over drlvm Thu, 24 May, 04:44
nom...@intel.com   [build-test alert] BUILD FAILED Windows XP SP2 msvc debug: classlib over drlvm Thu, 24 May, 13:04
nom...@intel.com   [build-test alert] BUILD FAILED Windows XP SP2 msvc debug: classlib over drlvm Fri, 25 May, 05:50
nom...@intel.com   [build-test alert] BUILD FAILED Windows XP SP2 msvc debug: classlib over drlvm Tue, 29 May, 09:54
[build-test alert] BUILD FAILED Linux SUSE 9 gcc debug: classlib over drlvm
nom...@intel.com   [build-test alert] BUILD FAILED Linux SUSE 9 gcc debug: classlib over drlvm Tue, 01 May, 11:47
nom...@intel.com   [build-test alert] BUILD FAILED Linux SUSE 9 gcc debug: classlib over drlvm Thu, 03 May, 01:43
nom...@intel.com   [build-test alert] BUILD FAILED Linux SUSE 9 gcc debug: classlib over drlvm Mon, 07 May, 11:21
nom...@intel.com   [build-test alert] BUILD FAILED Linux SUSE 9 gcc debug: classlib over drlvm Wed, 09 May, 11:36
nom...@intel.com   [build-test alert] BUILD FAILED Linux SUSE 9 gcc debug: classlib over drlvm Thu, 10 May, 07:36
nom...@intel.com   [build-test alert] BUILD FAILED Linux SUSE 9 gcc debug: classlib over drlvm Fri, 11 May, 12:24
nom...@intel.com   [build-test alert] BUILD FAILED Linux SUSE 9 gcc debug: classlib over drlvm Tue, 15 May, 09:50
nom...@intel.com   [build-test alert] BUILD FAILED Linux SUSE 9 gcc debug: classlib over drlvm Wed, 23 May, 14:31
nom...@intel.com   [build-test alert] BUILD FAILED Linux SUSE 9 gcc debug: classlib over drlvm Tue, 29 May, 16:33
[build-test alert] BUILD SUCCEEDED Linux SUSE 9 64bit gcc debug: drlvm tests
nom...@intel.com   [build-test alert] BUILD SUCCEEDED Linux SUSE 9 64bit gcc debug: drlvm tests Tue, 01 May, 12:14
nom...@intel.com   [build-test alert] BUILD SUCCEEDED Linux SUSE 9 64bit gcc debug: drlvm tests Wed, 02 May, 11:43
nom...@intel.com   [build-test alert] BUILD SUCCEEDED Linux SUSE 9 64bit gcc debug: drlvm tests Fri, 04 May, 02:09
nom...@intel.com   [build-test alert] BUILD SUCCEEDED Linux SUSE 9 64bit gcc debug: drlvm tests Fri, 04 May, 05:58
nom...@intel.com   [build-test alert] BUILD SUCCEEDED Linux SUSE 9 64bit gcc debug: drlvm tests Fri, 04 May, 22:32
nom...@intel.com   [build-test alert] BUILD SUCCEEDED Linux SUSE 9 64bit gcc debug: drlvm tests Sat, 05 May, 02:06
nom...@intel.com   [build-test alert] BUILD SUCCEEDED Linux SUSE 9 64bit gcc debug: drlvm tests Sat, 05 May, 15:57
nom...@intel.com   [build-test alert] BUILD SUCCEEDED Linux SUSE 9 64bit gcc debug: drlvm tests Sun, 06 May, 01:15
nom...@intel.com   [build-test alert] BUILD SUCCEEDED Linux SUSE 9 64bit gcc debug: drlvm tests Sun, 06 May, 08:59
nom...@intel.com   [build-test alert] BUILD SUCCEEDED Linux SUSE 9 64bit gcc debug: drlvm tests Sun, 06 May, 15:43
nom...@intel.com   [build-test alert] BUILD SUCCEEDED Linux SUSE 9 64bit gcc debug: drlvm tests Mon, 07 May, 16:24
nom...@intel.com   [build-test alert] BUILD SUCCEEDED Linux SUSE 9 64bit gcc debug: drlvm tests Tue, 08 May, 06:31
nom...@intel.com   [build-test alert] BUILD SUCCEEDED Linux SUSE 9 64bit gcc debug: drlvm tests Tue, 08 May, 18:04
nom...@intel.com   [build-test alert] BUILD SUCCEEDED Linux SUSE 9 64bit gcc debug: drlvm tests Wed, 09 May, 18:24
nom...@intel.com   [build-test alert] BUILD SUCCEEDED Linux SUSE 9 64bit gcc debug: drlvm tests Thu, 10 May, 11:36
nom...@intel.com   [build-test alert] BUILD SUCCEEDED Linux SUSE 9 64bit gcc debug: drlvm tests Thu, 10 May, 22:50
nom...@intel.com   [build-test alert] BUILD SUCCEEDED Linux SUSE 9 64bit gcc debug: drlvm tests Fri, 11 May, 07:00
nom...@intel.com   [build-test alert] BUILD SUCCEEDED Linux SUSE 9 64bit gcc debug: drlvm tests Mon, 14 May, 05:47
nom...@intel.com   [build-test alert] BUILD SUCCEEDED Linux SUSE 9 64bit gcc debug: drlvm tests Mon, 14 May, 15:33
nom...@intel.com   [build-test alert] BUILD SUCCEEDED Linux SUSE 9 64bit gcc debug: drlvm tests Mon, 14 May, 23:22
nom...@intel.com   [build-test alert] BUILD SUCCEEDED Linux SUSE 9 64bit gcc debug: drlvm tests Tue, 15 May, 06:58
nom...@intel.com   [build-test alert] BUILD SUCCEEDED Linux SUSE 9 64bit gcc debug: drlvm tests Tue, 15 May, 11:57
nom...@intel.com   [build-test alert] BUILD SUCCEEDED Linux SUSE 9 64bit gcc debug: drlvm tests Tue, 15 May, 16:33
nom...@intel.com   [build-test alert] BUILD SUCCEEDED Linux SUSE 9 64bit gcc debug: drlvm tests Tue, 15 May, 22:24
nom...@intel.com   [build-test alert] BUILD SUCCEEDED Linux SUSE 9 64bit gcc debug: drlvm tests Wed, 16 May, 14:07
nom...@intel.com   [build-test alert] BUILD SUCCEEDED Linux SUSE 9 64bit gcc debug: drlvm tests Wed, 16 May, 17:19
nom...@intel.com   [build-test alert] BUILD SUCCEEDED Linux SUSE 9 64bit gcc debug: drlvm tests Wed, 16 May, 23:53
nom...@intel.com   [build-test alert] BUILD SUCCEEDED Linux SUSE 9 64bit gcc debug: drlvm tests Thu, 17 May, 22:33
nom...@intel.com   [build-test alert] BUILD SUCCEEDED Linux SUSE 9 64bit gcc debug: drlvm tests Fri, 18 May, 12:44
nom...@intel.com   [build-test alert] BUILD SUCCEEDED Linux SUSE 9 64bit gcc debug: drlvm tests Fri, 18 May, 21:40
nom...@intel.com   [build-test alert] BUILD SUCCEEDED Linux SUSE 9 64bit gcc debug: drlvm tests Sat, 19 May, 02:24
nom...@intel.com   [build-test alert] BUILD SUCCEEDED Linux SUSE 9 64bit gcc debug: drlvm tests Sat, 19 May, 11:26
nom...@intel.com   [build-test alert] BUILD SUCCEEDED Linux SUSE 9 64bit gcc debug: drlvm tests Sat, 19 May, 23:33
nom...@intel.com   [build-test alert] BUILD SUCCEEDED Linux SUSE 9 64bit gcc debug: drlvm tests Mon, 21 May, 06:46
nom...@intel.com   [build-test alert] BUILD SUCCEEDED Linux SUSE 9 64bit gcc debug: drlvm tests Mon, 21 May, 18:31
nom...@intel.com   [build-test alert] BUILD SUCCEEDED Linux SUSE 9 64bit gcc debug: drlvm tests Tue, 22 May, 01:09
nom...@intel.com   [build-test alert] BUILD SUCCEEDED Linux SUSE 9 64bit gcc debug: drlvm tests Tue, 22 May, 13:28
nom...@intel.com   [build-test alert] BUILD SUCCEEDED Linux SUSE 9 64bit gcc debug: drlvm tests Tue, 22 May, 22:00
nom...@intel.com   [build-test alert] BUILD SUCCEEDED Linux SUSE 9 64bit gcc debug: drlvm tests Wed, 23 May, 05:42
nom...@intel.com   [build-test alert] BUILD SUCCEEDED Linux SUSE 9 64bit gcc debug: drlvm tests Wed, 23 May, 14:22
nom...@intel.com   [build-test alert] BUILD SUCCEEDED Linux SUSE 9 64bit gcc debug: drlvm tests Wed, 23 May, 18:47
nom...@intel.com   [build-test alert] BUILD SUCCEEDED Linux SUSE 9 64bit gcc debug: drlvm tests Thu, 24 May, 06:35
nom...@intel.com   [build-test alert] BUILD SUCCEEDED Linux SUSE 9 64bit gcc debug: drlvm tests Thu, 24 May, 15:36
nom...@intel.com   [build-test alert] BUILD SUCCEEDED Linux SUSE 9 64bit gcc debug: drlvm tests Fri, 25 May, 02:43
nom...@intel.com   [build-test alert] BUILD SUCCEEDED Linux SUSE 9 64bit gcc debug: drlvm tests Fri, 25 May, 16:14
nom...@intel.com   [build-test alert] BUILD SUCCEEDED Linux SUSE 9 64bit gcc debug: drlvm tests Mon, 28 May, 11:39
nom...@intel.com   [build-test alert] BUILD SUCCEEDED Linux SUSE 9 64bit gcc debug: drlvm tests Tue, 29 May, 00:48
nom...@intel.com   [build-test alert] BUILD SUCCEEDED Linux SUSE 9 64bit gcc debug: drlvm tests Wed, 30 May, 09:38
nom...@intel.com   [build-test alert] BUILD SUCCEEDED Linux SUSE 9 64bit gcc debug: drlvm tests Wed, 30 May, 15:49
[build-test alert] BUILD FAILED SUSEL9 IA32 gcc debug: classlib tests iterative
nom...@intel.com   [build-test alert] BUILD FAILED SUSEL9 IA32 gcc debug: classlib tests iterative Tue, 01 May, 12:46
nom...@intel.com   [build-test alert] BUILD FAILED SUSEL9 IA32 gcc debug: classlib tests iterative Thu, 03 May, 02:30
nom...@intel.com   [build-test alert] BUILD FAILED SUSEL9 IA32 gcc debug: classlib tests iterative Thu, 03 May, 04:33
nom...@intel.com   [build-test alert] BUILD FAILED SUSEL9 IA32 gcc debug: classlib tests iterative Thu, 03 May, 06:36
nom...@intel.com   [build-test alert] BUILD FAILED SUSEL9 IA32 gcc debug: classlib tests iterative Thu, 03 May, 08:40
nom...@intel.com   [build-test alert] BUILD FAILED SUSEL9 IA32 gcc debug: classlib tests iterative Thu, 03 May, 10:43
nom...@intel.com   [build-test alert] BUILD FAILED SUSEL9 IA32 gcc debug: classlib tests iterative Thu, 03 May, 12:47
nom...@intel.com   [build-test alert] BUILD FAILED SUSEL9 IA32 gcc debug: classlib tests iterative Thu, 03 May, 14:50
nom...@intel.com   [build-test alert] BUILD FAILED SUSEL9 IA32 gcc debug: classlib tests iterative Thu, 03 May, 16:53
nom...@intel.com   [build-test alert] BUILD FAILED SUSEL9 IA32 gcc debug: classlib tests iterative Thu, 03 May, 18:56
nom...@intel.com   [build-test alert] BUILD FAILED SUSEL9 IA32 gcc debug: classlib tests iterative Thu, 03 May, 20:59
nom...@intel.com   [build-test alert] BUILD FAILED SUSEL9 IA32 gcc debug: classlib tests iterative Thu, 03 May, 23:03
nom...@intel.com   [build-test alert] BUILD FAILED SUSEL9 IA32 gcc debug: classlib tests iterative Fri, 04 May, 01:06
nom...@intel.com   [build-test alert] BUILD FAILED SUSEL9 IA32 gcc debug: classlib tests iterative Fri, 04 May, 03:09
nom...@intel.com   [build-test alert] BUILD FAILED SUSEL9 IA32 gcc debug: classlib tests iterative Fri, 04 May, 05:12
nom...@intel.com   [build-test alert] BUILD FAILED SUSEL9 IA32 gcc debug: classlib tests iterative Fri, 04 May, 07:15
nom...@intel.com   [build-test alert] BUILD FAILED SUSEL9 IA32 gcc debug: classlib tests iterative Fri, 04 May, 09:19
nom...@intel.com   [build-test alert] BUILD FAILED SUSEL9 IA32 gcc debug: classlib tests iterative Fri, 04 May, 11:23
nom...@intel.com   [build-test alert] BUILD FAILED SUSEL9 IA32 gcc debug: classlib tests iterative Fri, 04 May, 13:27
nom...@intel.com   [build-test alert] BUILD FAILED SUSEL9 IA32 gcc debug: classlib tests iterative Fri, 04 May, 15:30
nom...@intel.com   [build-test alert] BUILD FAILED SUSEL9 IA32 gcc debug: classlib tests iterative Fri, 04 May, 17:33
nom...@intel.com   [build-test alert] BUILD FAILED SUSEL9 IA32 gcc debug: classlib tests iterative Fri, 04 May, 19:36
nom...@intel.com   [build-test alert] BUILD FAILED SUSEL9 IA32 gcc debug: classlib tests iterative Fri, 04 May, 21:40
nom...@intel.com   [build-test alert] BUILD FAILED SUSEL9 IA32 gcc debug: classlib tests iterative Fri, 04 May, 23:43
nom...@intel.com   [build-test alert] BUILD FAILED SUSEL9 IA32 gcc debug: classlib tests iterative Sat, 05 May, 01:46
nom...@intel.com   [build-test alert] BUILD FAILED SUSEL9 IA32 gcc debug: classlib tests iterative Sat, 05 May, 03:49
nom...@intel.com   [build-test alert] BUILD FAILED SUSEL9 IA32 gcc debug: classlib tests iterative Sat, 05 May, 05:53
nom...@intel.com   [build-test alert] BUILD FAILED SUSEL9 IA32 gcc debug: classlib tests iterative Sat, 05 May, 07:56
nom...@intel.com   [build-test alert] BUILD FAILED SUSEL9 IA32 gcc debug: classlib tests iterative Sat, 05 May, 09:59
nom...@intel.com   [build-test alert] BUILD FAILED SUSEL9 IA32 gcc debug: classlib tests iterative Sat, 05 May, 12:03
nom...@intel.com   [build-test alert] BUILD FAILED SUSEL9 IA32 gcc debug: classlib tests iterative Sat, 05 May, 14:06
nom...@intel.com   [build-test alert] BUILD FAILED SUSEL9 IA32 gcc debug: classlib tests iterative Sat, 05 May, 16:09
nom...@intel.com   [build-test alert] BUILD FAILED SUSEL9 IA32 gcc debug: classlib tests iterative Sat, 05 May, 18:12
nom...@intel.com   [build-test alert] BUILD FAILED SUSEL9 IA32 gcc debug: classlib tests iterative Sat, 05 May, 20:15
nom...@intel.com   [build-test alert] BUILD FAILED SUSEL9 IA32 gcc debug: classlib tests iterative Sat, 05 May, 22:19
nom...@intel.com   [build-test alert] BUILD FAILED SUSEL9 IA32 gcc debug: classlib tests iterative Sun, 06 May, 00:22
nom...@intel.com   [build-test alert] BUILD FAILED SUSEL9 IA32 gcc debug: classlib tests iterative Sun, 06 May, 02:25
nom...@intel.com   [build-test alert] BUILD FAILED SUSEL9 IA32 gcc debug: classlib tests iterative Sun, 06 May, 04:28
nom...@intel.com   [build-test alert] BUILD FAILED SUSEL9 IA32 gcc debug: classlib tests iterative Sun, 06 May, 06:32
nom...@intel.com   [build-test alert] BUILD FAILED SUSEL9 IA32 gcc debug: classlib tests iterative Sun, 06 May, 08:35
nom...@intel.com   [build-test alert] BUILD FAILED SUSEL9 IA32 gcc debug: classlib tests iterative Sun, 06 May, 10:38
nom...@intel.com   [build-test alert] BUILD FAILED SUSEL9 IA32 gcc debug: classlib tests iterative Sun, 06 May, 12:41
nom...@intel.com   [build-test alert] BUILD FAILED SUSEL9 IA32 gcc debug: classlib tests iterative Sun, 06 May, 14:44
nom...@intel.com   [build-test alert] BUILD FAILED SUSEL9 IA32 gcc debug: classlib tests iterative Sun, 06 May, 16:47
nom...@intel.com   [build-test alert] BUILD FAILED SUSEL9 IA32 gcc debug: classlib tests iterative Sun, 06 May, 19:04
nom...@intel.com   [build-test alert] BUILD FAILED SUSEL9 IA32 gcc debug: classlib tests iterative Sun, 06 May, 21:13
nom...@intel.com   [build-test alert] BUILD FAILED SUSEL9 IA32 gcc debug: classlib tests iterative Sun, 06 May, 23:16
nom...@intel.com   [build-test alert] BUILD FAILED SUSEL9 IA32 gcc debug: classlib tests iterative Mon, 07 May, 01:19
nom...@intel.com   [build-test alert] BUILD FAILED SUSEL9 IA32 gcc debug: classlib tests iterative Mon, 07 May, 03:22
nom...@intel.com   [build-test alert] BUILD FAILED SUSEL9 IA32 gcc debug: classlib tests iterative Mon, 07 May, 05:25
nom...@intel.com   [build-test alert] BUILD FAILED SUSEL9 IA32 gcc debug: classlib tests iterative Mon, 07 May, 07:29
nom...@intel.com   [build-test alert] BUILD FAILED SUSEL9 IA32 gcc debug: classlib tests iterative Mon, 07 May, 09:32
[build-test alert] BUILD SUCCEEDED Windows XP SP2 msvc debug: classlib over drlvm
nom...@intel.com   [build-test alert] BUILD SUCCEEDED Windows XP SP2 msvc debug: classlib over drlvm Wed, 02 May, 06:45
nom...@intel.com   [build-test alert] BUILD SUCCEEDED Windows XP SP2 msvc debug: classlib over drlvm Thu, 03 May, 13:47
nom...@intel.com   [build-test alert] BUILD SUCCEEDED Windows XP SP2 msvc debug: classlib over drlvm Mon, 14 May, 04:23
nom...@intel.com   [build-test alert] BUILD SUCCEEDED Windows XP SP2 msvc debug: classlib over drlvm Wed, 16 May, 05:23
nom...@intel.com   [build-test alert] BUILD SUCCEEDED Windows XP SP2 msvc debug: classlib over drlvm Thu, 24 May, 08:48
nom...@intel.com   [build-test alert] BUILD SUCCEEDED Windows XP SP2 msvc debug: classlib over drlvm Thu, 24 May, 17:15
nom...@intel.com   [build-test alert] BUILD SUCCEEDED Windows XP SP2 msvc debug: classlib over drlvm Fri, 25 May, 09:13
[build-test alert] BUILD SUCCEEDED Linux SUSE 9 64bit gcc debug: classlib over drlvm
nom...@intel.com   [build-test alert] BUILD SUCCEEDED Linux SUSE 9 64bit gcc debug: classlib over drlvm Wed, 02 May, 06:46
nom...@intel.com   [build-test alert] BUILD SUCCEEDED Linux SUSE 9 64bit gcc debug: classlib over drlvm Thu, 03 May, 11:24
nom...@intel.com   [build-test alert] BUILD SUCCEEDED Linux SUSE 9 64bit gcc debug: classlib over drlvm Mon, 14 May, 04:12
nom...@intel.com   [build-test alert] BUILD SUCCEEDED Linux SUSE 9 64bit gcc debug: classlib over drlvm Wed, 16 May, 02:51
nom...@intel.com   [build-test alert] BUILD SUCCEEDED Linux SUSE 9 64bit gcc debug: classlib over drlvm Wed, 16 May, 15:12
nom...@intel.com   [build-test alert] BUILD SUCCEEDED Linux SUSE 9 64bit gcc debug: classlib over drlvm Thu, 17 May, 17:30
nom...@intel.com   [build-test alert] BUILD SUCCEEDED Linux SUSE 9 64bit gcc debug: classlib over drlvm Wed, 23 May, 17:09
nom...@intel.com   [build-test alert] BUILD SUCCEEDED Linux SUSE 9 64bit gcc debug: classlib over drlvm Thu, 24 May, 02:43
nom...@intel.com   [build-test alert] BUILD SUCCEEDED Linux SUSE 9 64bit gcc debug: classlib over drlvm Fri, 25 May, 17:24
nom...@intel.com   [build-test alert] BUILD SUCCEEDED Linux SUSE 9 64bit gcc debug: classlib over drlvm Mon, 28 May, 09:33
[build-test alert] BUILD SUCCEEDED Linux SUSE 9 gcc debug: classlib over drlvm
nom...@intel.com   [build-test alert] BUILD SUCCEEDED Linux SUSE 9 gcc debug: classlib over drlvm Wed, 02 May, 06:48
nom...@intel.com   [build-test alert] BUILD SUCCEEDED Linux SUSE 9 gcc debug: classlib over drlvm Thu, 03 May, 11:13
nom...@intel.com   [build-test alert] BUILD SUCCEEDED Linux SUSE 9 gcc debug: classlib over drlvm Mon, 07 May, 14:35
nom...@intel.com   [build-test alert] BUILD SUCCEEDED Linux SUSE 9 gcc debug: classlib over drlvm Wed, 09 May, 14:57
nom...@intel.com   [build-test alert] BUILD SUCCEEDED Linux SUSE 9 gcc debug: classlib over drlvm Thu, 10 May, 11:00
nom...@intel.com   [build-test alert] BUILD SUCCEEDED Linux SUSE 9 gcc debug: classlib over drlvm Mon, 14 May, 04:26
nom...@intel.com   [build-test alert] BUILD SUCCEEDED Linux SUSE 9 gcc debug: classlib over drlvm Wed, 16 May, 05:22
nom...@intel.com   [build-test alert] BUILD SUCCEEDED Linux SUSE 9 gcc debug: classlib over drlvm Wed, 23 May, 20:08
[build-test alert] BUILD SUCCEEDED Windows 2003 x86_64 msvc debug: classlib tests
nom...@intel.com   [build-test alert] BUILD SUCCEEDED Windows 2003 x86_64 msvc debug: classlib tests Wed, 02 May, 07:15
nom...@intel.com   [build-test alert] BUILD SUCCEEDED Windows 2003 x86_64 msvc debug: classlib tests Thu, 03 May, 18:39
nom...@intel.com   [build-test alert] BUILD SUCCEEDED Windows 2003 x86_64 msvc debug: classlib tests Mon, 07 May, 21:46
nom...@intel.com   [build-test alert] BUILD SUCCEEDED Windows 2003 x86_64 msvc debug: classlib tests Wed, 09 May, 10:35
nom...@intel.com   [build-test alert] BUILD SUCCEEDED Windows 2003 x86_64 msvc debug: classlib tests Tue, 15 May, 01:38
nom...@intel.com   [build-test alert] BUILD SUCCEEDED Windows 2003 x86_64 msvc debug: classlib tests Wed, 16 May, 16:28
nom...@intel.com   [build-test alert] BUILD SUCCEEDED Windows 2003 x86_64 msvc debug: classlib tests Fri, 18 May, 06:29
nom...@intel.com   [build-test alert] BUILD SUCCEEDED Windows 2003 x86_64 msvc debug: classlib tests Thu, 31 May, 20:25
[continuum] BUILD ERROR: Classlib/linux.ia32 Build/Test
nom...@hursley.ibm.com   [continuum] BUILD ERROR: Classlib/linux.ia32 Build/Test Wed, 02 May, 10:40
nom...@hursley.ibm.com   [continuum] BUILD ERROR: Classlib/linux.ia32 Build/Test Thu, 03 May, 10:00
nom...@intel.com [build-test alert] BUILD FAILED Linux SUSE9 64bit gcc debug: classlib Wed, 02 May, 11:28
[build-test alert] BUILD FAILED LINUX SUSE 9 x86: harmony HDK
nom...@intel.com   [build-test alert] BUILD FAILED LINUX SUSE 9 x86: harmony HDK Wed, 02 May, 11:32
nom...@intel.com   [build-test alert] BUILD FAILED LINUX SUSE 9 x86: harmony HDK Wed, 02 May, 16:57
nom...@intel.com   [build-test alert] BUILD FAILED LINUX SUSE 9 x86: harmony HDK Thu, 03 May, 09:45
nom...@intel.com   [build-test alert] BUILD FAILED LINUX SUSE 9 x86: harmony HDK Fri, 04 May, 22:41
nom...@intel.com   [build-test alert] BUILD FAILED LINUX SUSE 9 x86: harmony HDK Thu, 17 May, 11:06
[build-test alert] BUILD FAILED LINUX SUSE 9 x86_64: harmony HDK
nom...@intel.com   [build-test alert] BUILD FAILED LINUX SUSE 9 x86_64: harmony HDK Wed, 02 May, 11:34
nom...@intel.com   [build-test alert] BUILD FAILED LINUX SUSE 9 x86_64: harmony HDK Wed, 02 May, 16:40
nom...@intel.com   [build-test alert] BUILD FAILED LINUX SUSE 9 x86_64: harmony HDK Fri, 04 May, 01:31
nom...@intel.com   [build-test alert] BUILD FAILED LINUX SUSE 9 x86_64: harmony HDK Fri, 04 May, 22:35
[build-test alert] BUILD FAILED Linux SUSE9 64bit gcc debug: drlvm
nom...@intel.com   [build-test alert] BUILD FAILED Linux SUSE9 64bit gcc debug: drlvm Wed, 02 May, 11:35
nom...@intel.com   [build-test alert] BUILD FAILED Linux SUSE9 64bit gcc debug: drlvm Wed, 16 May, 12:17
[build-test alert] BUILD FAILED Windows XP SP2 x86: harmony HDK
nom...@intel.com   [build-test alert] BUILD FAILED Windows XP SP2 x86: harmony HDK Wed, 02 May, 11:36
nom...@intel.com   [build-test alert] BUILD FAILED Windows XP SP2 x86: harmony HDK Thu, 03 May, 09:55
nom...@intel.com   [build-test alert] BUILD FAILED Windows XP SP2 x86: harmony HDK Fri, 04 May, 22:19
nom...@intel.com   [build-test alert] BUILD FAILED Windows XP SP2 x86: harmony HDK Thu, 17 May, 02:35
nom...@intel.com [build-test alert] BUILD FAILED Windows XP ia32 msvc debug: classlib Wed, 02 May, 11:37
[build-test alert] BUILD FAILED Windows XP ia32 msvc debug: drlvm
nom...@intel.com   [build-test alert] BUILD FAILED Windows XP ia32 msvc debug: drlvm Wed, 02 May, 11:44
nom...@intel.com   [build-test alert] BUILD FAILED Windows XP ia32 msvc debug: drlvm Wed, 16 May, 12:42
nom...@intel.com   [build-test alert] BUILD FAILED Windows XP ia32 msvc debug: drlvm Thu, 17 May, 16:24
nom...@intel.com [build-test alert] BUILD SUCCEEDED Linux SUSE9 64bit gcc debug: classlib Wed, 02 May, 12:13
nom...@intel.com [build-test alert] BUILD SUCCEEDED Windows XP ia32 msvc debug: classlib Wed, 02 May, 12:16
[build-test alert] BUILD SUCCEEDED Linux SUSE 9 x86_64: harmony HDK
nom...@intel.com   [build-test alert] BUILD SUCCEEDED Linux SUSE 9 x86_64: harmony HDK Wed, 02 May, 12:31
nom...@intel.com   [build-test alert] BUILD SUCCEEDED Linux SUSE 9 x86_64: harmony HDK Wed, 02 May, 20:55
nom...@intel.com   [build-test alert] BUILD SUCCEEDED Linux SUSE 9 x86_64: harmony HDK Fri, 04 May, 02:36
nom...@intel.com   [build-test alert] BUILD SUCCEEDED Linux SUSE 9 x86_64: harmony HDK Mon, 07 May, 03:29
[build-test alert] BUILD SUCCEEDED Linux SUSE9 64bit gcc debug: drlvm
nom...@intel.com   [build-test alert] BUILD SUCCEEDED Linux SUSE9 64bit gcc debug: drlvm Wed, 02 May, 12:32
nom...@intel.com   [build-test alert] BUILD SUCCEEDED Linux SUSE9 64bit gcc debug: drlvm Wed, 16 May, 14:49
[build-test alert] BUILD SUCCEEDED Linux SUSE 9 x86: harmony HDK
nom...@intel.com   [build-test alert] BUILD SUCCEEDED Linux SUSE 9 x86: harmony HDK Wed, 02 May, 12:41
nom...@intel.com   [build-test alert] BUILD SUCCEEDED Linux SUSE 9 x86: harmony HDK Wed, 02 May, 20:31
nom...@intel.com   [build-test alert] BUILD SUCCEEDED Linux SUSE 9 x86: harmony HDK Fri, 04 May, 02:19
nom...@intel.com   [build-test alert] BUILD SUCCEEDED Linux SUSE 9 x86: harmony HDK Mon, 07 May, 03:08
nom...@intel.com   [build-test alert] BUILD SUCCEEDED Linux SUSE 9 x86: harmony HDK Fri, 18 May, 02:42
[build-test alert] BUILD SUCCEEDED Windows XP ia32 msvc debug: drlvm
nom...@intel.com   [build-test alert] BUILD SUCCEEDED Windows XP ia32 msvc debug: drlvm Wed, 02 May, 12:48
nom...@intel.com   [build-test alert] BUILD SUCCEEDED Windows XP ia32 msvc debug: drlvm Wed, 16 May, 14:52
nom...@intel.com   [build-test alert] BUILD SUCCEEDED Windows XP ia32 msvc debug: drlvm Fri, 18 May, 04:24
[build-test alert] BUILD SUCCEEDED Windows XP SP2 x86: harmony HDK
nom...@intel.com   [build-test alert] BUILD SUCCEEDED Windows XP SP2 x86: harmony HDK Wed, 02 May, 12:51
nom...@intel.com   [build-test alert] BUILD SUCCEEDED Windows XP SP2 x86: harmony HDK Fri, 04 May, 02:18
nom...@intel.com   [build-test alert] BUILD SUCCEEDED Windows XP SP2 x86: harmony HDK Mon, 07 May, 03:22
nom...@intel.com   [build-test alert] BUILD SUCCEEDED Windows XP SP2 x86: harmony HDK Thu, 17 May, 03:32
[build-test alert] BUILD FAILED Windows server 2003 msvc: harmony
nom...@intel.com   [build-test alert] BUILD FAILED Windows server 2003 msvc: harmony Wed, 02 May, 13:10
nom...@intel.com   [build-test alert] BUILD FAILED Windows server 2003 msvc: harmony Thu, 03 May, 10:10
nom...@intel.com   [build-test alert] BUILD FAILED Windows server 2003 msvc: harmony Fri, 04 May, 23:20
nom...@intel.com   [build-test alert] BUILD FAILED Windows server 2003 msvc: harmony Thu, 17 May, 02:27
nom...@intel.com   [build-test alert] BUILD FAILED Windows server 2003 msvc: harmony Thu, 24 May, 16:13
[build-test alert] BUILD SUCCEEDED Windows XP SP2 msvc debug: drlvm tests
nom...@intel.com   [build-test alert] BUILD SUCCEEDED Windows XP SP2 msvc debug: drlvm tests Wed, 02 May, 14:55
nom...@intel.com   [build-test alert] BUILD SUCCEEDED Windows XP SP2 msvc debug: drlvm tests Thu, 03 May, 12:52
nom...@intel.com   [build-test alert] BUILD SUCCEEDED Windows XP SP2 msvc debug: drlvm tests Fri, 04 May, 15:46
nom...@intel.com   [build-test alert] BUILD SUCCEEDED Windows XP SP2 msvc debug: drlvm tests Wed, 09 May, 16:55
nom...@intel.com   [build-test alert] BUILD SUCCEEDED Windows XP SP2 msvc debug: drlvm tests Thu, 10 May, 08:25
nom...@intel.com   [build-test alert] BUILD SUCCEEDED Windows XP SP2 msvc debug: drlvm tests Thu, 10 May, 20:14
nom...@intel.com   [build-test alert] BUILD SUCCEEDED Windows XP SP2 msvc debug: drlvm tests Sat, 12 May, 14:10
nom...@intel.com   [build-test alert] BUILD SUCCEEDED Windows XP SP2 msvc debug: drlvm tests Fri, 18 May, 07:25
nom...@intel.com   [build-test alert] BUILD SUCCEEDED Windows XP SP2 msvc debug: drlvm tests Fri, 25 May, 00:31
nom...@intel.com   [build-test alert] BUILD SUCCEEDED Windows XP SP2 msvc debug: drlvm tests Mon, 28 May, 15:43
nom...@intel.com   [build-test alert] BUILD SUCCEEDED Windows XP SP2 msvc debug: drlvm tests Wed, 30 May, 23:39
[build-test alert] BUILD FAILED Windows 2003 x86_64 msvc debug: drlvm
nom...@intel.com   [build-test alert] BUILD FAILED Windows 2003 x86_64 msvc debug: drlvm Wed, 02 May, 15:36
nom...@intel.com   [build-test alert] BUILD FAILED Windows 2003 x86_64 msvc debug: drlvm Thu, 03 May, 02:20
nom...@intel.com   [build-test alert] BUILD FAILED Windows 2003 x86_64 msvc debug: drlvm Mon, 07 May, 20:56
nom...@intel.com   [build-test alert] BUILD FAILED Windows 2003 x86_64 msvc debug: drlvm Tue, 08 May, 22:25
nom...@intel.com   [build-test alert] BUILD FAILED Windows 2003 x86_64 msvc debug: drlvm Wed, 23 May, 04:05
nom...@intel.com   [build-test alert] BUILD FAILED Windows 2003 x86_64 msvc debug: drlvm Wed, 30 May, 19:27
nom...@intel.com [build-test alert] BUILD FAILED Windows 2003 x86_64 msvc debug: classlib Wed, 02 May, 17:23
[build-test alert] BUILD FAILED LINUX SUSE 9 x86: jdktools_test
nom...@intel.com   [build-test alert] BUILD FAILED LINUX SUSE 9 x86: jdktools_test Wed, 02 May, 20:52
nom...@intel.com   [build-test alert] BUILD FAILED LINUX SUSE 9 x86: jdktools_test Fri, 11 May, 09:54
nom...@intel.com   [build-test alert] BUILD FAILED LINUX SUSE 9 x86: jdktools_test Tue, 15 May, 04:00
nom...@intel.com   [build-test alert] BUILD FAILED LINUX SUSE 9 x86: jdktools_test Thu, 17 May, 11:06
nom...@intel.com   [build-test alert] BUILD FAILED LINUX SUSE 9 x86: jdktools_test Fri, 18 May, 08:10
nom...@intel.com   [build-test alert] BUILD FAILED LINUX SUSE 9 x86: jdktools_test Fri, 25 May, 05:05
[build-test alert] BUILD FAILED Windows server 2003 msvc: jdktools_test
nom...@intel.com   [build-test alert] BUILD FAILED Windows server 2003 msvc: jdktools_test Wed, 02 May, 22:03
nom...@intel.com   [build-test alert] BUILD FAILED Windows server 2003 msvc: jdktools_test Thu, 03 May, 22:00
nom...@intel.com   [build-test alert] BUILD FAILED Windows server 2003 msvc: jdktools_test Fri, 11 May, 05:52
nom...@intel.com   [build-test alert] BUILD FAILED Windows server 2003 msvc: jdktools_test Thu, 17 May, 02:31
nom...@intel.com   [build-test alert] BUILD FAILED Windows server 2003 msvc: jdktools_test Thu, 17 May, 23:44
nom...@intel.com   [build-test alert] BUILD FAILED Windows server 2003 msvc: jdktools_test Wed, 23 May, 23:32
[build-test alert] BUILD SUCCEEDED Windows 2003 x86_64 msvc debug: drlvm
nom...@intel.com   [build-test alert] BUILD SUCCEEDED Windows 2003 x86_64 msvc debug: drlvm Wed, 02 May, 23:38
nom...@intel.com   [build-test alert] BUILD SUCCEEDED Windows 2003 x86_64 msvc debug: drlvm Thu, 03 May, 16:54
nom...@intel.com   [build-test alert] BUILD SUCCEEDED Windows 2003 x86_64 msvc debug: drlvm Tue, 08 May, 11:09
nom...@intel.com   [build-test alert] BUILD SUCCEEDED Windows 2003 x86_64 msvc debug: drlvm Tue, 22 May, 06:24
nom...@intel.com   [build-test alert] BUILD SUCCEEDED Windows 2003 x86_64 msvc debug: drlvm Wed, 23 May, 14:20
nom...@intel.com   [build-test alert] BUILD SUCCEEDED Windows 2003 x86_64 msvc debug: drlvm Thu, 31 May, 01:44
nom...@intel.com [build-test alert] BUILD SUCCEEDED Windows 2003 x86_64 msvc debug: classlib Thu, 03 May, 01:36
[build-test alert] BUILD FAILED Linux SUSE 9 gcc debug: drlvm reg.test
nom...@intel.com   [build-test alert] BUILD FAILED Linux SUSE 9 gcc debug: drlvm reg.test Thu, 03 May, 01:43
nom...@intel.com   [build-test alert] BUILD FAILED Linux SUSE 9 gcc debug: drlvm reg.test Wed, 23 May, 14:45
[build-test alert] BUILD FAILED Linux SUSE 9 gcc debug: drlvm test
nom...@intel.com   [build-test alert] BUILD FAILED Linux SUSE 9 gcc debug: drlvm test Thu, 03 May, 01:43
nom...@intel.com   [build-test alert] BUILD FAILED Linux SUSE 9 gcc debug: drlvm test Tue, 08 May, 14:19
nom...@intel.com   [build-test alert] BUILD FAILED Linux SUSE 9 gcc debug: drlvm test Thu, 10 May, 13:26
nom...@intel.com   [build-test alert] BUILD FAILED Linux SUSE 9 gcc debug: drlvm test Fri, 11 May, 14:47
nom...@intel.com   [build-test alert] BUILD FAILED Linux SUSE 9 gcc debug: drlvm test Mon, 14 May, 13:40
nom...@intel.com   [build-test alert] BUILD FAILED Linux SUSE 9 gcc debug: drlvm test Tue, 15 May, 05:24
nom...@intel.com   [build-test alert] BUILD FAILED Linux SUSE 9 gcc debug: drlvm test Tue, 15 May, 12:14
nom...@intel.com   [build-test alert] BUILD FAILED Linux SUSE 9 gcc debug: drlvm test Wed, 16 May, 16:52
nom...@intel.com   [build-test alert] BUILD FAILED Linux SUSE 9 gcc debug: drlvm test Sat, 19 May, 19:19
nom...@intel.com   [build-test alert] BUILD FAILED Linux SUSE 9 gcc debug: drlvm test Mon, 21 May, 12:06
nom...@intel.com   [build-test alert] BUILD FAILED Linux SUSE 9 gcc debug: drlvm test Mon, 21 May, 17:42
nom...@intel.com   [build-test alert] BUILD FAILED Linux SUSE 9 gcc debug: drlvm test Tue, 22 May, 08:10
nom...@intel.com   [build-test alert] BUILD FAILED Linux SUSE 9 gcc debug: drlvm test Wed, 23 May, 16:00
nom...@intel.com   [build-test alert] BUILD FAILED Linux SUSE 9 gcc debug: drlvm test Thu, 24 May, 05:23
nom...@intel.com   [build-test alert] BUILD FAILED Linux SUSE 9 gcc debug: drlvm test Thu, 24 May, 18:40
nom...@intel.com   [build-test alert] BUILD FAILED Linux SUSE 9 gcc debug: drlvm test Fri, 25 May, 11:48
nom...@intel.com   [build-test alert] BUILD FAILED Linux SUSE 9 gcc debug: drlvm test Mon, 28 May, 18:14
nom...@intel.com   [build-test alert] BUILD FAILED Linux SUSE 9 gcc debug: drlvm test Tue, 29 May, 15:03
nom...@intel.com   [build-test alert] BUILD FAILED Linux SUSE 9 gcc debug: drlvm test Wed, 30 May, 00:35
[build-test alert] BUILD FAILED Linux SUSE 9 64bit gcc debug: drlvm reg.test
nom...@intel.com   [build-test alert] BUILD FAILED Linux SUSE 9 64bit gcc debug: drlvm reg.test Thu, 03 May, 01:47
nom...@intel.com   [build-test alert] BUILD FAILED Linux SUSE 9 64bit gcc debug: drlvm reg.test Wed, 16 May, 14:23
nom...@intel.com   [build-test alert] BUILD FAILED Linux SUSE 9 64bit gcc debug: drlvm reg.test Wed, 23 May, 12:13
nom...@intel.com   [build-test alert] BUILD FAILED Linux SUSE 9 64bit gcc debug: drlvm reg.test Fri, 25 May, 08:04
nom...@intel.com   [build-test alert] BUILD FAILED Linux SUSE 9 64bit gcc debug: drlvm reg.test Mon, 28 May, 03:22
nom...@intel.com   [build-test alert] BUILD FAILED Linux SUSE 9 64bit gcc debug: drlvm reg.test Wed, 30 May, 06:52
[build-test alert] BUILD FAILED Windows XP SP2 msvc debug: drlvm tests
nom...@intel.com   [build-test alert] BUILD FAILED Windows XP SP2 msvc debug: drlvm tests Thu, 03 May, 01:49
nom...@intel.com   [build-test alert] BUILD FAILED Windows XP SP2 msvc debug: drlvm tests Fri, 04 May, 12:48
nom...@intel.com   [build-test alert] BUILD FAILED Windows XP SP2 msvc debug: drlvm tests Wed, 09 May, 13:15
nom...@intel.com   [build-test alert] BUILD FAILED Windows XP SP2 msvc debug: drlvm tests Thu, 10 May, 05:57
nom...@intel.com   [build-test alert] BUILD FAILED Windows XP SP2 msvc debug: drlvm tests Thu, 10 May, 12:07
nom...@intel.com   [build-test alert] BUILD FAILED Windows XP SP2 msvc debug: drlvm tests Fri, 11 May, 11:29
nom...@intel.com   [build-test alert] BUILD FAILED Windows XP SP2 msvc debug: drlvm tests Wed, 16 May, 17:21
nom...@intel.com   [build-test alert] BUILD FAILED Windows XP SP2 msvc debug: drlvm tests Thu, 24 May, 16:11
nom...@intel.com   [build-test alert] BUILD FAILED Windows XP SP2 msvc debug: drlvm tests Fri, 25 May, 04:45
nom...@intel.com   [build-test alert] BUILD FAILED Windows XP SP2 msvc debug: drlvm tests Wed, 30 May, 00:02
[build-test alert] BUILD FAILED Windows XP SP2 msvc debug: drlvm reg.test
nom...@intel.com   [build-test alert] BUILD FAILED Windows XP SP2 msvc debug: drlvm reg.test Thu, 03 May, 01:49
nom...@intel.com   [build-test alert] BUILD FAILED Windows XP SP2 msvc debug: drlvm reg.test Thu, 24 May, 08:15
Message list1 · 2 · Next »Thread · Author · Date
Box list
Jul 20113
Dec 201029
Nov 20106
Oct 201046
Sep 201035
Aug 201017
Jul 201029
Jun 201041
May 201020
Apr 201040
Mar 2010102
Feb 201043
Jan 201014
Dec 200911
Nov 20099
Oct 200912
Sep 20093
Aug 200915
Jul 200959
Jun 200916
May 200930
Apr 200960
Mar 200919
Feb 200945
Jan 200957
Dec 200827
Nov 200815
Oct 200824
Sep 200854
Aug 200834
Jul 200841
Jun 200899
May 200862
Apr 2008113
Mar 2008133
Feb 2008164
Jan 2008291
Dec 2007335
Nov 2007454
Oct 2007405
Sep 2007259
Aug 2007368
Jul 2007618
Jun 2007607
May 2007672
Apr 2007455
Mar 20071104
Feb 2007389
Jan 2007418
Dec 200692