harmony-alerts mailing list archives: May 2007

Site index · List index
Message list« Previous · 1 · 2 · 3 · 4 · 5 · 6 · 7 · Next »Thread · Author · Date
nom...@intel.com [build-test alert] BUILD SUCCEEDED Linux SUSE 9 x86: harmony HDK Fri, 04 May, 02:19
nom...@intel.com [build-test alert] BUILD SUCCEEDED Linux SUSE 9 x86_64: harmony HDK Fri, 04 May, 02:36
nom...@intel.com [build-test alert] BUILD FAILED SUSEL9 IA32 gcc debug: classlib tests iterative Fri, 04 May, 03:09
nom...@intel.com [build-test alert] BUILD SUCCEEDED Windows server 2003 msvc: jdktools_test Fri, 04 May, 04:29
nom...@intel.com [build-test alert] BUILD FAILED Linux SUSE 9 64bit gcc debug: drlvm tests Fri, 04 May, 04:29
nom...@intel.com [build-test alert] BUILD FAILED SUSEL9 IA32 gcc debug: classlib tests iterative Fri, 04 May, 05:12
nom...@intel.com [build-test alert] BUILD SUCCEEDED Linux SUSE 9 64bit gcc debug: drlvm tests Fri, 04 May, 05:58
nom...@intel.com [build-test alert] BUILD FAILED SUSEL9 IA32 gcc debug: classlib tests iterative Fri, 04 May, 07:15
nom...@intel.com [build-test alert] BUILD FAILED SUSEL9 IA32 gcc debug: classlib tests iterative Fri, 04 May, 09:19
nom...@intel.com [build-test alert] BUILD FAILED SUSEL9 IA32 gcc debug: classlib tests iterative Fri, 04 May, 11:23
nom...@intel.com [build-test alert] BUILD FAILED Linux SUSE 9 64bit gcc debug: drlvm tests Fri, 04 May, 12:30
nom...@intel.com [build-test alert] BUILD FAILED Windows XP SP2 msvc debug: drlvm tests Fri, 04 May, 12:48
nom...@intel.com [build-test alert] BUILD FAILED SUSEL9 IA32 gcc debug: classlib tests iterative Fri, 04 May, 13:27
nom...@intel.com [build-test alert] BUILD FAILED SUSEL9 IA32 gcc debug: classlib tests iterative Fri, 04 May, 15:30
nom...@intel.com [build-test alert] BUILD SUCCEEDED Windows XP SP2 msvc debug: drlvm tests Fri, 04 May, 15:46
nom...@intel.com [build-test alert] BUILD SUCCEEDED Linux SUSE 9 x86: jdktools_test Fri, 04 May, 17:04
nom...@intel.com [build-test alert] BUILD FAILED SUSEL9 IA32 gcc debug: classlib tests iterative Fri, 04 May, 17:33
nom...@intel.com [build-test alert] BUILD FAILED SUSEL9 IA32 gcc debug: classlib tests iterative Fri, 04 May, 19:36
nom...@intel.com [build-test alert] BUILD FAILED SUSEL9 IA32 gcc debug: classlib tests iterative Fri, 04 May, 21:40
nom...@intel.com [build-test alert] BUILD FAILED Windows XP SP2 x86: harmony HDK Fri, 04 May, 22:19
nom...@intel.com [build-test alert] BUILD FAILED Windows XP SP2 x86: jdktools_test Fri, 04 May, 22:21
nom...@intel.com [build-test alert] BUILD SUCCEEDED Linux SUSE 9 64bit gcc debug: drlvm tests Fri, 04 May, 22:32
nom...@intel.com [build-test alert] BUILD FAILED LINUX SUSE 9 x86_64: harmony HDK Fri, 04 May, 22:35
nom...@intel.com [build-test alert] BUILD FAILED LINUX SUSE 9 x86_64: jdktools_test Fri, 04 May, 22:37
nom...@intel.com [build-test alert] BUILD FAILED LINUX SUSE 9 x86_64: tomcat start Fri, 04 May, 22:39
nom...@intel.com [build-test alert] BUILD FAILED LINUX SUSE 9 x86: harmony HDK Fri, 04 May, 22:41
nom...@intel.com [build-test alert] BUILD FAILED LINUX SUSE 9 x86: tomcat start Fri, 04 May, 22:44
nom...@intel.com [build-test alert] BUILD FAILED Windows server 2003 msvc: harmony Fri, 04 May, 23:20
nom...@intel.com [build-test alert] BUILD FAILED SUSEL9 IA32 gcc debug: classlib tests iterative Fri, 04 May, 23:43
nom...@intel.com [build-test alert] BUILD FAILED Linux SUSE 9 64bit gcc debug: drlvm tests Sat, 05 May, 00:50
nom...@intel.com [build-test alert] BUILD FAILED SUSEL9 IA32 gcc debug: classlib tests iterative Sat, 05 May, 01:46
nom...@intel.com [build-test alert] BUILD SUCCEEDED Linux SUSE 9 64bit gcc debug: drlvm tests Sat, 05 May, 02:06
nom...@intel.com [build-test alert] BUILD FAILED Windows XP SP2 x86: tomcat start Sat, 05 May, 03:33
nom...@intel.com [build-test alert] BUILD FAILED SUSEL9 IA32 gcc debug: classlib tests iterative Sat, 05 May, 03:49
nom...@intel.com [build-test alert] BUILD FAILED SUSEL9 IA32 gcc debug: classlib tests iterative Sat, 05 May, 05:53
nom...@intel.com [build-test alert] BUILD FAILED SUSEL9 IA32 gcc debug: classlib tests iterative Sat, 05 May, 07:56
nom...@intel.com [build-test alert] BUILD FAILED SUSEL9 IA32 gcc debug: classlib tests iterative Sat, 05 May, 09:59
nom...@intel.com [build-test alert] BUILD FAILED SUSEL9 IA32 gcc debug: classlib tests iterative Sat, 05 May, 12:03
nom...@intel.com [build-test alert] BUILD FAILED Linux SUSE 9 64bit gcc debug: drlvm tests Sat, 05 May, 13:49
nom...@intel.com [build-test alert] BUILD FAILED SUSEL9 IA32 gcc debug: classlib tests iterative Sat, 05 May, 14:06
nom...@intel.com [build-test alert] BUILD SUCCEEDED Linux SUSE 9 64bit gcc debug: drlvm tests Sat, 05 May, 15:57
nom...@intel.com [build-test alert] BUILD FAILED SUSEL9 IA32 gcc debug: classlib tests iterative Sat, 05 May, 16:09
nom...@intel.com [build-test alert] BUILD FAILED SUSEL9 IA32 gcc debug: classlib tests iterative Sat, 05 May, 18:12
nom...@intel.com [build-test alert] BUILD FAILED SUSEL9 IA32 gcc debug: classlib tests iterative Sat, 05 May, 20:15
nom...@intel.com [build-test alert] BUILD FAILED SUSEL9 IA32 gcc debug: classlib tests iterative Sat, 05 May, 22:19
nom...@hursley.ibm.com [continuum] BUILD FAILURE: Classlib/linux.ia32 Build/Test Sat, 05 May, 22:32
nom...@intel.com [build-test alert] BUILD FAILED Linux SUSE 9 64bit gcc debug: drlvm tests Sat, 05 May, 22:38
nom...@intel.com [build-test alert] BUILD FAILED SUSEL9 IA32 gcc debug: classlib tests iterative Sun, 06 May, 00:22
nom...@intel.com [build-test alert] BUILD SUCCEEDED Linux SUSE 9 64bit gcc debug: drlvm tests Sun, 06 May, 01:15
nom...@intel.com [build-test alert] BUILD FAILED SUSEL9 IA32 gcc debug: classlib tests iterative Sun, 06 May, 02:25
nom...@intel.com [build-test alert] BUILD FAILED SUSEL9 IA32 gcc debug: classlib tests iterative Sun, 06 May, 04:28
nom...@intel.com [build-test alert] BUILD FAILED Linux SUSE 9 64bit gcc debug: drlvm tests Sun, 06 May, 05:31
nom...@intel.com [build-test alert] BUILD FAILED SUSEL9 IA32 gcc debug: classlib tests iterative Sun, 06 May, 06:32
nom...@intel.com [build-test alert] BUILD FAILED SUSEL9 IA32 gcc debug: classlib tests iterative Sun, 06 May, 08:35
nom...@intel.com [build-test alert] BUILD SUCCEEDED Linux SUSE 9 64bit gcc debug: drlvm tests Sun, 06 May, 08:59
nom...@intel.com [build-test alert] BUILD FAILED SUSEL9 IA32 gcc debug: classlib tests iterative Sun, 06 May, 10:38
nom...@intel.com [build-test alert] BUILD FAILED SUSEL9 IA32 gcc debug: classlib tests iterative Sun, 06 May, 12:41
nom...@intel.com [build-test alert] BUILD FAILED Linux SUSE 9 64bit gcc debug: drlvm tests Sun, 06 May, 14:19
nom...@intel.com [build-test alert] BUILD FAILED SUSEL9 IA32 gcc debug: classlib tests iterative Sun, 06 May, 14:44
nom...@intel.com [build-test alert] BUILD SUCCEEDED Linux SUSE 9 64bit gcc debug: drlvm tests Sun, 06 May, 15:43
nom...@intel.com [build-test alert] BUILD FAILED SUSEL9 IA32 gcc debug: classlib tests iterative Sun, 06 May, 16:47
nom...@intel.com [build-test alert] BUILD FAILED SUSEL9 IA32 gcc debug: classlib tests iterative Sun, 06 May, 19:04
nom...@intel.com [build-test alert] BUILD FAILED SUSEL9 IA32 gcc debug: classlib tests iterative Sun, 06 May, 21:13
nom...@intel.com [build-test alert] BUILD FAILED SUSEL9 IA32 gcc debug: classlib tests iterative Sun, 06 May, 23:16
nom...@intel.com [build-test alert] BUILD FAILED SUSEL9 IA32 gcc debug: classlib tests iterative Mon, 07 May, 01:19
nom...@intel.com [build-test alert] BUILD FAILED Windows server 2003 x86_64: tomcat start Mon, 07 May, 02:53
nom...@intel.com [build-test alert] BUILD SUCCEEDED Linux SUSE 9 x86: harmony HDK Mon, 07 May, 03:08
nom...@intel.com [build-test alert] BUILD SUCCEEDED Linux SUSE 9 x86: tomcat start Mon, 07 May, 03:11
nom...@intel.com [build-test alert] BUILD SUCCEEDED Windows XP SP2 x86: harmony HDK Mon, 07 May, 03:22
nom...@intel.com [build-test alert] BUILD FAILED SUSEL9 IA32 gcc debug: classlib tests iterative Mon, 07 May, 03:22
nom...@intel.com [build-test alert] BUILD SUCCEEDED Linux SUSE 9 x86_64: harmony HDK Mon, 07 May, 03:29
nom...@intel.com [build-test alert] BUILD SUCCEEDED Windows server 2003 msvc: harmony Mon, 07 May, 03:37
nom...@intel.com [build-test alert] BUILD SUCCEEDED Linux SUSE 9 x86_64: jdktools_test Mon, 07 May, 03:49
nom...@intel.com [build-test alert] BUILD SUCCEEDED Linux SUSE 9 x86_64: tomcat start Mon, 07 May, 03:54
nom...@intel.com [build-test alert] BUILD SUCCEEDED Windows server 2003 x86_64: tomcat start Mon, 07 May, 04:10
nom...@intel.com [build-test alert] BUILD SUCCEEDED Windows XP SP2 x86: jdktools_test Mon, 07 May, 04:27
nom...@intel.com [build-test alert] BUILD SUCCEEDED Windows XP SP2 x86: tomcat start Mon, 07 May, 04:30
nom...@intel.com [build-test alert] BUILD FAILED SUSEL9 IA32 gcc debug: classlib tests iterative Mon, 07 May, 05:25
nom...@intel.com [build-test alert] BUILD FAILED SUSEL9 IA32 gcc debug: classlib tests iterative Mon, 07 May, 07:29
nom...@intel.com [build-test alert] BUILD FAILED SUSEL9 IA32 gcc debug: classlib tests iterative Mon, 07 May, 09:32
nom...@intel.com [build-test alert] BUILD FAILED Linux SUSE 9 gcc debug: classlib over drlvm Mon, 07 May, 11:21
nom...@intel.com [build-test alert] BUILD FAILED Linux SUSE 9 64bit gcc debug: drlvm tests Mon, 07 May, 12:47
nom...@intel.com [build-test alert] BUILD FAILED Windows 2003 x86_64 msvc debug: classlib tests Mon, 07 May, 13:30
nom...@intel.com [build-test alert] BUILD SUCCEEDED Linux SUSE 9 gcc debug: classlib over drlvm Mon, 07 May, 14:35
nom...@intel.com [build-test alert] BUILD SUCCEEDED Linux SUSE 9 64bit gcc debug: drlvm tests Mon, 07 May, 16:24
nom...@intel.com [build-test alert] BUILD FAILED Windows 2003 x86_64 msvc debug: drlvm Mon, 07 May, 20:56
nom...@intel.com [build-test alert] BUILD SUCCEEDED Windows 2003 x86_64 msvc debug: classlib tests Mon, 07 May, 21:46
nom...@intel.com [build-test alert] BUILD FAILED Linux SUSE 9 64bit gcc debug: drlvm tests Tue, 08 May, 03:13
nom...@intel.com [build-test alert] BUILD SUCCEEDED Linux SUSE 9 64bit gcc debug: drlvm tests Tue, 08 May, 06:31
nom...@intel.com [build-test alert] BUILD FAILED Linux SUSE 9 64bit gcc debug: drlvm tests Tue, 08 May, 09:04
nom...@intel.com [build-test alert] BUILD SUCCEEDED Windows 2003 x86_64 msvc debug: drlvm Tue, 08 May, 11:09
nom...@hursley.ibm.com [continuum] BUILD FAILURE: Classlib/linux.ia32 Build/Test Tue, 08 May, 14:14
nom...@intel.com [build-test alert] BUILD FAILED Linux SUSE 9 gcc debug: drlvm test Tue, 08 May, 14:19
nom...@intel.com [build-test alert] BUILD FAILED LINUX SUSE 9 x86: tomcat start Tue, 08 May, 15:57
nom...@hursley.ibm.com [continuum] BUILD SUCCESSFUL: Classlib/linux.ia32 Build/Test Tue, 08 May, 16:19
nom...@intel.com [build-test alert] BUILD SUCCEEDED Linux SUSE 9 gcc debug: drlvm test Tue, 08 May, 17:41
nom...@intel.com [build-test alert] BUILD SUCCEEDED Linux SUSE 9 64bit gcc debug: drlvm tests Tue, 08 May, 18:04
nom...@intel.com [build-test alert] BUILD FAILED Windows 2003 x86_64 msvc debug: drlvm Tue, 08 May, 22:25
nom...@intel.com [build-test alert] BUILD SUCCEEDED Linux SUSE 9 x86: tomcat start Wed, 09 May, 01:29
nom...@intel.com [build-test alert] BUILD FAILED Windows 2003 x86_64 msvc debug: classlib tests Wed, 09 May, 01:40
Message list« Previous · 1 · 2 · 3 · 4 · 5 · 6 · 7 · Next »Thread · Author · Date
Box list
Jul 20113
Dec 201029
Nov 20106
Oct 201046
Sep 201035
Aug 201017
Jul 201029
Jun 201041
May 201020
Apr 201040
Mar 2010102
Feb 201043
Jan 201014
Dec 200911
Nov 20099
Oct 200912
Sep 20093
Aug 200915
Jul 200959
Jun 200916
May 200930
Apr 200960
Mar 200919
Feb 200945
Jan 200957
Dec 200827
Nov 200815
Oct 200824
Sep 200854
Aug 200834
Jul 200841
Jun 200899
May 200862
Apr 2008113
Mar 2008133
Feb 2008164
Jan 2008291
Dec 2007335
Nov 2007454
Oct 2007405
Sep 2007259
Aug 2007368
Jul 2007618
Jun 2007607
May 2007672
Apr 2007455
Mar 20071104
Feb 2007389
Jan 2007418
Dec 200692