harmony-alerts mailing list archives

Site index · List index
Message view « Date » · « Thread »
Top « Date » · « Thread »
From nbe...@kc.rr.com
Subject [build-test alert] BUILD FAILED Windows 2000 x86: classlib-test
Date Thu, 31 May 2007 08:47:00 GMT
BUILD FAILED:
	Ant Error Message:
C:\harmony\buildtest2\scripts\cc-exec-adaptor.xml:34: The following error occurred while executing
this line: C:\harmony\buildtest2\adaptors\classlib-test\adaptor.xml:76: There were CLASSLIB
Unit Test failures.

Date of build:	05/31/2007 03:46:08
Time to build:	30 seconds
Last changed:	05/31/2007 03:22:26
Last log entry:	classlib

***********************************************************
Errors/Warnings:	(9)
            
[exec] Execute failed: java.io.IOException: Cannot run program "C:\harmony\buildtest2\build\checkouts\drlvm\build\deploy\jdk\jre\bin\java":
CreateProcess error=2, The system cannot find the file specified
BUILD FAILED
C:\harmony\buildtest2\build\checkouts\classlib\build.xml:169: The following error occurred
while executing this line:
C:\harmony\buildtest2\build\checkouts\classlib\make\build-test.xml:56: The following error
occurred while executing this line:
C:\harmony\buildtest2\build\checkouts\classlib\make\properties.xml:441: The following error
occurred while executing this line:
C:\harmony\buildtest2\build\checkouts\classlib\modules\accessibility\build.xml:183: Process
fork failed.
Total time: 24 seconds
Warning: skipping zip archive C:\harmony\buildtest2\build\results\classlib-test_20070531_0346.zip
because no files were included.

***********************************************************
Unit Tests: (0)
        
No Tests Run: This project doesn't have any tests

***********************************************************
Modifications since last successful build:	(17)
            
add cc-classlib log20070531032226Lbuild.42 05/31/2007 03:22:26classlib
modified apetrenko  /harmony/enhanced/classlib/trunk/modules/archive/src/main/native/archive/shared/jarfile.c
05/31/2007 03:19:54 Additional patch for HARMONY-3054
modified apetrenko  /harmony/enhanced/classlib/trunk/modules/archive/src/main/native/archive/shared/jarfile.c
05/31/2007 03:19:54 Additional patch for HARMONY-3054
add cc-drlvm log20070530235722Lbuild.19 05/30/2007 23:57:22drlvm
modified varlax  /harmony/enhanced/drlvm/trunk/build/make/components/vm/jitrino.xml 05/30/2007
23:51:42 Fixed HARMONY-3961 Allow Jitrino.dll to run on systems w/o SSE2
modified apetrenko  /harmony/enhanced/classlib/trunk/modules/luni/src/main/native/include/windows/jclprots.h
05/30/2007 17:36:30 Patch for HARMONY-3054 "[classlib][archive] EUT intermittently fail in
org.eclipse.jdt.core.tests.compiler.parser.TestAll"
modified apetrenko  /harmony/enhanced/classlib/trunk/modules/archive/src/main/native/archive/shared/zip.c
05/30/2007 17:36:30 Patch for HARMONY-3054 "[classlib][archive] EUT intermittently fail in
org.eclipse.jdt.core.tests.compiler.parser.TestAll"
modified apetrenko  /harmony/enhanced/classlib/trunk/modules/archive/src/main/java/java/util/zip/ZipFile.java
05/30/2007 17:36:30 Patch for HARMONY-3054 "[classlib][archive] EUT intermittently fail in
org.eclipse.jdt.core.tests.compiler.parser.TestAll"
modified apetrenko  /harmony/enhanced/classlib/trunk/modules/archive/src/main/native/archive/shared/archiveglob.c
05/30/2007 17:36:30 Patch for HARMONY-3054 "[classlib][archive] EUT intermittently fail in
org.eclipse.jdt.core.tests.compiler.parser.TestAll"
modified apetrenko  /harmony/enhanced/classlib/trunk/modules/archive/src/main/native/archive/shared/zip.h
05/30/2007 17:36:30 Patch for HARMONY-3054 "[classlib][archive] EUT intermittently fail in
org.eclipse.jdt.core.tests.compiler.parser.TestAll"
modified apetrenko  /harmony/enhanced/classlib/trunk/modules/luni/src/main/native/include/unix/jclprots.h
05/30/2007 17:36:30 Patch for HARMONY-3054 "[classlib][archive] EUT intermittently fail in
org.eclipse.jdt.core.tests.compiler.parser.TestAll"
modified apetrenko  /harmony/enhanced/classlib/trunk/modules/luni/src/main/native/include/windows/jclprots.h
05/30/2007 17:36:30 Patch for HARMONY-3054 "[classlib][archive] EUT intermittently fail in
org.eclipse.jdt.core.tests.compiler.parser.TestAll"
modified apetrenko  /harmony/enhanced/classlib/trunk/modules/archive/src/main/native/archive/shared/zip.c
05/30/2007 17:36:30 Patch for HARMONY-3054 "[classlib][archive] EUT intermittently fail in
org.eclipse.jdt.core.tests.compiler.parser.TestAll"
modified apetrenko  /harmony/enhanced/classlib/trunk/modules/archive/src/main/java/java/util/zip/ZipFile.java
05/30/2007 17:36:30 Patch for HARMONY-3054 "[classlib][archive] EUT intermittently fail in
org.eclipse.jdt.core.tests.compiler.parser.TestAll"
modified apetrenko  /harmony/enhanced/classlib/trunk/modules/archive/src/main/native/archive/shared/archiveglob.c
05/30/2007 17:36:30 Patch for HARMONY-3054 "[classlib][archive] EUT intermittently fail in
org.eclipse.jdt.core.tests.compiler.parser.TestAll"
modified apetrenko  /harmony/enhanced/classlib/trunk/modules/archive/src/main/native/archive/shared/zip.h
05/30/2007 17:36:30 Patch for HARMONY-3054 "[classlib][archive] EUT intermittently fail in
org.eclipse.jdt.core.tests.compiler.parser.TestAll"
modified apetrenko  /harmony/enhanced/classlib/trunk/modules/luni/src/main/native/include/unix/jclprots.h
05/30/2007 17:36:30 Patch for HARMONY-3054 "[classlib][archive] EUT intermittently fail in
org.eclipse.jdt.core.tests.compiler.parser.TestAll"



Mime
View raw message